jmeter-dev mailing list archives

Site index · List index
Message view « Date » · « Thread »
Top « Date » · « Thread »
From Apache Jenkins Server <jenk...@builds.apache.org>
Subject Build failed in Jenkins: JMeter-trunk #6855
Date Wed, 25 Jul 2018 22:04:36 GMT
See <https://builds.apache.org/job/JMeter-trunk/6855/display/redirect?page=changes>

Changes:

[pmouawad] Bug 61635 - Add a menu to restart JMeter
Avoid duplication
Bugzilla Id: 61635

[pmouawad] Bug 61635 - Add a menu to restart JMeter
Check we can restart
Bugzilla Id: 61635

[pmouawad] Fix sonar warning on ignored exception

[pmouawad] Bug 61635 - Add a menu to restart JMeter
Fix javadoc and sonar warning
Bugzilla Id: 61635

------------------------------------------
[...truncated 234.04 KB...]
batchtest:
     [echo] Starting TestResultStatusAction with file TestResultStatusAction.jmx using -X
-Jdummy=dummy
   [jmeter] SLF4J: Class path contains multiple SLF4J bindings.
   [jmeter] SLF4J: Found binding in [jar:<https://builds.apache.org/job/JMeter-trunk/ws/trunk/lib/log4j-slf4j-impl-2.11.0.jar!/org/slf4j/impl/StaticLoggerBinder.class]>
   [jmeter] SLF4J: Found binding in [jar:<https://builds.apache.org/job/JMeter-trunk/ws/trunk/lib/opt/activemq-all-5.15.2.jar!/org/slf4j/impl/StaticLoggerBinder.class]>
   [jmeter] SLF4J: See http://www.slf4j.org/codes.html#multiple_bindings for an explanation.
   [jmeter] SLF4J: Actual binding is of type [org.apache.logging.slf4j.Log4jLoggerFactory]
   [jmeter] Creating summariser <summary>
   [jmeter] Created the tree successfully using testfiles/TestResultStatusAction.jmx
   [jmeter] Starting the test @ Wed Jul 25 22:04:28 UTC 2018 (1532556268357)
   [jmeter] Waiting for possible Shutdown/StopTestNow/Heapdump message on port 4445
   [jmeter] summary =    135 in 00:00:01 =  191.2/s Avg:     0 Min:     0 Max:    44 Err:
   18 (13.33%)
   [jmeter] Tidying up ...    @ Wed Jul 25 22:04:29 UTC 2018 (1532556269951)
   [jmeter] ... end of run
     [echo] TestResultStatusAction output files compared OK

batchtest:
     [echo] Starting TestRedirectionPolicies with file TestRedirectionPolicies.jmx using -X
-Jdummy=dummy
   [jmeter] SLF4J: Class path contains multiple SLF4J bindings.
   [jmeter] SLF4J: Found binding in [jar:<https://builds.apache.org/job/JMeter-trunk/ws/trunk/lib/log4j-slf4j-impl-2.11.0.jar!/org/slf4j/impl/StaticLoggerBinder.class]>
   [jmeter] SLF4J: Found binding in [jar:<https://builds.apache.org/job/JMeter-trunk/ws/trunk/lib/opt/activemq-all-5.15.2.jar!/org/slf4j/impl/StaticLoggerBinder.class]>
   [jmeter] SLF4J: See http://www.slf4j.org/codes.html#multiple_bindings for an explanation.
   [jmeter] SLF4J: Actual binding is of type [org.apache.logging.slf4j.Log4jLoggerFactory]
   [jmeter] Creating summariser <summary>
   [jmeter] Created the tree successfully using testfiles/TestRedirectionPolicies.jmx
   [jmeter] Starting the test @ Wed Jul 25 22:04:32 UTC 2018 (1532556272208)
   [jmeter] Waiting for possible Shutdown/StopTestNow/Heapdump message on port 4445
   [jmeter] summary +      1 in 00:00:01 =    1.0/s Avg:   276 Min:   276 Max:   276 Err:
    0 (0.00%) Active: 1 Started: 1 Finished: 0
   [jmeter] summary +      5 in 00:00:01 =    6.4/s Avg:   144 Min:    91 Max:   199 Err:
    0 (0.00%) Active: 0 Started: 2 Finished: 2
   [jmeter] summary =      6 in 00:00:02 =    3.4/s Avg:   166 Min:    91 Max:   276 Err:
    0 (0.00%)
   [jmeter] Tidying up ...    @ Wed Jul 25 22:04:34 UTC 2018 (1532556274806)
   [jmeter] ... end of run

BUILD FAILED
<https://builds.apache.org/job/JMeter-trunk/ws/trunk/build.xml>:2831: The following
error occurred while executing this line:
<https://builds.apache.org/job/JMeter-trunk/ws/trunk/build.xml>:2795: XML Files are
not identical.
        <https://builds.apache.org/job/JMeter-trunk/ws/trunk/bin/testfiles/TestRedirectionPolicies.xml>
        <?xml version="1.0" encoding="UTF-8"?>
<testResults version="1.2">
<httpSample s="true" lb="HR_AutoRedirect" rc="200" rm="OK" dt="text">
  <assertionResult>
    <name>RA_200</name>
    <failure>false</failure>
    <error>false</error>
  </assertionResult>
  <assertionResult>
    <name>JSA_0SR</name>
    <failure>false</failure>
    <error>false</error>
  </assertionResult>
  <assertionResult>
    <name>RA_Redirected</name>
    <failure>false</failure>
    <error>false</error>
  </assertionResult>
</httpSample>
<httpSample s="true" lb="HR_NoAutoRedirect" rc="302" rm="FOUND" dt="text">
  <assertionResult>
    <name>RA_302</name>
    <failure>false</failure>
    <error>false</error>
  </assertionResult>
  <assertionResult>
    <name>JSA_0SR</name>
    <failure>false</failure>
    <error>false</error>
  </assertionResult>
</httpSample>
<httpSample s="true" lb="HR_FollowRedirect" rc="200" rm="OK" dt="text">
  <assertionResult>
    <name>RA_200</name>
    <failure>false</failure>
    <error>false</error>
  </assertionResult>
  <assertionResult>
    <name>JSA_2SR</name>
    <failure>false</failure>
    <error>false</error>
  </assertionResult>
  <assertionResult>
    <name>RA_Redirected</name>
    <failure>false</failure>
    <error>false</error>
  </assertionResult>
  <httpSample s="true" lb="http://httpbin.org/redirect/1" rc="302" rm="FOUND" dt="text"/>
  <httpSample s="true" lb="http://httpbin.org/get" rc="200" rm="OK" dt="text"/>
</httpSample>
<httpSample s="true" lb="HR_NoAutoRedirect" rc="302" rm="FOUND" dt="text">
  <assertionResult>
    <name>RA_302</name>
    <failure>false</failure>
    <error>false</error>
  </assertionResult>
  <assertionResult>
    <name>JSA_0SR</name>
    <failure>false</failure>
    <error>false</error>
  </assertionResult>
</httpSample>
<httpSample s="true" lb="HR_FollowRedirect" rc="200" rm="OK" dt="text">
  <assertionResult>
    <name>RA_200</name>
    <failure>false</failure>
    <error>false</error>
  </assertionResult>
  <assertionResult>
    <name>JSA_2SR</name>
    <failure>false</failure>
    <error>false</error>
  </assertionResult>
  <assertionResult>
    <name>RA_Redirected</name>
    <failure>false</failure>
    <error>false</error>
  </assertionResult>
  <httpSample s="true" lb="http://httpbin.org/redirect/1" rc="302" rm="FOUND" dt="text"/>
  <httpSample s="true" lb="http://httpbin.org/get" rc="200" rm="OK" dt="text"/>
</httpSample>
<httpSample s="true" lb="HR_AutoRedirect" rc="200" rm="OK" dt="text">
  <assertionResult>
    <name>RA_200</name>
    <failure>false</failure>
    <error>false</error>
  </assertionResult>
  <assertionResult>
    <name>JSA_0SR</name>
    <failure>false</failure>
    <error>false</error>
  </assertionResult>
  <assertionResult>
    <name>RA_Redirected</name>
    <failure>false</failure>
    <error>false</error>
  </assertionResult>
</httpSample>

</testResults>

        <https://builds.apache.org/job/JMeter-trunk/ws/trunk/bin/TestRedirectionPolicies.xml>
        <?xml version="1.0" encoding="UTF-8"?>
<testResults version="1.2">
<httpSample s="true" lb="HR_AutoRedirect" rc="200" rm="OK" dt="text">
  <assertionResult>
    <name>RA_200</name>
    <failure>false</failure>
    <error>false</error>
  </assertionResult>
  <assertionResult>
    <name>JSA_0SR</name>
    <failure>false</failure>
    <error>false</error>
  </assertionResult>
  <assertionResult>
    <name>RA_Redirected</name>
    <failure>false</failure>
    <error>false</error>
  </assertionResult>
</httpSample>
<httpSample s="true" lb="HR_NoAutoRedirect" rc="302" rm="FOUND" dt="text">
  <assertionResult>
    <name>RA_302</name>
    <failure>false</failure>
    <error>false</error>
  </assertionResult>
  <assertionResult>
    <name>JSA_0SR</name>
    <failure>false</failure>
    <error>false</error>
  </assertionResult>
</httpSample>
<httpSample s="true" lb="HR_FollowRedirect" rc="200" rm="OK" dt="text">
  <assertionResult>
    <name>RA_200</name>
    <failure>false</failure>
    <error>false</error>
  </assertionResult>
  <assertionResult>
    <name>JSA_2SR</name>
    <failure>false</failure>
    <error>false</error>
  </assertionResult>
  <assertionResult>
    <name>RA_Redirected</name>
    <failure>false</failure>
    <error>false</error>
  </assertionResult>
  <httpSample s="true" lb="HR_FollowRedirect-0" rc="302" rm="FOUND" dt="text"/>
  <httpSample s="true" lb="HR_FollowRedirect-1" rc="200" rm="OK" dt="text"/>
</httpSample>
<httpSample s="true" lb="HR_NoAutoRedirect" rc="302" rm="FOUND" dt="text">
  <assertionResult>
    <name>RA_302</name>
    <failure>false</failure>
    <error>false</error>
  </assertionResult>
  <assertionResult>
    <name>JSA_0SR</name>
    <failure>false</failure>
    <error>false</error>
  </assertionResult>
</httpSample>
<httpSample s="true" lb="HR_FollowRedirect" rc="200" rm="OK" dt="text">
  <assertionResult>
    <name>RA_200</name>
    <failure>false</failure>
    <error>false</error>
  </assertionResult>
  <assertionResult>
    <name>JSA_2SR</name>
    <failure>false</failure>
    <error>false</error>
  </assertionResult>
  <assertionResult>
    <name>RA_Redirected</name>
    <failure>false</failure>
    <error>false</error>
  </assertionResult>
  <httpSample s="true" lb="HR_FollowRedirect-0" rc="302" rm="FOUND" dt="text"/>
  <httpSample s="true" lb="HR_FollowRedirect-1" rc="200" rm="OK" dt="text"/>
</httpSample>
<httpSample s="true" lb="HR_AutoRedirect" rc="200" rm="OK" dt="text">
  <assertionResult>
    <name>RA_200</name>
    <failure>false</failure>
    <error>false</error>
  </assertionResult>
  <assertionResult>
    <name>JSA_0SR</name>
    <failure>false</failure>
    <error>false</error>
  </assertionResult>
  <assertionResult>
    <name>RA_Redirected</name>
    <failure>false</failure>
    <error>false</error>
  </assertionResult>
</httpSample>

</testResults>

Total time: 4 minutes 32 seconds
Build step 'Invoke Ant' marked build as failure
[locks-and-latches] Releasing all the locks
[locks-and-latches] All the locks released
Archiving artifacts
Recording test results
ERROR: Step ?Publish JUnit test result report? failed: Test reports were found but none of
them are new. Did leafNodes run? 
For example, <https://builds.apache.org/job/JMeter-trunk/ws/trunk/reports/TEST-org.apache.commons.cli.avalon.ClutilTestCase.xml>
is 5 mo 29 days old


Mime
View raw message