jmeter-dev mailing list archives

Site index · List index
Message view « Date » · « Thread »
Top « Date » · « Thread »
From Apache Jenkins Server <jenk...@builds.apache.org>
Subject Build failed in Jenkins: JMeter-trunk #6856
Date Thu, 26 Jul 2018 20:02:10 GMT
See <https://builds.apache.org/job/JMeter-trunk/6856/display/redirect?page=changes>

Changes:

[fschumacher] Revert r1836664

Bug 62570 - HTTP(S) Test Script Recorder : Increase validity of Root CA used to capture traffic
Bugzilla Id: 62570

------------------------------------------
[...truncated 173.46 KB...]
batchtest:
     [echo] Starting TestResultStatusAction with file TestResultStatusAction.jmx using -X
-Jdummy=dummy
   [jmeter] SLF4J: Class path contains multiple SLF4J bindings.
   [jmeter] SLF4J: Found binding in [jar:<https://builds.apache.org/job/JMeter-trunk/ws/trunk/lib/log4j-slf4j-impl-2.11.0.jar!/org/slf4j/impl/StaticLoggerBinder.class]>
   [jmeter] SLF4J: Found binding in [jar:<https://builds.apache.org/job/JMeter-trunk/ws/trunk/lib/opt/activemq-all-5.15.2.jar!/org/slf4j/impl/StaticLoggerBinder.class]>
   [jmeter] SLF4J: See http://www.slf4j.org/codes.html#multiple_bindings for an explanation.
   [jmeter] SLF4J: Actual binding is of type [org.apache.logging.slf4j.Log4jLoggerFactory]
   [jmeter] Creating summariser <summary>
   [jmeter] Created the tree successfully using testfiles/TestResultStatusAction.jmx
   [jmeter] Starting the test @ Thu Jul 26 20:02:01 UTC 2018 (1532635321284)
   [jmeter] Waiting for possible Shutdown/StopTestNow/Heapdump message on port 4445
   [jmeter] summary +      1 in 00:00:01 =    1.5/s Avg:     2 Min:     2 Max:     2 Err:
    0 (0.00%) Active: 1 Started: 1 Finished: 0
   [jmeter] summary +    134 in 00:00:00 =  690.7/s Avg:     0 Min:     0 Max:    55 Err:
   18 (13.43%) Active: 0 Started: 4 Finished: 4
   [jmeter] summary =    135 in 00:00:01 =  160.0/s Avg:     0 Min:     0 Max:    55 Err:
   18 (13.33%)
   [jmeter] Tidying up ...    @ Thu Jul 26 20:02:03 UTC 2018 (1532635323004)
   [jmeter] ... end of run
     [echo] TestResultStatusAction output files compared OK

batchtest:
     [echo] Starting TestRedirectionPolicies with file TestRedirectionPolicies.jmx using -X
-Jdummy=dummy
   [jmeter] SLF4J: Class path contains multiple SLF4J bindings.
   [jmeter] SLF4J: Found binding in [jar:<https://builds.apache.org/job/JMeter-trunk/ws/trunk/lib/log4j-slf4j-impl-2.11.0.jar!/org/slf4j/impl/StaticLoggerBinder.class]>
   [jmeter] SLF4J: Found binding in [jar:<https://builds.apache.org/job/JMeter-trunk/ws/trunk/lib/opt/activemq-all-5.15.2.jar!/org/slf4j/impl/StaticLoggerBinder.class]>
   [jmeter] SLF4J: See http://www.slf4j.org/codes.html#multiple_bindings for an explanation.
   [jmeter] SLF4J: Actual binding is of type [org.apache.logging.slf4j.Log4jLoggerFactory]
   [jmeter] Creating summariser <summary>
   [jmeter] Created the tree successfully using testfiles/TestRedirectionPolicies.jmx
   [jmeter] Starting the test @ Thu Jul 26 20:02:05 UTC 2018 (1532635325628)
   [jmeter] Waiting for possible Shutdown/StopTestNow/Heapdump message on port 4445
   [jmeter] summary =      6 in 00:00:02 =    2.9/s Avg:   202 Min:    76 Max:   312 Err:
    0 (0.00%)
   [jmeter] Tidying up ...    @ Thu Jul 26 20:02:08 UTC 2018 (1532635328667)
   [jmeter] ... end of run

BUILD FAILED
<https://builds.apache.org/job/JMeter-trunk/ws/trunk/build.xml>:2831: The following
error occurred while executing this line:
<https://builds.apache.org/job/JMeter-trunk/ws/trunk/build.xml>:2795: XML Files are
not identical.
        <https://builds.apache.org/job/JMeter-trunk/ws/trunk/bin/testfiles/TestRedirectionPolicies.xml>
        <?xml version="1.0" encoding="UTF-8"?>
<testResults version="1.2">
<httpSample s="true" lb="HR_AutoRedirect" rc="200" rm="OK" dt="text">
  <assertionResult>
    <name>RA_200</name>
    <failure>false</failure>
    <error>false</error>
  </assertionResult>
  <assertionResult>
    <name>JSA_0SR</name>
    <failure>false</failure>
    <error>false</error>
  </assertionResult>
  <assertionResult>
    <name>RA_Redirected</name>
    <failure>false</failure>
    <error>false</error>
  </assertionResult>
</httpSample>
<httpSample s="true" lb="HR_NoAutoRedirect" rc="302" rm="FOUND" dt="text">
  <assertionResult>
    <name>RA_302</name>
    <failure>false</failure>
    <error>false</error>
  </assertionResult>
  <assertionResult>
    <name>JSA_0SR</name>
    <failure>false</failure>
    <error>false</error>
  </assertionResult>
</httpSample>
<httpSample s="true" lb="HR_FollowRedirect" rc="200" rm="OK" dt="text">
  <assertionResult>
    <name>RA_200</name>
    <failure>false</failure>
    <error>false</error>
  </assertionResult>
  <assertionResult>
    <name>JSA_2SR</name>
    <failure>false</failure>
    <error>false</error>
  </assertionResult>
  <assertionResult>
    <name>RA_Redirected</name>
    <failure>false</failure>
    <error>false</error>
  </assertionResult>
  <httpSample s="true" lb="http://httpbin.org/redirect/1" rc="302" rm="FOUND" dt="text"/>
  <httpSample s="true" lb="http://httpbin.org/get" rc="200" rm="OK" dt="text"/>
</httpSample>
<httpSample s="true" lb="HR_NoAutoRedirect" rc="302" rm="FOUND" dt="text">
  <assertionResult>
    <name>RA_302</name>
    <failure>false</failure>
    <error>false</error>
  </assertionResult>
  <assertionResult>
    <name>JSA_0SR</name>
    <failure>false</failure>
    <error>false</error>
  </assertionResult>
</httpSample>
<httpSample s="true" lb="HR_FollowRedirect" rc="200" rm="OK" dt="text">
  <assertionResult>
    <name>RA_200</name>
    <failure>false</failure>
    <error>false</error>
  </assertionResult>
  <assertionResult>
    <name>JSA_2SR</name>
    <failure>false</failure>
    <error>false</error>
  </assertionResult>
  <assertionResult>
    <name>RA_Redirected</name>
    <failure>false</failure>
    <error>false</error>
  </assertionResult>
  <httpSample s="true" lb="http://httpbin.org/redirect/1" rc="302" rm="FOUND" dt="text"/>
  <httpSample s="true" lb="http://httpbin.org/get" rc="200" rm="OK" dt="text"/>
</httpSample>
<httpSample s="true" lb="HR_AutoRedirect" rc="200" rm="OK" dt="text">
  <assertionResult>
    <name>RA_200</name>
    <failure>false</failure>
    <error>false</error>
  </assertionResult>
  <assertionResult>
    <name>JSA_0SR</name>
    <failure>false</failure>
    <error>false</error>
  </assertionResult>
  <assertionResult>
    <name>RA_Redirected</name>
    <failure>false</failure>
    <error>false</error>
  </assertionResult>
</httpSample>

</testResults>

        <https://builds.apache.org/job/JMeter-trunk/ws/trunk/bin/TestRedirectionPolicies.xml>
        <?xml version="1.0" encoding="UTF-8"?>
<testResults version="1.2">
<httpSample s="true" lb="HR_AutoRedirect" rc="200" rm="OK" dt="text">
  <assertionResult>
    <name>RA_200</name>
    <failure>false</failure>
    <error>false</error>
  </assertionResult>
  <assertionResult>
    <name>JSA_0SR</name>
    <failure>false</failure>
    <error>false</error>
  </assertionResult>
  <assertionResult>
    <name>RA_Redirected</name>
    <failure>false</failure>
    <error>false</error>
  </assertionResult>
</httpSample>
<httpSample s="true" lb="HR_NoAutoRedirect" rc="302" rm="FOUND" dt="text">
  <assertionResult>
    <name>RA_302</name>
    <failure>false</failure>
    <error>false</error>
  </assertionResult>
  <assertionResult>
    <name>JSA_0SR</name>
    <failure>false</failure>
    <error>false</error>
  </assertionResult>
</httpSample>
<httpSample s="true" lb="HR_FollowRedirect" rc="200" rm="OK" dt="text">
  <assertionResult>
    <name>RA_200</name>
    <failure>false</failure>
    <error>false</error>
  </assertionResult>
  <assertionResult>
    <name>JSA_2SR</name>
    <failure>false</failure>
    <error>false</error>
  </assertionResult>
  <assertionResult>
    <name>RA_Redirected</name>
    <failure>false</failure>
    <error>false</error>
  </assertionResult>
  <httpSample s="true" lb="HR_FollowRedirect-0" rc="302" rm="FOUND" dt="text"/>
  <httpSample s="true" lb="HR_FollowRedirect-1" rc="200" rm="OK" dt="text"/>
</httpSample>
<httpSample s="true" lb="HR_NoAutoRedirect" rc="302" rm="FOUND" dt="text">
  <assertionResult>
    <name>RA_302</name>
    <failure>false</failure>
    <error>false</error>
  </assertionResult>
  <assertionResult>
    <name>JSA_0SR</name>
    <failure>false</failure>
    <error>false</error>
  </assertionResult>
</httpSample>
<httpSample s="true" lb="HR_FollowRedirect" rc="200" rm="OK" dt="text">
  <assertionResult>
    <name>RA_200</name>
    <failure>false</failure>
    <error>false</error>
  </assertionResult>
  <assertionResult>
    <name>JSA_2SR</name>
    <failure>false</failure>
    <error>false</error>
  </assertionResult>
  <assertionResult>
    <name>RA_Redirected</name>
    <failure>false</failure>
    <error>false</error>
  </assertionResult>
  <httpSample s="true" lb="HR_FollowRedirect-0" rc="302" rm="FOUND" dt="text"/>
  <httpSample s="true" lb="HR_FollowRedirect-1" rc="200" rm="OK" dt="text"/>
</httpSample>
<httpSample s="true" lb="HR_AutoRedirect" rc="200" rm="OK" dt="text">
  <assertionResult>
    <name>RA_200</name>
    <failure>false</failure>
    <error>false</error>
  </assertionResult>
  <assertionResult>
    <name>JSA_0SR</name>
    <failure>false</failure>
    <error>false</error>
  </assertionResult>
  <assertionResult>
    <name>RA_Redirected</name>
    <failure>false</failure>
    <error>false</error>
  </assertionResult>
</httpSample>

</testResults>

Total time: 4 minutes 39 seconds
Build step 'Invoke Ant' marked build as failure
[locks-and-latches] Releasing all the locks
[locks-and-latches] All the locks released
Archiving artifacts
Recording test results
ERROR: Step ?Publish JUnit test result report? failed: Test reports were found but none of
them are new. Did leafNodes run? 
For example, <https://builds.apache.org/job/JMeter-trunk/ws/trunk/reports/TEST-org.apache.commons.cli.avalon.ClutilTestCase.xml>
is 10 days old


Mime
View raw message