jmeter-dev mailing list archives

Site index · List index
Message view « Date » · « Thread »
Top « Date » · « Thread »
From Apache Jenkins Server <jenk...@builds.apache.org>
Subject Build failed in Jenkins: JMeter-trunk #6854
Date Wed, 25 Jul 2018 20:32:19 GMT
See <https://builds.apache.org/job/JMeter-trunk/6854/display/redirect?page=changes>

Changes:

[pmouawad] Bug 62550 - Modify SubResult Naming Policy
This also fixed Bug 60917 - Load Test with embedded resources download : Hits per seconds
does not take into account the downloaded resources
Bugzilla Id: 62550

[pmouawad] Bug 62570 - HTTP(S) Test Script Recorder : Increase validity of Root CA used to
capture traffic
Bugzilla Id: 62570

------------------------------------------
[...truncated 185.24 KB...]
batch_scripts:

batchtest:
     [echo] Starting TestResultStatusAction with file TestResultStatusAction.jmx using -X
-Jdummy=dummy
   [jmeter] SLF4J: Class path contains multiple SLF4J bindings.
   [jmeter] SLF4J: Found binding in [jar:<https://builds.apache.org/job/JMeter-trunk/ws/trunk/lib/log4j-slf4j-impl-2.11.0.jar!/org/slf4j/impl/StaticLoggerBinder.class]>
   [jmeter] SLF4J: Found binding in [jar:<https://builds.apache.org/job/JMeter-trunk/ws/trunk/lib/opt/activemq-all-5.15.2.jar!/org/slf4j/impl/StaticLoggerBinder.class]>
   [jmeter] SLF4J: See http://www.slf4j.org/codes.html#multiple_bindings for an explanation.
   [jmeter] SLF4J: Actual binding is of type [org.apache.logging.slf4j.Log4jLoggerFactory]
   [jmeter] Creating summariser <summary>
   [jmeter] Created the tree successfully using testfiles/TestResultStatusAction.jmx
   [jmeter] Starting the test @ Wed Jul 25 20:32:09 UTC 2018 (1532550729858)
   [jmeter] Waiting for possible Shutdown/StopTestNow/Heapdump message on port 4445
   [jmeter] summary =    135 in 00:00:01 =  170.9/s Avg:     0 Min:     0 Max:    32 Err:
   18 (13.33%)
   [jmeter] Tidying up ...    @ Wed Jul 25 20:32:11 UTC 2018 (1532550731705)
   [jmeter] ... end of run
     [echo] TestResultStatusAction output files compared OK

batchtest:
     [echo] Starting TestRedirectionPolicies with file TestRedirectionPolicies.jmx using -X
-Jdummy=dummy
   [jmeter] SLF4J: Class path contains multiple SLF4J bindings.
   [jmeter] SLF4J: Found binding in [jar:<https://builds.apache.org/job/JMeter-trunk/ws/trunk/lib/log4j-slf4j-impl-2.11.0.jar!/org/slf4j/impl/StaticLoggerBinder.class]>
   [jmeter] SLF4J: Found binding in [jar:<https://builds.apache.org/job/JMeter-trunk/ws/trunk/lib/opt/activemq-all-5.15.2.jar!/org/slf4j/impl/StaticLoggerBinder.class]>
   [jmeter] SLF4J: See http://www.slf4j.org/codes.html#multiple_bindings for an explanation.
   [jmeter] SLF4J: Actual binding is of type [org.apache.logging.slf4j.Log4jLoggerFactory]
   [jmeter] Creating summariser <summary>
   [jmeter] Created the tree successfully using testfiles/TestRedirectionPolicies.jmx
   [jmeter] Starting the test @ Wed Jul 25 20:32:14 UTC 2018 (1532550734960)
   [jmeter] Waiting for possible Shutdown/StopTestNow/Heapdump message on port 4445
   [jmeter] summary =      6 in 00:00:02 =    2.5/s Avg:   256 Min:   127 Max:   424 Err:
    0 (0.00%)
   [jmeter] Tidying up ...    @ Wed Jul 25 20:32:18 UTC 2018 (1532550738300)
   [jmeter] ... end of run

BUILD FAILED
<https://builds.apache.org/job/JMeter-trunk/ws/trunk/build.xml>:2831: The following
error occurred while executing this line:
<https://builds.apache.org/job/JMeter-trunk/ws/trunk/build.xml>:2795: XML Files are
not identical.
        <https://builds.apache.org/job/JMeter-trunk/ws/trunk/bin/testfiles/TestRedirectionPolicies.xml>
        <?xml version="1.0" encoding="UTF-8"?>
<testResults version="1.2">
<httpSample s="true" lb="HR_AutoRedirect" rc="200" rm="OK" dt="text">
  <assertionResult>
    <name>RA_200</name>
    <failure>false</failure>
    <error>false</error>
  </assertionResult>
  <assertionResult>
    <name>JSA_0SR</name>
    <failure>false</failure>
    <error>false</error>
  </assertionResult>
  <assertionResult>
    <name>RA_Redirected</name>
    <failure>false</failure>
    <error>false</error>
  </assertionResult>
</httpSample>
<httpSample s="true" lb="HR_NoAutoRedirect" rc="302" rm="FOUND" dt="text">
  <assertionResult>
    <name>RA_302</name>
    <failure>false</failure>
    <error>false</error>
  </assertionResult>
  <assertionResult>
    <name>JSA_0SR</name>
    <failure>false</failure>
    <error>false</error>
  </assertionResult>
</httpSample>
<httpSample s="true" lb="HR_FollowRedirect" rc="200" rm="OK" dt="text">
  <assertionResult>
    <name>RA_200</name>
    <failure>false</failure>
    <error>false</error>
  </assertionResult>
  <assertionResult>
    <name>JSA_2SR</name>
    <failure>false</failure>
    <error>false</error>
  </assertionResult>
  <assertionResult>
    <name>RA_Redirected</name>
    <failure>false</failure>
    <error>false</error>
  </assertionResult>
  <httpSample s="true" lb="http://httpbin.org/redirect/1" rc="302" rm="FOUND" dt="text"/>
  <httpSample s="true" lb="http://httpbin.org/get" rc="200" rm="OK" dt="text"/>
</httpSample>
<httpSample s="true" lb="HR_NoAutoRedirect" rc="302" rm="FOUND" dt="text">
  <assertionResult>
    <name>RA_302</name>
    <failure>false</failure>
    <error>false</error>
  </assertionResult>
  <assertionResult>
    <name>JSA_0SR</name>
    <failure>false</failure>
    <error>false</error>
  </assertionResult>
</httpSample>
<httpSample s="true" lb="HR_FollowRedirect" rc="200" rm="OK" dt="text">
  <assertionResult>
    <name>RA_200</name>
    <failure>false</failure>
    <error>false</error>
  </assertionResult>
  <assertionResult>
    <name>JSA_2SR</name>
    <failure>false</failure>
    <error>false</error>
  </assertionResult>
  <assertionResult>
    <name>RA_Redirected</name>
    <failure>false</failure>
    <error>false</error>
  </assertionResult>
  <httpSample s="true" lb="http://httpbin.org/redirect/1" rc="302" rm="FOUND" dt="text"/>
  <httpSample s="true" lb="http://httpbin.org/get" rc="200" rm="OK" dt="text"/>
</httpSample>
<httpSample s="true" lb="HR_AutoRedirect" rc="200" rm="OK" dt="text">
  <assertionResult>
    <name>RA_200</name>
    <failure>false</failure>
    <error>false</error>
  </assertionResult>
  <assertionResult>
    <name>JSA_0SR</name>
    <failure>false</failure>
    <error>false</error>
  </assertionResult>
  <assertionResult>
    <name>RA_Redirected</name>
    <failure>false</failure>
    <error>false</error>
  </assertionResult>
</httpSample>

</testResults>

        <https://builds.apache.org/job/JMeter-trunk/ws/trunk/bin/TestRedirectionPolicies.xml>
        <?xml version="1.0" encoding="UTF-8"?>
<testResults version="1.2">
<httpSample s="true" lb="HR_AutoRedirect" rc="200" rm="OK" dt="text">
  <assertionResult>
    <name>RA_200</name>
    <failure>false</failure>
    <error>false</error>
  </assertionResult>
  <assertionResult>
    <name>JSA_0SR</name>
    <failure>false</failure>
    <error>false</error>
  </assertionResult>
  <assertionResult>
    <name>RA_Redirected</name>
    <failure>false</failure>
    <error>false</error>
  </assertionResult>
</httpSample>
<httpSample s="true" lb="HR_NoAutoRedirect" rc="302" rm="FOUND" dt="text">
  <assertionResult>
    <name>RA_302</name>
    <failure>false</failure>
    <error>false</error>
  </assertionResult>
  <assertionResult>
    <name>JSA_0SR</name>
    <failure>false</failure>
    <error>false</error>
  </assertionResult>
</httpSample>
<httpSample s="true" lb="HR_FollowRedirect" rc="200" rm="OK" dt="text">
  <assertionResult>
    <name>RA_200</name>
    <failure>false</failure>
    <error>false</error>
  </assertionResult>
  <assertionResult>
    <name>JSA_2SR</name>
    <failure>false</failure>
    <error>false</error>
  </assertionResult>
  <assertionResult>
    <name>RA_Redirected</name>
    <failure>false</failure>
    <error>false</error>
  </assertionResult>
  <httpSample s="true" lb="HR_FollowRedirect-0" rc="302" rm="FOUND" dt="text"/>
  <httpSample s="true" lb="HR_FollowRedirect-1" rc="200" rm="OK" dt="text"/>
</httpSample>
<httpSample s="true" lb="HR_NoAutoRedirect" rc="302" rm="FOUND" dt="text">
  <assertionResult>
    <name>RA_302</name>
    <failure>false</failure>
    <error>false</error>
  </assertionResult>
  <assertionResult>
    <name>JSA_0SR</name>
    <failure>false</failure>
    <error>false</error>
  </assertionResult>
</httpSample>
<httpSample s="true" lb="HR_FollowRedirect" rc="200" rm="OK" dt="text">
  <assertionResult>
    <name>RA_200</name>
    <failure>false</failure>
    <error>false</error>
  </assertionResult>
  <assertionResult>
    <name>JSA_2SR</name>
    <failure>false</failure>
    <error>false</error>
  </assertionResult>
  <assertionResult>
    <name>RA_Redirected</name>
    <failure>false</failure>
    <error>false</error>
  </assertionResult>
  <httpSample s="true" lb="HR_FollowRedirect-0" rc="302" rm="FOUND" dt="text"/>
  <httpSample s="true" lb="HR_FollowRedirect-1" rc="200" rm="OK" dt="text"/>
</httpSample>
<httpSample s="true" lb="HR_AutoRedirect" rc="200" rm="OK" dt="text">
  <assertionResult>
    <name>RA_200</name>
    <failure>false</failure>
    <error>false</error>
  </assertionResult>
  <assertionResult>
    <name>JSA_0SR</name>
    <failure>false</failure>
    <error>false</error>
  </assertionResult>
  <assertionResult>
    <name>RA_Redirected</name>
    <failure>false</failure>
    <error>false</error>
  </assertionResult>
</httpSample>

</testResults>

Total time: 4 minutes 59 seconds
Build step 'Invoke Ant' marked build as failure
[locks-and-latches] Releasing all the locks
[locks-and-latches] All the locks released
Archiving artifacts
Recording test results
ERROR: Step ‘Publish JUnit test result report’ failed: Test reports were found but none
of them are new. Did leafNodes run? 
For example, <https://builds.apache.org/job/JMeter-trunk/ws/trunk/reports/TEST-org.apache.commons.cli.avalon.ClutilTestCase.xml>
is 10 days old


Mime
View raw message