jmeter-dev mailing list archives

Site index · List index
Message view « Date » · « Thread »
Top « Date » · « Thread »
From Apache Jenkins Server <jenk...@builds.apache.org>
Subject Build failed in Jenkins: JMeter-trunk #6846
Date Sun, 15 Jul 2018 15:06:44 GMT
See <https://builds.apache.org/job/JMeter-trunk/6846/display/redirect?page=changes>

Changes:

[fschumacher] Set version numbers to currently used ones

[fschumacher] Updated to rhino-1.7.10 (from +rhino-1.7.7.2)

[fschumacher] Updated ph (css and commons) components

Updated to ph-css-6.1.1 (from ph-css-6.0.0)</li>
Updated to ph-commons-9.1.2 (from ph-commons-9.0.0)

[pmouawad] Bug 62367 - HTML Report Generator: Add Graph Total Transactions per Second
Fix empty graph when a jmeter.reportgenerator.exporter.html.series_filter is defined
Bugzilla Id: 62367

------------------------------------------
[...truncated 195.77 KB...]
   [jmeter] ... end of run
     [echo] TEST_HTTPS output files compared OK

batchtest:
     [echo] Starting TestCookieManager with file TestCookieManager.jmx using -X -Jdummy=dummy
   [jmeter] SLF4J: Class path contains multiple SLF4J bindings.
   [jmeter] SLF4J: Found binding in [jar:<https://builds.apache.org/job/JMeter-trunk/ws/trunk/lib/log4j-slf4j-impl-2.11.0.jar!/org/slf4j/impl/StaticLoggerBinder.class]>
   [jmeter] SLF4J: Found binding in [jar:<https://builds.apache.org/job/JMeter-trunk/ws/trunk/lib/opt/activemq-all-5.15.2.jar!/org/slf4j/impl/StaticLoggerBinder.class]>
   [jmeter] SLF4J: See http://www.slf4j.org/codes.html#multiple_bindings for an explanation.
   [jmeter] SLF4J: Actual binding is of type [org.apache.logging.slf4j.Log4jLoggerFactory]
   [jmeter] Creating summariser <summary>
   [jmeter] Created the tree successfully using testfiles/TestCookieManager.jmx
   [jmeter] Starting the test @ Sun Jul 15 15:04:17 UTC 2018 (1531667057927)
   [jmeter] Waiting for possible Shutdown/StopTestNow/Heapdump message on port 4445
   [jmeter] summary =     10 in 00:00:02 =    6.4/s Avg:   106 Min:     2 Max:   584 Err:
    0 (0.00%)
   [jmeter] Tidying up ...    @ Sun Jul 15 15:04:20 UTC 2018 (1531667060805)
   [jmeter] ... end of run
     [echo] TestCookieManager output files compared OK

batchtest:
     [echo] Starting TCP_TESTS with file TCP_TESTS.jmx using -X -Jdummy=dummy
   [jmeter] SLF4J: Class path contains multiple SLF4J bindings.
   [jmeter] SLF4J: Found binding in [jar:<https://builds.apache.org/job/JMeter-trunk/ws/trunk/lib/log4j-slf4j-impl-2.11.0.jar!/org/slf4j/impl/StaticLoggerBinder.class]>
   [jmeter] SLF4J: Found binding in [jar:<https://builds.apache.org/job/JMeter-trunk/ws/trunk/lib/opt/activemq-all-5.15.2.jar!/org/slf4j/impl/StaticLoggerBinder.class]>
   [jmeter] SLF4J: See http://www.slf4j.org/codes.html#multiple_bindings for an explanation.
   [jmeter] SLF4J: Actual binding is of type [org.apache.logging.slf4j.Log4jLoggerFactory]
   [jmeter] Creating summariser <summary>
   [jmeter] Created the tree successfully using testfiles/TCP_TESTS.jmx
   [jmeter] Starting the test @ Sun Jul 15 15:04:25 UTC 2018 (1531667065057)
   [jmeter] Waiting for possible Shutdown/StopTestNow/Heapdump message on port 4445
   [jmeter] 15/07/2018 15:04:29
   [jmeter] 
   [jmeter] 
   [jmeter] summary +      6 in 00:00:04 =    1.3/s Avg:   496 Min:     3 Max:  1024 Err:
    0 (0.00%) Active: 1 Started: 2 Finished: 1
   [jmeter] summary +      5 in 00:00:01 =    5.0/s Avg:   188 Min:     1 Max:   899 Err:
    0 (0.00%) Active: 0 Started: 1 Finished: 1
   [jmeter] summary =     11 in 00:00:05 =    2.0/s Avg:   356 Min:     1 Max:  1024 Err:
    0 (0.00%)
   [jmeter] Tidying up ...    @ Sun Jul 15 15:04:31 UTC 2018 (1531667071761)
   [jmeter] ... end of run
   [concat] 2018-07-15 15:04:29,648 ERROR o.a.j.p.t.s.TCPSampler: 
   [concat] org.apache.jmeter.protocol.tcp.sampler.ReadException: Error reading from server,
bytes read: 0
   [concat] 	at org.apache.jmeter.protocol.tcp.sampler.TCPClientImpl.read(TCPClientImpl.java:131)
~[ApacheJMeter_tcp.jar:r1835982]
   [concat] 	at org.apache.jmeter.protocol.tcp.sampler.TCPSampler.sample(TCPSampler.java:402)
[ApacheJMeter_tcp.jar:r1835982]
   [concat] 	at org.apache.jmeter.threads.JMeterThread.doSampling(JMeterThread.java:622) [ApacheJMeter_core.jar:r1835982]
   [concat] 	at org.apache.jmeter.threads.JMeterThread.executeSamplePackage(JMeterThread.java:546)
[ApacheJMeter_core.jar:r1835982]
   [concat] 	at org.apache.jmeter.threads.JMeterThread.processSampler(JMeterThread.java:486)
[ApacheJMeter_core.jar:r1835982]
   [concat] 	at org.apache.jmeter.threads.JMeterThread.run(JMeterThread.java:253) [ApacheJMeter_core.jar:r1835982]
   [concat] 	at java.lang.Thread.run(Thread.java:748) [?:1.8.0_172]
   [concat] Caused by: java.net.SocketTimeoutException: Read timed out
   [concat] 	at java.net.SocketInputStream.socketRead0(Native Method) ~[?:1.8.0_172]
   [concat] 	at java.net.SocketInputStream.socketRead(SocketInputStream.java:116) ~[?:1.8.0_172]
   [concat] 	at java.net.SocketInputStream.read(SocketInputStream.java:171) ~[?:1.8.0_172]
   [concat] 	at java.net.SocketInputStream.read(SocketInputStream.java:141) ~[?:1.8.0_172]
   [concat] 	at java.net.SocketInputStream.read(SocketInputStream.java:127) ~[?:1.8.0_172]
   [concat] 	at org.apache.jmeter.protocol.tcp.sampler.TCPClientImpl.read(TCPClientImpl.java:114)
~[ApacheJMeter_tcp.jar:r1835982]
   [concat] 	... 6 more
   [concat] 2018-07-15 15:04:30,747 ERROR o.a.j.p.t.s.TCPSampler: 
   [concat] org.apache.jmeter.protocol.tcp.sampler.ReadException: 
   [concat] 	at org.apache.jmeter.protocol.tcp.sampler.BinaryTCPClientImpl.read(BinaryTCPClientImpl.java:152)
~[ApacheJMeter_tcp.jar:r1835982]
   [concat] 	at org.apache.jmeter.protocol.tcp.sampler.TCPSampler.sample(TCPSampler.java:402)
[ApacheJMeter_tcp.jar:r1835982]
   [concat] 	at org.apache.jmeter.threads.JMeterThread.doSampling(JMeterThread.java:622) [ApacheJMeter_core.jar:r1835982]
   [concat] 	at org.apache.jmeter.threads.JMeterThread.executeSamplePackage(JMeterThread.java:546)
[ApacheJMeter_core.jar:r1835982]
   [concat] 	at org.apache.jmeter.threads.JMeterThread.processSampler(JMeterThread.java:486)
[ApacheJMeter_core.jar:r1835982]
   [concat] 	at org.apache.jmeter.threads.JMeterThread.run(JMeterThread.java:253) [ApacheJMeter_core.jar:r1835982]
   [concat] 	at java.lang.Thread.run(Thread.java:748) [?:1.8.0_172]
   [concat] Caused by: java.net.SocketTimeoutException: Read timed out
   [concat] 	at java.net.SocketInputStream.socketRead0(Native Method) ~[?:1.8.0_172]
   [concat] 	at java.net.SocketInputStream.socketRead(SocketInputStream.java:116) ~[?:1.8.0_172]
   [concat] 	at java.net.SocketInputStream.read(SocketInputStream.java:171) ~[?:1.8.0_172]
   [concat] 	at java.net.SocketInputStream.read(SocketInputStream.java:141) ~[?:1.8.0_172]
   [concat] 	at java.net.SocketInputStream.read(SocketInputStream.java:127) ~[?:1.8.0_172]
   [concat] 	at org.apache.jmeter.protocol.tcp.sampler.BinaryTCPClientImpl.read(BinaryTCPClientImpl.java:134)
~[ApacheJMeter_tcp.jar:r1835982]
   [concat] 	... 6 more
   [concat] 2018-07-15 15:04:30,767 WARN o.a.j.p.t.s.TCPSampler: Could not create socket for
tcp://localhost:2223
   [concat] java.net.ConnectException: Connection refused (Connection refused)
   [concat] 	at java.net.PlainSocketImpl.socketConnect(Native Method) ~[?:1.8.0_172]
   [concat] 	at java.net.AbstractPlainSocketImpl.doConnect(AbstractPlainSocketImpl.java:350)
~[?:1.8.0_172]
   [concat] 	at java.net.AbstractPlainSocketImpl.connectToAddress(AbstractPlainSocketImpl.java:206)
~[?:1.8.0_172]
   [concat] 	at java.net.AbstractPlainSocketImpl.connect(AbstractPlainSocketImpl.java:188)
~[?:1.8.0_172]
   [concat] 	at java.net.SocksSocketImpl.connect(SocksSocketImpl.java:392) ~[?:1.8.0_172]
   [concat] 	at java.net.Socket.connect(Socket.java:589) ~[?:1.8.0_172]
   [concat] 	at org.apache.jmeter.protocol.tcp.sampler.TCPSampler.getSocket(TCPSampler.java:168)
[ApacheJMeter_tcp.jar:r1835982]
   [concat] 	at org.apache.jmeter.protocol.tcp.sampler.TCPSampler.sample(TCPSampler.java:384)
[ApacheJMeter_tcp.jar:r1835982]
   [concat] 	at org.apache.jmeter.threads.JMeterThread.doSampling(JMeterThread.java:622) [ApacheJMeter_core.jar:r1835982]
   [concat] 	at org.apache.jmeter.threads.JMeterThread.executeSamplePackage(JMeterThread.java:546)
[ApacheJMeter_core.jar:r1835982]
   [concat] 	at org.apache.jmeter.threads.JMeterThread.processSampler(JMeterThread.java:486)
[ApacheJMeter_core.jar:r1835982]
   [concat] 	at org.apache.jmeter.threads.JMeterThread.run(JMeterThread.java:253) [ApacheJMeter_core.jar:r1835982]
   [concat] 	at java.lang.Thread.run(Thread.java:748) [?:1.8.0_172]
   [concat] 2018-07-15 15:04:30,838 WARN o.a.j.p.t.s.TCPSampler: Unknown host for tcp://localhostXXXX:2223
   [concat] java.net.UnknownHostException: localhostXXXX
   [concat] 	at java.net.AbstractPlainSocketImpl.connect(AbstractPlainSocketImpl.java:184)
~[?:1.8.0_172]
   [concat] 	at java.net.SocksSocketImpl.connect(SocksSocketImpl.java:392) ~[?:1.8.0_172]
   [concat] 	at java.net.Socket.connect(Socket.java:589) ~[?:1.8.0_172]
   [concat] 	at org.apache.jmeter.protocol.tcp.sampler.TCPSampler.getSocket(TCPSampler.java:168)
[ApacheJMeter_tcp.jar:r1835982]
   [concat] 	at org.apache.jmeter.protocol.tcp.sampler.TCPSampler.sample(TCPSampler.java:384)
[ApacheJMeter_tcp.jar:r1835982]
   [concat] 	at org.apache.jmeter.threads.JMeterThread.doSampling(JMeterThread.java:622) [ApacheJMeter_core.jar:r1835982]
   [concat] 	at org.apache.jmeter.threads.JMeterThread.executeSamplePackage(JMeterThread.java:546)
[ApacheJMeter_core.jar:r1835982]
   [concat] 	at org.apache.jmeter.threads.JMeterThread.processSampler(JMeterThread.java:486)
[ApacheJMeter_core.jar:r1835982]
   [concat] 	at org.apache.jmeter.threads.JMeterThread.run(JMeterThread.java:253) [ApacheJMeter_core.jar:r1835982]
   [concat] 	at java.lang.Thread.run(Thread.java:748) [?:1.8.0_172]
   [concat] 2018-07-15 15:04:30,844 ERROR o.a.j.p.t.s.TCPSampler: Could not find protocol
class 'org.foo.xxx'
     [echo] TCP_TESTS output files compared OK

batchtest:
     [echo] Starting JDBC_TESTS with file JDBC_TESTS.jmx using -X -Jdummy=dummy
   [jmeter] SLF4J: Class path contains multiple SLF4J bindings.
   [jmeter] SLF4J: Found binding in [jar:<https://builds.apache.org/job/JMeter-trunk/ws/trunk/lib/log4j-slf4j-impl-2.11.0.jar!/org/slf4j/impl/StaticLoggerBinder.class]>
   [jmeter] SLF4J: Found binding in [jar:<https://builds.apache.org/job/JMeter-trunk/ws/trunk/lib/opt/activemq-all-5.15.2.jar!/org/slf4j/impl/StaticLoggerBinder.class]>
   [jmeter] SLF4J: See http://www.slf4j.org/codes.html#multiple_bindings for an explanation.
   [jmeter] SLF4J: Actual binding is of type [org.apache.logging.slf4j.Log4jLoggerFactory]
   [jmeter] Creating summariser <summary>
   [jmeter] Created the tree successfully using testfiles/JDBC_TESTS.jmx
   [jmeter] Starting the test @ Sun Jul 15 15:04:35 UTC 2018 (1531667075119)
   [jmeter] Waiting for possible Shutdown/StopTestNow/Heapdump message on port 4445
   [jmeter] summary =     21 in 00:00:02 =   12.4/s Avg:    28 Min:     0 Max:   542 Err:
    0 (0.00%)
   [jmeter] Tidying up ...    @ Sun Jul 15 15:04:38 UTC 2018 (1531667078109)
   [jmeter] ... end of run
   [concat] 2018-07-15 15:04:38,077 ERROR o.a.j.t.JMeterThread: Error while processing sampler:
'JDBC_With_Failing_PreProcessor'.
   [concat] java.lang.IllegalArgumentException: Variable Name must not be null in JDBC PreProcessor
   [concat] 	at org.apache.jmeter.protocol.jdbc.processor.AbstractJDBCProcessor.process(AbstractJDBCProcessor.java:45)
~[ApacheJMeter_jdbc.jar:r1835982]
   [concat] 	at org.apache.jmeter.protocol.jdbc.processor.JDBCPreProcessor.process(JDBCPreProcessor.java:33)
~[ApacheJMeter_jdbc.jar:r1835982]
   [concat] 	at org.apache.jmeter.threads.JMeterThread.runPreProcessors(JMeterThread.java:935)
~[ApacheJMeter_core.jar:r1835982]
   [concat] 	at org.apache.jmeter.threads.JMeterThread.executeSamplePackage(JMeterThread.java:537)
~[ApacheJMeter_core.jar:r1835982]
   [concat] 	at org.apache.jmeter.threads.JMeterThread.processSampler(JMeterThread.java:486)
[ApacheJMeter_core.jar:r1835982]
   [concat] 	at org.apache.jmeter.threads.JMeterThread.run(JMeterThread.java:253) [ApacheJMeter_core.jar:r1835982]
   [concat] 	at java.lang.Thread.run(Thread.java:748) [?:1.8.0_172]
   [concat] 2018-07-15 15:04:38,086 ERROR o.a.j.t.JMeterThread: Error while processing sampler:
'JDBC_With_Failing_PostProcessor'.
   [concat] java.lang.IllegalArgumentException: Variable Name must not be null in JDBC PostProcessor
   [concat] 	at org.apache.jmeter.protocol.jdbc.processor.AbstractJDBCProcessor.process(AbstractJDBCProcessor.java:45)
~[ApacheJMeter_jdbc.jar:r1835982]
   [concat] 	at org.apache.jmeter.protocol.jdbc.processor.JDBCPostProcessor.process(JDBCPostProcessor.java:33)
~[ApacheJMeter_jdbc.jar:r1835982]
   [concat] 	at org.apache.jmeter.threads.JMeterThread.runPostProcessors(JMeterThread.java:925)
~[ApacheJMeter_core.jar:r1835982]
   [concat] 	at org.apache.jmeter.threads.JMeterThread.executeSamplePackage(JMeterThread.java:564)
~[ApacheJMeter_core.jar:r1835982]
   [concat] 	at org.apache.jmeter.threads.JMeterThread.processSampler(JMeterThread.java:486)
[ApacheJMeter_core.jar:r1835982]
   [concat] 	at org.apache.jmeter.threads.JMeterThread.run(JMeterThread.java:253) [ApacheJMeter_core.jar:r1835982]
   [concat] 	at java.lang.Thread.run(Thread.java:748) [?:1.8.0_172]
   [concat] 2018-07-15 15:04:38,087 WARN o.a.j.p.j.p.AbstractJDBCProcessor: SQL Problem in
JDBC PreProcessor: java.sql.SQLSyntaxErrorException: unexpected token: USERS
   [concat] 2018-07-15 15:04:38,102 WARN o.a.j.p.j.p.AbstractJDBCProcessor: SQL Problem in
JDBC PostProcessor: java.sql.SQLSyntaxErrorException: unexpected token: USERS
     [echo] JDBC_TESTS output files compared OK

batchtest:
     [echo] Starting JMS_TESTS with file JMS_TESTS.jmx using -X -Jdummy=dummy
   [jmeter] SLF4J: Class path contains multiple SLF4J bindings.
   [jmeter] SLF4J: Found binding in [jar:<https://builds.apache.org/job/JMeter-trunk/ws/trunk/lib/log4j-slf4j-impl-2.11.0.jar!/org/slf4j/impl/StaticLoggerBinder.class]>
   [jmeter] SLF4J: Found binding in [jar:<https://builds.apache.org/job/JMeter-trunk/ws/trunk/lib/opt/activemq-all-5.15.2.jar!/org/slf4j/impl/StaticLoggerBinder.class]>
   [jmeter] SLF4J: See http://www.slf4j.org/codes.html#multiple_bindings for an explanation.
   [jmeter] SLF4J: Actual binding is of type [org.apache.logging.slf4j.Log4jLoggerFactory]
   [jmeter] Creating summariser <summary>
   [jmeter] Created the tree successfully using testfiles/JMS_TESTS.jmx
   [jmeter] Starting the test @ Sun Jul 15 15:04:41 UTC 2018 (1531667081300)
   [jmeter] Waiting for possible Shutdown/StopTestNow/Heapdump message on port 4445
   [jmeter] summary +     20 in 00:00:17 =    1.1/s Avg:   509 Min:     1 Max:  3001 Err:
    0 (0.00%) Active: 1 Started: 3 Finished: 2
   [jmeter] summary +      7 in 00:00:19 =    0.4/s Avg:   871 Min:     0 Max:  3000 Err:
    0 (0.00%) Active: 0 Started: 1 Finished: 1
   [jmeter] summary =     27 in 00:00:36 =    0.7/s Avg:   603 Min:     0 Max:  3001 Err:
    0 (0.00%)
   [jmeter] Tidying up ...    @ Sun Jul 15 15:05:18 UTC 2018 (1531667118644)
   [jmeter] ... end of run
     [echo] JMS_TESTS output files compared OK

batchtest:
     [echo] Starting OS_TESTS with file OS_TESTS.jmx using -X -Jdummy=dummy
   [jmeter] SLF4J: Class path contains multiple SLF4J bindings.
   [jmeter] SLF4J: Found binding in [jar:<https://builds.apache.org/job/JMeter-trunk/ws/trunk/lib/log4j-slf4j-impl-2.11.0.jar!/org/slf4j/impl/StaticLoggerBinder.class]>
   [jmeter] SLF4J: Found binding in [jar:<https://builds.apache.org/job/JMeter-trunk/ws/trunk/lib/opt/activemq-all-5.15.2.jar!/org/slf4j/impl/StaticLoggerBinder.class]>
   [jmeter] SLF4J: See http://www.slf4j.org/codes.html#multiple_bindings for an explanation.
   [jmeter] SLF4J: Actual binding is of type [org.apache.logging.slf4j.Log4jLoggerFactory]
   [jmeter] Creating summariser <summary>
   [jmeter] Created the tree successfully using testfiles/OS_TESTS.jmx
   [jmeter] Starting the test @ Sun Jul 15 15:05:22 UTC 2018 (1531667122404)
   [jmeter] Waiting for possible Shutdown/StopTestNow/Heapdump message on port 4445
   [jmeter] summary =      3 in 00:00:02 =    1.5/s Avg:   339 Min:     2 Max:  1002 Err:
    0 (0.00%)
   [jmeter] Tidying up ...    @ Sun Jul 15 15:05:24 UTC 2018 (1531667124833)
   [jmeter] ... end of run
     [echo] OS_TESTS output files compared OK

batchtest:
     [echo] Starting FTP_TESTS with file FTP_TESTS.jmx using -X -Jdummy=dummy
   [jmeter] SLF4J: Class path contains multiple SLF4J bindings.
   [jmeter] SLF4J: Found binding in [jar:<https://builds.apache.org/job/JMeter-trunk/ws/trunk/lib/log4j-slf4j-impl-2.11.0.jar!/org/slf4j/impl/StaticLoggerBinder.class]>
   [jmeter] SLF4J: Found binding in [jar:<https://builds.apache.org/job/JMeter-trunk/ws/trunk/lib/opt/activemq-all-5.15.2.jar!/org/slf4j/impl/StaticLoggerBinder.class]>
   [jmeter] SLF4J: See http://www.slf4j.org/codes.html#multiple_bindings for an explanation.
   [jmeter] SLF4J: Actual binding is of type [org.apache.logging.slf4j.Log4jLoggerFactory]
   [jmeter] Creating summariser <summary>
   [jmeter] Created the tree successfully using testfiles/FTP_TESTS.jmx
   [jmeter] Starting the test @ Sun Jul 15 15:05:27 UTC 2018 (1531667127974)
   [jmeter] Waiting for possible Shutdown/StopTestNow/Heapdump message on port 4445
   [jmeter] summary +      1 in 00:00:01 =    1.0/s Avg:   978 Min:   978 Max:   978 Err:
    0 (0.00%) Active: 1 Started: 1 Finished: 0
   [jmeter] summary +      5 in 00:00:02 =    3.2/s Avg:    49 Min:    15 Max:   109 Err:
    0 (0.00%) Active: 0 Started: 1 Finished: 1
   [jmeter] summary =      6 in 00:00:03 =    2.3/s Avg:   204 Min:    15 Max:   978 Err:
    0 (0.00%)
   [jmeter] Tidying up ...    @ Sun Jul 15 15:05:31 UTC 2018 (1531667131786)
   [jmeter] ... end of run
     [echo] FTP_TESTS output files compared OK

batchtest:
     [echo] Starting Bug60607 with file Bug60607.jmx using -X -Jdummy=dummy
   [jmeter] SLF4J: Class path contains multiple SLF4J bindings.
   [jmeter] SLF4J: Found binding in [jar:<https://builds.apache.org/job/JMeter-trunk/ws/trunk/lib/log4j-slf4j-impl-2.11.0.jar!/org/slf4j/impl/StaticLoggerBinder.class]>
   [jmeter] SLF4J: Found binding in [jar:<https://builds.apache.org/job/JMeter-trunk/ws/trunk/lib/opt/activemq-all-5.15.2.jar!/org/slf4j/impl/StaticLoggerBinder.class]>
   [jmeter] SLF4J: See http://www.slf4j.org/codes.html#multiple_bindings for an explanation.
   [jmeter] SLF4J: Actual binding is of type [org.apache.logging.slf4j.Log4jLoggerFactory]
   [jmeter] Creating summariser <summary>
   [jmeter] Created the tree successfully using testfiles/Bug60607.jmx
   [jmeter] Starting the test @ Sun Jul 15 15:05:34 UTC 2018 (1531667134928)
   [jmeter] Waiting for possible Shutdown/StopTestNow/Heapdump message on port 4445
   [jmeter] summary =      2 in 00:00:31 =    0.1/s Avg: 15171 Min:   223 Max: 30119 Err:
    0 (0.00%)
   [jmeter] Tidying up ...    @ Sun Jul 15 15:06:06 UTC 2018 (1531667166585)
   [jmeter] ... end of run
     [echo] Bug60607 output files compared OK

batchtest:
     [echo] Starting SlowCharsFeature_HttpClient4 with file SlowCharsFeature.jmx using -X
-Jdummy=dummy
   [jmeter] SLF4J: Class path contains multiple SLF4J bindings.
   [jmeter] SLF4J: Found binding in [jar:<https://builds.apache.org/job/JMeter-trunk/ws/trunk/lib/log4j-slf4j-impl-2.11.0.jar!/org/slf4j/impl/StaticLoggerBinder.class]>
   [jmeter] SLF4J: Found binding in [jar:<https://builds.apache.org/job/JMeter-trunk/ws/trunk/lib/opt/activemq-all-5.15.2.jar!/org/slf4j/impl/StaticLoggerBinder.class]>
   [jmeter] SLF4J: See http://www.slf4j.org/codes.html#multiple_bindings for an explanation.
   [jmeter] SLF4J: Actual binding is of type [org.apache.logging.slf4j.Log4jLoggerFactory]
   [jmeter] Creating summariser <summary>
   [jmeter] Created the tree successfully using testfiles/SlowCharsFeature.jmx
   [jmeter] Starting the test @ Sun Jul 15 15:06:10 UTC 2018 (1531667170334)
   [jmeter] Waiting for possible Shutdown/StopTestNow/Heapdump message on port 4445
   [jmeter] summary =      5 in 00:00:32 =    0.2/s Avg:  6197 Min:   526 Max: 11200 Err:
    1 (20.00%)
   [jmeter] Tidying up ...    @ Sun Jul 15 15:06:42 UTC 2018 (1531667202595)
   [jmeter] ... end of run

BUILD FAILED
<https://builds.apache.org/job/JMeter-trunk/ws/trunk/build.xml>:2956: The following
error occurred while executing this line:
<https://builds.apache.org/job/JMeter-trunk/ws/trunk/build.xml>:2779: CSV Files are
not identical.
        <https://builds.apache.org/job/JMeter-trunk/ws/trunk/bin/testfiles/SlowCharsFeature_HttpClient4.csv>
        label,responseCode,responseMessage,threadName,dataType,success
JSS_setCPS,200,OK,setUp Thread Group 1-1,text,true
ApacheJMeter-HP-NonSecure,206,Partial Content,Thread Group 1-1,text,true
ApacheJMeter-HP-Secure,206,Partial Content,Thread Group 1-1,text,true
HTTPS-SNI-without-timeout,206,Partial Content,Thread Group 1-1,text,true
HTTPS-SNI-with-timeout,206,Partial Content,Thread Group 1-1,text,true

        <https://builds.apache.org/job/JMeter-trunk/ws/trunk/bin/SlowCharsFeature_HttpClient4.csv>
        label,responseCode,responseMessage,threadName,dataType,success
JSS_setCPS,200,OK,setUp Thread Group 1-1,text,true
ApacheJMeter-HP-NonSecure,206,Partial Content,Thread Group 1-1,text,true
ApacheJMeter-HP-Secure,206,Partial Content,Thread Group 1-1,text,true
HTTPS-SNI-without-timeout,206,Partial Content,Thread Group 1-1,text,false
HTTPS-SNI-with-timeout,206,Partial Content,Thread Group 1-1,text,true

Total time: 9 minutes 11 seconds
Build step 'Invoke Ant' marked build as failure
[locks-and-latches] Releasing all the locks
[locks-and-latches] All the locks released
Archiving artifacts
Recording test results
ERROR: Step ?Publish JUnit test result report? failed: Test reports were found but none of
them are new. Did leafNodes run? 
For example, <https://builds.apache.org/job/JMeter-trunk/ws/trunk/reports/TEST-org.apache.commons.cli.avalon.ClutilTestCase.xml>
is 43 min old


Mime
View raw message