jmeter-dev mailing list archives

Site index · List index
Message view « Date » · « Thread »
Top « Date » · « Thread »
From Apache Jenkins Server <jenk...@builds.apache.org>
Subject Build failed in Jenkins: JMeter Ubuntu #488
Date Sun, 01 Jul 2018 13:23:28 GMT
See <https://builds.apache.org/job/JMeter%20Ubuntu/488/display/redirect?page=changes>

Changes:

[fschumacher] Update to current jacoco version 0.8.1

------------------------------------------
[...truncated 172.52 KB...]
   [jmeter] Waiting for possible Shutdown/StopTestNow/Heapdump message on port 4445
   [jmeter] summary =      2 in 00:00:01 =    1.5/s Avg:   513 Min:   476 Max:   550 Err:
    0 (0.00%)
   [jmeter] Tidying up ...    @ Sun Jul 01 13:21:17 UTC 2018 (1530451277176)
   [jmeter] ... end of run
     [echo] TEST_HTTPS output files compared OK

batchtest:
     [echo] Starting TestCookieManager with file TestCookieManager.jmx using -X -Jdummy=dummy
   [jmeter] SLF4J: Class path contains multiple SLF4J bindings.
   [jmeter] SLF4J: Found binding in [jar:<https://builds.apache.org/job/JMeter%20Ubuntu/ws/trunk/lib/log4j-slf4j-impl-2.10.0.jar!/org/slf4j/impl/StaticLoggerBinder.class]>
   [jmeter] SLF4J: Found binding in [jar:<https://builds.apache.org/job/JMeter%20Ubuntu/ws/trunk/lib/opt/activemq-all-5.15.2.jar!/org/slf4j/impl/StaticLoggerBinder.class]>
   [jmeter] SLF4J: See http://www.slf4j.org/codes.html#multiple_bindings for an explanation.
   [jmeter] SLF4J: Actual binding is of type [org.apache.logging.slf4j.Log4jLoggerFactory]
   [jmeter] Creating summariser <summary>
   [jmeter] Created the tree successfully using testfiles/TestCookieManager.jmx
   [jmeter] Starting the test @ Sun Jul 01 13:21:19 UTC 2018 (1530451279143)
   [jmeter] Waiting for possible Shutdown/StopTestNow/Heapdump message on port 4445
   [jmeter] summary =     10 in 00:00:01 =    9.0/s Avg:    81 Min:     1 Max:   462 Err:
    0 (0.00%)
   [jmeter] Tidying up ...    @ Sun Jul 01 13:21:21 UTC 2018 (1530451281082)
   [jmeter] ... end of run
     [echo] TestCookieManager output files compared OK

batchtest:
     [echo] Starting TCP_TESTS with file TCP_TESTS.jmx using -X -Jdummy=dummy
   [jmeter] SLF4J: Class path contains multiple SLF4J bindings.
   [jmeter] SLF4J: Found binding in [jar:<https://builds.apache.org/job/JMeter%20Ubuntu/ws/trunk/lib/log4j-slf4j-impl-2.10.0.jar!/org/slf4j/impl/StaticLoggerBinder.class]>
   [jmeter] SLF4J: Found binding in [jar:<https://builds.apache.org/job/JMeter%20Ubuntu/ws/trunk/lib/opt/activemq-all-5.15.2.jar!/org/slf4j/impl/StaticLoggerBinder.class]>
   [jmeter] SLF4J: See http://www.slf4j.org/codes.html#multiple_bindings for an explanation.
   [jmeter] SLF4J: Actual binding is of type [org.apache.logging.slf4j.Log4jLoggerFactory]
   [jmeter] Creating summariser <summary>
   [jmeter] Created the tree successfully using testfiles/TCP_TESTS.jmx
   [jmeter] Starting the test @ Sun Jul 01 13:21:24 UTC 2018 (1530451284046)
   [jmeter] Waiting for possible Shutdown/StopTestNow/Heapdump message on port 4445
   [jmeter] 01/07/2018 13:21:27
   [jmeter] 
   [jmeter] 
   [jmeter] summary +     11 in 00:00:05 =    2.1/s Avg:   347 Min:     1 Max:  1023 Err:
    0 (0.00%) Active: 1 Started: 1 Finished: 0
   [jmeter] summary =     11 in 00:00:05 =    2.1/s Avg:   347 Min:     1 Max:  1023 Err:
    0 (0.00%)
   [jmeter] Tidying up ...    @ Sun Jul 01 13:21:30 UTC 2018 (1530451290014)
   [jmeter] ... end of run
   [concat] 2018-07-01 13:21:27,917 ERROR o.a.j.p.t.s.TCPSampler: 
   [concat] org.apache.jmeter.protocol.tcp.sampler.ReadException: Error reading from server,
bytes read: 0
   [concat] 	at org.apache.jmeter.protocol.tcp.sampler.TCPClientImpl.read(TCPClientImpl.java:131)
~[ApacheJMeter_tcp.jar:4.1-SNAPSHOT r1834789]
   [concat] 	at org.apache.jmeter.protocol.tcp.sampler.TCPSampler.sample(TCPSampler.java:402)
[ApacheJMeter_tcp.jar:4.1-SNAPSHOT r1834789]
   [concat] 	at org.apache.jmeter.threads.JMeterThread.doSampling(JMeterThread.java:622) [ApacheJMeter_core.jar:4.1-SNAPSHOT
r1834789]
   [concat] 	at org.apache.jmeter.threads.JMeterThread.executeSamplePackage(JMeterThread.java:546)
[ApacheJMeter_core.jar:4.1-SNAPSHOT r1834789]
   [concat] 	at org.apache.jmeter.threads.JMeterThread.processSampler(JMeterThread.java:486)
[ApacheJMeter_core.jar:4.1-SNAPSHOT r1834789]
   [concat] 	at org.apache.jmeter.threads.JMeterThread.run(JMeterThread.java:253) [ApacheJMeter_core.jar:4.1-SNAPSHOT
r1834789]
   [concat] 	at java.lang.Thread.run(Thread.java:748) [?:1.8.0_172]
   [concat] Caused by: java.net.SocketTimeoutException: Read timed out
   [concat] 	at java.net.SocketInputStream.socketRead0(Native Method) ~[?:1.8.0_172]
   [concat] 	at java.net.SocketInputStream.socketRead(SocketInputStream.java:116) ~[?:1.8.0_172]
   [concat] 	at java.net.SocketInputStream.read(SocketInputStream.java:171) ~[?:1.8.0_172]
   [concat] 	at java.net.SocketInputStream.read(SocketInputStream.java:141) ~[?:1.8.0_172]
   [concat] 	at java.net.SocketInputStream.read(SocketInputStream.java:127) ~[?:1.8.0_172]
   [concat] 	at org.apache.jmeter.protocol.tcp.sampler.TCPClientImpl.read(TCPClientImpl.java:114)
~[ApacheJMeter_tcp.jar:4.1-SNAPSHOT r1834789]
   [concat] 	... 6 more
   [concat] 2018-07-01 13:21:29,005 ERROR o.a.j.p.t.s.TCPSampler: 
   [concat] org.apache.jmeter.protocol.tcp.sampler.ReadException: 
   [concat] 	at org.apache.jmeter.protocol.tcp.sampler.BinaryTCPClientImpl.read(BinaryTCPClientImpl.java:152)
~[ApacheJMeter_tcp.jar:4.1-SNAPSHOT r1834789]
   [concat] 	at org.apache.jmeter.protocol.tcp.sampler.TCPSampler.sample(TCPSampler.java:402)
[ApacheJMeter_tcp.jar:4.1-SNAPSHOT r1834789]
   [concat] 	at org.apache.jmeter.threads.JMeterThread.doSampling(JMeterThread.java:622) [ApacheJMeter_core.jar:4.1-SNAPSHOT
r1834789]
   [concat] 	at org.apache.jmeter.threads.JMeterThread.executeSamplePackage(JMeterThread.java:546)
[ApacheJMeter_core.jar:4.1-SNAPSHOT r1834789]
   [concat] 	at org.apache.jmeter.threads.JMeterThread.processSampler(JMeterThread.java:486)
[ApacheJMeter_core.jar:4.1-SNAPSHOT r1834789]
   [concat] 	at org.apache.jmeter.threads.JMeterThread.run(JMeterThread.java:253) [ApacheJMeter_core.jar:4.1-SNAPSHOT
r1834789]
   [concat] 	at java.lang.Thread.run(Thread.java:748) [?:1.8.0_172]
   [concat] Caused by: java.net.SocketTimeoutException: Read timed out
   [concat] 	at java.net.SocketInputStream.socketRead0(Native Method) ~[?:1.8.0_172]
   [concat] 	at java.net.SocketInputStream.socketRead(SocketInputStream.java:116) ~[?:1.8.0_172]
   [concat] 	at java.net.SocketInputStream.read(SocketInputStream.java:171) ~[?:1.8.0_172]
   [concat] 	at java.net.SocketInputStream.read(SocketInputStream.java:141) ~[?:1.8.0_172]
   [concat] 	at java.net.SocketInputStream.read(SocketInputStream.java:127) ~[?:1.8.0_172]
   [concat] 	at org.apache.jmeter.protocol.tcp.sampler.BinaryTCPClientImpl.read(BinaryTCPClientImpl.java:134)
~[ApacheJMeter_tcp.jar:4.1-SNAPSHOT r1834789]
   [concat] 	... 6 more
   [concat] 2018-07-01 13:21:29,015 WARN o.a.j.p.t.s.TCPSampler: Could not create socket for
tcp://localhost:2223
   [concat] java.net.ConnectException: Connection refused (Connection refused)
   [concat] 	at java.net.PlainSocketImpl.socketConnect(Native Method) ~[?:1.8.0_172]
   [concat] 	at java.net.AbstractPlainSocketImpl.doConnect(AbstractPlainSocketImpl.java:350)
~[?:1.8.0_172]
   [concat] 	at java.net.AbstractPlainSocketImpl.connectToAddress(AbstractPlainSocketImpl.java:206)
~[?:1.8.0_172]
   [concat] 	at java.net.AbstractPlainSocketImpl.connect(AbstractPlainSocketImpl.java:188)
~[?:1.8.0_172]
   [concat] 	at java.net.SocksSocketImpl.connect(SocksSocketImpl.java:392) ~[?:1.8.0_172]
   [concat] 	at java.net.Socket.connect(Socket.java:589) ~[?:1.8.0_172]
   [concat] 	at org.apache.jmeter.protocol.tcp.sampler.TCPSampler.getSocket(TCPSampler.java:168)
[ApacheJMeter_tcp.jar:4.1-SNAPSHOT r1834789]
   [concat] 	at org.apache.jmeter.protocol.tcp.sampler.TCPSampler.sample(TCPSampler.java:384)
[ApacheJMeter_tcp.jar:4.1-SNAPSHOT r1834789]
   [concat] 	at org.apache.jmeter.threads.JMeterThread.doSampling(JMeterThread.java:622) [ApacheJMeter_core.jar:4.1-SNAPSHOT
r1834789]
   [concat] 	at org.apache.jmeter.threads.JMeterThread.executeSamplePackage(JMeterThread.java:546)
[ApacheJMeter_core.jar:4.1-SNAPSHOT r1834789]
   [concat] 	at org.apache.jmeter.threads.JMeterThread.processSampler(JMeterThread.java:486)
[ApacheJMeter_core.jar:4.1-SNAPSHOT r1834789]
   [concat] 	at org.apache.jmeter.threads.JMeterThread.run(JMeterThread.java:253) [ApacheJMeter_core.jar:4.1-SNAPSHOT
r1834789]
   [concat] 	at java.lang.Thread.run(Thread.java:748) [?:1.8.0_172]
   [concat] 2018-07-01 13:21:29,073 WARN o.a.j.p.t.s.TCPSampler: Unknown host for tcp://localhostXXXX:2223
   [concat] java.net.UnknownHostException: localhostXXXX
   [concat] 	at java.net.AbstractPlainSocketImpl.connect(AbstractPlainSocketImpl.java:184)
~[?:1.8.0_172]
   [concat] 	at java.net.SocksSocketImpl.connect(SocksSocketImpl.java:392) ~[?:1.8.0_172]
   [concat] 	at java.net.Socket.connect(Socket.java:589) ~[?:1.8.0_172]
   [concat] 	at org.apache.jmeter.protocol.tcp.sampler.TCPSampler.getSocket(TCPSampler.java:168)
[ApacheJMeter_tcp.jar:4.1-SNAPSHOT r1834789]
   [concat] 	at org.apache.jmeter.protocol.tcp.sampler.TCPSampler.sample(TCPSampler.java:384)
[ApacheJMeter_tcp.jar:4.1-SNAPSHOT r1834789]
   [concat] 	at org.apache.jmeter.threads.JMeterThread.doSampling(JMeterThread.java:622) [ApacheJMeter_core.jar:4.1-SNAPSHOT
r1834789]
   [concat] 	at org.apache.jmeter.threads.JMeterThread.executeSamplePackage(JMeterThread.java:546)
[ApacheJMeter_core.jar:4.1-SNAPSHOT r1834789]
   [concat] 	at org.apache.jmeter.threads.JMeterThread.processSampler(JMeterThread.java:486)
[ApacheJMeter_core.jar:4.1-SNAPSHOT r1834789]
   [concat] 	at org.apache.jmeter.threads.JMeterThread.run(JMeterThread.java:253) [ApacheJMeter_core.jar:4.1-SNAPSHOT
r1834789]
   [concat] 	at java.lang.Thread.run(Thread.java:748) [?:1.8.0_172]
   [concat] 2018-07-01 13:21:29,077 ERROR o.a.j.p.t.s.TCPSampler: Could not find protocol
class 'org.foo.xxx'
     [echo] TCP_TESTS output files compared OK

batchtest:
     [echo] Starting JDBC_TESTS with file JDBC_TESTS.jmx using -X -Jdummy=dummy
   [jmeter] SLF4J: Class path contains multiple SLF4J bindings.
   [jmeter] SLF4J: Found binding in [jar:<https://builds.apache.org/job/JMeter%20Ubuntu/ws/trunk/lib/log4j-slf4j-impl-2.10.0.jar!/org/slf4j/impl/StaticLoggerBinder.class]>
   [jmeter] SLF4J: Found binding in [jar:<https://builds.apache.org/job/JMeter%20Ubuntu/ws/trunk/lib/opt/activemq-all-5.15.2.jar!/org/slf4j/impl/StaticLoggerBinder.class]>
   [jmeter] SLF4J: See http://www.slf4j.org/codes.html#multiple_bindings for an explanation.
   [jmeter] SLF4J: Actual binding is of type [org.apache.logging.slf4j.Log4jLoggerFactory]
   [jmeter] Creating summariser <summary>
   [jmeter] Created the tree successfully using testfiles/JDBC_TESTS.jmx
   [jmeter] Starting the test @ Sun Jul 01 13:21:31 UTC 2018 (1530451291938)
   [jmeter] Waiting for possible Shutdown/StopTestNow/Heapdump message on port 4445
   [jmeter] summary +      1 in 00:00:00 =    2.4/s Avg:   387 Min:   387 Max:   387 Err:
    0 (0.00%) Active: 1 Started: 1 Finished: 0
   [jmeter] summary +     20 in 00:00:01 =   28.9/s Avg:     1 Min:     0 Max:    19 Err:
    0 (0.00%) Active: 0 Started: 2 Finished: 2
   [jmeter] summary =     21 in 00:00:01 =   19.0/s Avg:    20 Min:     0 Max:   387 Err:
    0 (0.00%)
   [jmeter] Tidying up ...    @ Sun Jul 01 13:21:33 UTC 2018 (1530451293849)
   [jmeter] ... end of run
   [concat] 2018-07-01 13:21:33,833 ERROR o.a.j.t.JMeterThread: Error while processing sampler:
'JDBC_With_Failing_PreProcessor'.
   [concat] java.lang.IllegalArgumentException: Variable Name must not be null in JDBC PreProcessor
   [concat] 	at org.apache.jmeter.protocol.jdbc.processor.AbstractJDBCProcessor.process(AbstractJDBCProcessor.java:45)
~[ApacheJMeter_jdbc.jar:4.1-SNAPSHOT r1834789]
   [concat] 	at org.apache.jmeter.protocol.jdbc.processor.JDBCPreProcessor.process(JDBCPreProcessor.java:33)
~[ApacheJMeter_jdbc.jar:4.1-SNAPSHOT r1834789]
   [concat] 	at org.apache.jmeter.threads.JMeterThread.runPreProcessors(JMeterThread.java:935)
~[ApacheJMeter_core.jar:4.1-SNAPSHOT r1834789]
   [concat] 	at org.apache.jmeter.threads.JMeterThread.executeSamplePackage(JMeterThread.java:537)
~[ApacheJMeter_core.jar:4.1-SNAPSHOT r1834789]
   [concat] 	at org.apache.jmeter.threads.JMeterThread.processSampler(JMeterThread.java:486)
[ApacheJMeter_core.jar:4.1-SNAPSHOT r1834789]
   [concat] 	at org.apache.jmeter.threads.JMeterThread.run(JMeterThread.java:253) [ApacheJMeter_core.jar:4.1-SNAPSHOT
r1834789]
   [concat] 	at java.lang.Thread.run(Thread.java:748) [?:1.8.0_172]
   [concat] 2018-07-01 13:21:33,840 ERROR o.a.j.t.JMeterThread: Error while processing sampler:
'JDBC_With_Failing_PostProcessor'.
   [concat] java.lang.IllegalArgumentException: Variable Name must not be null in JDBC PostProcessor
   [concat] 	at org.apache.jmeter.protocol.jdbc.processor.AbstractJDBCProcessor.process(AbstractJDBCProcessor.java:45)
~[ApacheJMeter_jdbc.jar:4.1-SNAPSHOT r1834789]
   [concat] 	at org.apache.jmeter.protocol.jdbc.processor.JDBCPostProcessor.process(JDBCPostProcessor.java:33)
~[ApacheJMeter_jdbc.jar:4.1-SNAPSHOT r1834789]
   [concat] 	at org.apache.jmeter.threads.JMeterThread.runPostProcessors(JMeterThread.java:925)
~[ApacheJMeter_core.jar:4.1-SNAPSHOT r1834789]
   [concat] 	at org.apache.jmeter.threads.JMeterThread.executeSamplePackage(JMeterThread.java:564)
~[ApacheJMeter_core.jar:4.1-SNAPSHOT r1834789]
   [concat] 	at org.apache.jmeter.threads.JMeterThread.processSampler(JMeterThread.java:486)
[ApacheJMeter_core.jar:4.1-SNAPSHOT r1834789]
   [concat] 	at org.apache.jmeter.threads.JMeterThread.run(JMeterThread.java:253) [ApacheJMeter_core.jar:4.1-SNAPSHOT
r1834789]
   [concat] 	at java.lang.Thread.run(Thread.java:748) [?:1.8.0_172]
   [concat] 2018-07-01 13:21:33,840 WARN o.a.j.p.j.p.AbstractJDBCProcessor: SQL Problem in
JDBC PreProcessor: java.sql.SQLSyntaxErrorException: unexpected token: USERS
   [concat] 2018-07-01 13:21:33,846 WARN o.a.j.p.j.p.AbstractJDBCProcessor: SQL Problem in
JDBC PostProcessor: java.sql.SQLSyntaxErrorException: unexpected token: USERS
     [echo] JDBC_TESTS output files compared OK

batchtest:
     [echo] Starting JMS_TESTS with file JMS_TESTS.jmx using -X -Jdummy=dummy
   [jmeter] SLF4J: Class path contains multiple SLF4J bindings.
   [jmeter] SLF4J: Found binding in [jar:<https://builds.apache.org/job/JMeter%20Ubuntu/ws/trunk/lib/log4j-slf4j-impl-2.10.0.jar!/org/slf4j/impl/StaticLoggerBinder.class]>
   [jmeter] SLF4J: Found binding in [jar:<https://builds.apache.org/job/JMeter%20Ubuntu/ws/trunk/lib/opt/activemq-all-5.15.2.jar!/org/slf4j/impl/StaticLoggerBinder.class]>
   [jmeter] SLF4J: See http://www.slf4j.org/codes.html#multiple_bindings for an explanation.
   [jmeter] SLF4J: Actual binding is of type [org.apache.logging.slf4j.Log4jLoggerFactory]
   [jmeter] Creating summariser <summary>
   [jmeter] Created the tree successfully using testfiles/JMS_TESTS.jmx
   [jmeter] Starting the test @ Sun Jul 01 13:21:35 UTC 2018 (1530451295575)
   [jmeter] Waiting for possible Shutdown/StopTestNow/Heapdump message on port 4445
   [jmeter] summary +     24 in 00:00:27 =    0.9/s Avg:   512 Min:     0 Max:  3000 Err:
    0 (0.00%) Active: 1 Started: 5 Finished: 4
   [jmeter] summary +      3 in 00:00:08 =    0.4/s Avg:  1028 Min:     0 Max:  3000 Err:
    0 (0.00%) Active: 0 Started: 1 Finished: 1
   [jmeter] summary =     27 in 00:00:35 =    0.8/s Avg:   569 Min:     0 Max:  3000 Err:
    0 (0.00%)
   [jmeter] Tidying up ...    @ Sun Jul 01 13:22:11 UTC 2018 (1530451331276)
   [jmeter] ... end of run
     [echo] JMS_TESTS output files compared OK

batchtest:
     [echo] Starting OS_TESTS with file OS_TESTS.jmx using -X -Jdummy=dummy
   [jmeter] SLF4J: Class path contains multiple SLF4J bindings.
   [jmeter] SLF4J: Found binding in [jar:<https://builds.apache.org/job/JMeter%20Ubuntu/ws/trunk/lib/log4j-slf4j-impl-2.10.0.jar!/org/slf4j/impl/StaticLoggerBinder.class]>
   [jmeter] SLF4J: Found binding in [jar:<https://builds.apache.org/job/JMeter%20Ubuntu/ws/trunk/lib/opt/activemq-all-5.15.2.jar!/org/slf4j/impl/StaticLoggerBinder.class]>
   [jmeter] SLF4J: See http://www.slf4j.org/codes.html#multiple_bindings for an explanation.
   [jmeter] SLF4J: Actual binding is of type [org.apache.logging.slf4j.Log4jLoggerFactory]
   [jmeter] Creating summariser <summary>
   [jmeter] Created the tree successfully using testfiles/OS_TESTS.jmx
   [jmeter] Starting the test @ Sun Jul 01 13:22:13 UTC 2018 (1530451333476)
   [jmeter] Waiting for possible Shutdown/StopTestNow/Heapdump message on port 4445
   [jmeter] summary =      3 in 00:00:02 =    1.7/s Avg:   337 Min:     2 Max:  1002 Err:
    0 (0.00%)
   [jmeter] Tidying up ...    @ Sun Jul 01 13:22:15 UTC 2018 (1530451335448)
   [jmeter] ... end of run
     [echo] OS_TESTS output files compared OK

batchtest:
     [echo] Starting FTP_TESTS with file FTP_TESTS.jmx using -X -Jdummy=dummy
   [jmeter] SLF4J: Class path contains multiple SLF4J bindings.
   [jmeter] SLF4J: Found binding in [jar:<https://builds.apache.org/job/JMeter%20Ubuntu/ws/trunk/lib/log4j-slf4j-impl-2.10.0.jar!/org/slf4j/impl/StaticLoggerBinder.class]>
   [jmeter] SLF4J: Found binding in [jar:<https://builds.apache.org/job/JMeter%20Ubuntu/ws/trunk/lib/opt/activemq-all-5.15.2.jar!/org/slf4j/impl/StaticLoggerBinder.class]>
   [jmeter] SLF4J: See http://www.slf4j.org/codes.html#multiple_bindings for an explanation.
   [jmeter] SLF4J: Actual binding is of type [org.apache.logging.slf4j.Log4jLoggerFactory]
   [jmeter] Creating summariser <summary>
   [jmeter] Created the tree successfully using testfiles/FTP_TESTS.jmx
   [jmeter] Starting the test @ Sun Jul 01 13:22:17 UTC 2018 (1530451337473)
   [jmeter] Waiting for possible Shutdown/StopTestNow/Heapdump message on port 4445
   [jmeter] summary =      6 in 00:00:02 =    2.7/s Avg:   170 Min:    13 Max:   807 Err:
    0 (0.00%)
   [jmeter] Tidying up ...    @ Sun Jul 01 13:22:20 UTC 2018 (1530451340537)
   [jmeter] ... end of run
     [echo] FTP_TESTS output files compared OK

batchtest:
     [echo] Starting Bug60607 with file Bug60607.jmx using -X -Jdummy=dummy
   [jmeter] SLF4J: Class path contains multiple SLF4J bindings.
   [jmeter] SLF4J: Found binding in [jar:<https://builds.apache.org/job/JMeter%20Ubuntu/ws/trunk/lib/log4j-slf4j-impl-2.10.0.jar!/org/slf4j/impl/StaticLoggerBinder.class]>
   [jmeter] SLF4J: Found binding in [jar:<https://builds.apache.org/job/JMeter%20Ubuntu/ws/trunk/lib/opt/activemq-all-5.15.2.jar!/org/slf4j/impl/StaticLoggerBinder.class]>
   [jmeter] SLF4J: See http://www.slf4j.org/codes.html#multiple_bindings for an explanation.
   [jmeter] SLF4J: Actual binding is of type [org.apache.logging.slf4j.Log4jLoggerFactory]
   [jmeter] Creating summariser <summary>
   [jmeter] Created the tree successfully using testfiles/Bug60607.jmx
   [jmeter] Starting the test @ Sun Jul 01 13:22:22 UTC 2018 (1530451342498)
   [jmeter] Waiting for possible Shutdown/StopTestNow/Heapdump message on port 4445
   [jmeter] summary =      2 in 00:00:31 =    0.1/s Avg: 15164 Min:   226 Max: 30102 Err:
    0 (0.00%)
   [jmeter] Tidying up ...    @ Sun Jul 01 13:22:53 UTC 2018 (1530451373697)
   [jmeter] ... end of run
     [echo] Bug60607 output files compared OK

batchtest:
     [echo] Starting SlowCharsFeature_HttpClient4 with file SlowCharsFeature.jmx using -X
-Jdummy=dummy
   [jmeter] SLF4J: Class path contains multiple SLF4J bindings.
   [jmeter] SLF4J: Found binding in [jar:<https://builds.apache.org/job/JMeter%20Ubuntu/ws/trunk/lib/log4j-slf4j-impl-2.10.0.jar!/org/slf4j/impl/StaticLoggerBinder.class]>
   [jmeter] SLF4J: Found binding in [jar:<https://builds.apache.org/job/JMeter%20Ubuntu/ws/trunk/lib/opt/activemq-all-5.15.2.jar!/org/slf4j/impl/StaticLoggerBinder.class]>
   [jmeter] SLF4J: See http://www.slf4j.org/codes.html#multiple_bindings for an explanation.
   [jmeter] SLF4J: Actual binding is of type [org.apache.logging.slf4j.Log4jLoggerFactory]
   [jmeter] Creating summariser <summary>
   [jmeter] Created the tree successfully using testfiles/SlowCharsFeature.jmx
   [jmeter] Starting the test @ Sun Jul 01 13:22:56 UTC 2018 (1530451376064)
   [jmeter] Waiting for possible Shutdown/StopTestNow/Heapdump message on port 4445
   [jmeter] summary +      2 in 00:00:07 =    0.3/s Avg:  3111 Min:   425 Max:  5797 Err:
    0 (0.00%) Active: 1 Started: 1 Finished: 0
   [jmeter] summary +      3 in 00:00:24 =    0.1/s Avg:  7930 Min:  5622 Max: 11176 Err:
    1 (33.33%) Active: 0 Started: 1 Finished: 1
   [jmeter] summary =      5 in 00:00:30 =    0.2/s Avg:  6002 Min:   425 Max: 11176 Err:
    1 (20.00%)
   [jmeter] Tidying up ...    @ Sun Jul 01 13:23:27 UTC 2018 (1530451407005)
   [jmeter] ... end of run

BUILD FAILED
<https://builds.apache.org/job/JMeter%20Ubuntu/ws/trunk/build.xml>:2951: The following
error occurred while executing this line:
<https://builds.apache.org/job/JMeter%20Ubuntu/ws/trunk/build.xml>:2779: CSV Files are
not identical.
        <https://builds.apache.org/job/JMeter%20Ubuntu/ws/trunk/bin/testfiles/SlowCharsFeature_HttpClient4.csv>
        label,responseCode,responseMessage,threadName,dataType,success
JSS_setCPS,200,OK,setUp Thread Group 1-1,text,true
ApacheJMeter-HP-NonSecure,206,Partial Content,Thread Group 1-1,text,true
ApacheJMeter-HP-Secure,206,Partial Content,Thread Group 1-1,text,true
HTTPS-SNI-without-timeout,206,Partial Content,Thread Group 1-1,text,true
HTTPS-SNI-with-timeout,206,Partial Content,Thread Group 1-1,text,true

        <https://builds.apache.org/job/JMeter%20Ubuntu/ws/trunk/bin/SlowCharsFeature_HttpClient4.csv>
        label,responseCode,responseMessage,threadName,dataType,success
JSS_setCPS,200,OK,setUp Thread Group 1-1,text,true
ApacheJMeter-HP-NonSecure,206,Partial Content,Thread Group 1-1,text,true
ApacheJMeter-HP-Secure,206,Partial Content,Thread Group 1-1,text,true
HTTPS-SNI-without-timeout,206,Partial Content,Thread Group 1-1,text,true
HTTPS-SNI-with-timeout,206,Partial Content,Thread Group 1-1,text,false

Total time: 6 minutes 16 seconds
Build step 'Invoke Ant' marked build as failure
WARN: Unable to locate 'report-task.txt' in the workspace. Did the SonarScanner succedeed?
[locks-and-latches] Releasing all the locks
[locks-and-latches] All the locks released

Mime
View raw message