jmeter-dev mailing list archives

Site index · List index
Message view « Date » · « Thread »
Top « Date » · « Thread »
From Felix Schumacher <felix.schumac...@internetallee.de>
Subject Re: Build failed in Jenkins: JMeter Ubuntu #497
Date Sun, 15 Jul 2018 18:56:18 GMT


Am 15.07.2018 um 18:48 schrieb Felix Schumacher:
>
>
> Am 15.07.2018 um 15:30 schrieb Philippe Mouawad:
>> Hello,
>>
>> Could anybody else than me have a look at this unexplained and very
>> frequent failure of this test ?
>> SlowCharsFeature_HttpClient
>> <https://builds.apache.org/job/JMeter%20Ubuntu/ws/trunk/bin/SlowCharsFeature_HttpClient4.csv>

>>
>>
>> Tests are mainly flaky because of it.
>> I didn't find the problem and cannot tell wether it's a bug or false
> I think it is a bug somewhere on our side. The result size assertion 
> fires as it thinks it has not seen 7000 bytes, but the saved response 
> shows, that we got all our 7000 bytes.
>
> Now the question remains, where do we do the counting and why do we 
> get  so confused while doing so.
Here is a log snippet when things go wrong:

2018-07-15 20:51:32,090 INFO o.a.j.s.SampleResult: Bodysize: 4926 
responseData.length: 7001
2018-07-15 20:51:32,090 DEBUG o.a.j.p.h.s.HTTPHC4Impl: 
ResponseHeadersSize=635 Content-Length=4926 Total=5561

Somehow bodysize gets set to a wrong value, while responseData is OK.

Felix

>
> Felix
>
>> positive
>>
>>
>> Thanks
>>
>> On Sun, Jul 15, 2018 at 9:28 AM, Apache Jenkins Server <
>> jenkins@builds.apache.org> wrote:
>>
>>> See <https://builds.apache.org/job/JMeter%20Ubuntu/497/
>>> display/redirect?page=changes>
>>>
>>> Changes:
>>>
>>> [pmouawad] Bug 62533 - Allow use epoch time as Date String value in
>>> function __dateTimeConvert
>>> Add Test
>>> Clarify documentation
>>> Bugzilla Id: 62533
>>>
>>> [pmouawad] Bug 62535 - View Results Tree : XPath2 Tester not displaying
>>> correctly
>>> Bugzilla Id: 62535
>>>
>>> ------------------------------------------
>>> [...truncated 174.04 KB...]
>>>     [jmeter] summary +      2 in 00:00:02 =    0.9/s Avg: 938 Min:  

>>> 803
>>> Max:  1073 Err:     0 (0.00%) Active: 1 Started: 1 Finished: 0
>>>     [jmeter] summary =      2 in 00:00:02 =    0.9/s Avg: 938 Min:  

>>> 803
>>> Max:  1073 Err:     0 (0.00%)
>>>     [jmeter] Tidying up ...    @ Sun Jul 15 13:26:00 UTC 2018
>>> (1531661160989)
>>>     [jmeter] ... end of run
>>>       [echo] TEST_HTTPS output files compared OK
>>>
>>> batchtest:
>>>       [echo] Starting TestCookieManager with file TestCookieManager.jmx
>>> using -X -Jdummy=dummy
>>>     [jmeter] SLF4J: Class path contains multiple SLF4J bindings.
>>>     [jmeter] SLF4J: Found binding in [jar:<https://builds.apache.
>>> org/job/JMeter%20Ubuntu/ws/trunk/lib/log4j-slf4j-impl-2.
>>> 10.0.jar!/org/slf4j/impl/StaticLoggerBinder.class]>
>>>     [jmeter] SLF4J: Found binding in [jar:<https://builds.apache.
>>> org/job/JMeter%20Ubuntu/ws/trunk/lib/opt/activemq-all-5.
>>> 15.2.jar!/org/slf4j/impl/StaticLoggerBinder.class]>
>>>     [jmeter] SLF4J: See 
>>> http://www.slf4j.org/codes.html#multiple_bindings
>>> for an explanation.
>>>     [jmeter] SLF4J: Actual binding is of type 
>>> [org.apache.logging.slf4j.
>>> Log4jLoggerFactory]
>>>     [jmeter] Creating summariser <summary>
>>>     [jmeter] Created the tree successfully using
>>> testfiles/TestCookieManager.jmx
>>>     [jmeter] Starting the test @ Sun Jul 15 13:26:03 UTC 2018
>>> (1531661163453)
>>>     [jmeter] Waiting for possible Shutdown/StopTestNow/Heapdump 
>>> message on
>>> port 4445
>>>     [jmeter] summary +      1 in 00:00:01 =    1.7/s Avg: 558 Min:  

>>> 558
>>> Max:   558 Err:     0 (0.00%) Active: 1 Started: 1 Finished: 0
>>>     [jmeter] summary +      9 in 00:00:01 =   11.5/s Avg: 49 Min:    
1
>>> Max:   305 Err:     0 (0.00%) Active: 0 Started: 1 Finished: 1
>>>     [jmeter] summary =     10 in 00:00:01 =    7.3/s Avg: 100 
>>> Min:     1
>>> Max:   558 Err:     0 (0.00%)
>>>     [jmeter] Tidying up ...    @ Sun Jul 15 13:26:05 UTC 2018
>>> (1531661165931)
>>>     [jmeter] ... end of run
>>>       [echo] TestCookieManager output files compared OK
>>>
>>> batchtest:
>>>       [echo] Starting TCP_TESTS with file TCP_TESTS.jmx using -X
>>> -Jdummy=dummy
>>>     [jmeter] SLF4J: Class path contains multiple SLF4J bindings.
>>>     [jmeter] SLF4J: Found binding in [jar:<https://builds.apache.
>>> org/job/JMeter%20Ubuntu/ws/trunk/lib/log4j-slf4j-impl-2.
>>> 10.0.jar!/org/slf4j/impl/StaticLoggerBinder.class]>
>>>     [jmeter] SLF4J: Found binding in [jar:<https://builds.apache.
>>> org/job/JMeter%20Ubuntu/ws/trunk/lib/opt/activemq-all-5.
>>> 15.2.jar!/org/slf4j/impl/StaticLoggerBinder.class]>
>>>     [jmeter] SLF4J: See 
>>> http://www.slf4j.org/codes.html#multiple_bindings
>>> for an explanation.
>>>     [jmeter] SLF4J: Actual binding is of type 
>>> [org.apache.logging.slf4j.
>>> Log4jLoggerFactory]
>>>     [jmeter] Creating summariser <summary>
>>>     [jmeter] Created the tree successfully using 
>>> testfiles/TCP_TESTS.jmx
>>>     [jmeter] Starting the test @ Sun Jul 15 13:26:09 UTC 2018
>>> (1531661169272)
>>>     [jmeter] Waiting for possible Shutdown/StopTestNow/Heapdump 
>>> message on
>>> port 4445
>>>     [jmeter] 15/07/2018 13:26:13
>>>     [jmeter]
>>>     [jmeter]
>>>     [jmeter] summary =     11 in 00:00:05 =    2.0/s Avg: 360 
>>> Min:     1
>>> Max:  1022 Err:     0 (0.00%)
>>>     [jmeter] Tidying up ...    @ Sun Jul 15 13:26:15 UTC 2018
>>> (1531661175786)
>>>     [jmeter] ... end of run
>>>     [concat] 2018-07-15 13:26:13,698 ERROR o.a.j.p.t.s.TCPSampler:
>>>     [concat] org.apache.jmeter.protocol.tcp.sampler.ReadException: 
>>> Error
>>> reading from server, bytes read: 0
>>>     [concat]     at 
>>> org.apache.jmeter.protocol.tcp.sampler.TCPClientImpl.read(TCPClientImpl.java:131)
>>> ~[ApacheJMeter_tcp.jar:4.1-SNAPSHOT r1835969]
>>>     [concat]     at org.apache.jmeter.protocol.
>>> tcp.sampler.TCPSampler.sample(TCPSampler.java:402)
>>> [ApacheJMeter_tcp.jar:4.1-SNAPSHOT r1835969]
>>>     [concat]     at 
>>> org.apache.jmeter.threads.JMeterThread.doSampling(JMeterThread.java:622) 
>>>
>>> [ApacheJMeter_core.jar:4.1-SNAPSHOT r1835969]
>>>     [concat]     at org.apache.jmeter.threads.JMeterThread.
>>> executeSamplePackage(JMeterThread.java:546) 
>>> [ApacheJMeter_core.jar:4.1-SNAPSHOT
>>> r1835969]
>>>     [concat]     at 
>>> org.apache.jmeter.threads.JMeterThread.processSampler(JMeterThread.java:486)
>>> [ApacheJMeter_core.jar:4.1-SNAPSHOT r1835969]
>>>     [concat]     at org.apache.jmeter.threads.
>>> JMeterThread.run(JMeterThread.java:253) 
>>> [ApacheJMeter_core.jar:4.1-SNAPSHOT
>>> r1835969]
>>>     [concat]     at java.lang.Thread.run(Thread.java:748) [?:1.8.0_172]
>>>     [concat] Caused by: java.net.SocketTimeoutException: Read timed out
>>>     [concat]     at java.net.SocketInputStream.socketRead0(Native 
>>> Method)
>>> ~[?:1.8.0_172]
>>>     [concat]     at java.net.SocketInputStream.
>>> socketRead(SocketInputStream.java:116) ~[?:1.8.0_172]
>>>     [concat]     at 
>>> java.net.SocketInputStream.read(SocketInputStream.java:171)
>>> ~[?:1.8.0_172]
>>>     [concat]     at 
>>> java.net.SocketInputStream.read(SocketInputStream.java:141)
>>> ~[?:1.8.0_172]
>>>     [concat]     at 
>>> java.net.SocketInputStream.read(SocketInputStream.java:127)
>>> ~[?:1.8.0_172]
>>>     [concat]     at 
>>> org.apache.jmeter.protocol.tcp.sampler.TCPClientImpl.read(TCPClientImpl.java:114)
>>> ~[ApacheJMeter_tcp.jar:4.1-SNAPSHOT r1835969]
>>>     [concat]     ... 6 more
>>>     [concat] 2018-07-15 13:26:14,780 ERROR o.a.j.p.t.s.TCPSampler:
>>>     [concat] org.apache.jmeter.protocol.tcp.sampler.ReadException:
>>>     [concat]     at org.apache.jmeter.protocol.tcp.sampler.
>>> BinaryTCPClientImpl.read(BinaryTCPClientImpl.java:152)
>>> ~[ApacheJMeter_tcp.jar:4.1-SNAPSHOT r1835969]
>>>     [concat]     at org.apache.jmeter.protocol.
>>> tcp.sampler.TCPSampler.sample(TCPSampler.java:402)
>>> [ApacheJMeter_tcp.jar:4.1-SNAPSHOT r1835969]
>>>     [concat]     at 
>>> org.apache.jmeter.threads.JMeterThread.doSampling(JMeterThread.java:622) 
>>>
>>> [ApacheJMeter_core.jar:4.1-SNAPSHOT r1835969]
>>>     [concat]     at org.apache.jmeter.threads.JMeterThread.
>>> executeSamplePackage(JMeterThread.java:546) 
>>> [ApacheJMeter_core.jar:4.1-SNAPSHOT
>>> r1835969]
>>>     [concat]     at 
>>> org.apache.jmeter.threads.JMeterThread.processSampler(JMeterThread.java:486)
>>> [ApacheJMeter_core.jar:4.1-SNAPSHOT r1835969]
>>>     [concat]     at org.apache.jmeter.threads.
>>> JMeterThread.run(JMeterThread.java:253) 
>>> [ApacheJMeter_core.jar:4.1-SNAPSHOT
>>> r1835969]
>>>     [concat]     at java.lang.Thread.run(Thread.java:748) [?:1.8.0_172]
>>>     [concat] Caused by: java.net.SocketTimeoutException: Read timed out
>>>     [concat]     at java.net.SocketInputStream.socketRead0(Native 
>>> Method)
>>> ~[?:1.8.0_172]
>>>     [concat]     at java.net.SocketInputStream.
>>> socketRead(SocketInputStream.java:116) ~[?:1.8.0_172]
>>>     [concat]     at 
>>> java.net.SocketInputStream.read(SocketInputStream.java:171)
>>> ~[?:1.8.0_172]
>>>     [concat]     at 
>>> java.net.SocketInputStream.read(SocketInputStream.java:141)
>>> ~[?:1.8.0_172]
>>>     [concat]     at 
>>> java.net.SocketInputStream.read(SocketInputStream.java:127)
>>> ~[?:1.8.0_172]
>>>     [concat]     at org.apache.jmeter.protocol.tcp.sampler.
>>> BinaryTCPClientImpl.read(BinaryTCPClientImpl.java:134)
>>> ~[ApacheJMeter_tcp.jar:4.1-SNAPSHOT r1835969]
>>>     [concat]     ... 6 more
>>>     [concat] 2018-07-15 13:26:14,800 WARN o.a.j.p.t.s.TCPSampler: 
>>> Could not
>>> create socket for tcp://localhost:2223
>>>     [concat] java.net.ConnectException: Connection refused (Connection
>>> refused)
>>>     [concat]     at java.net.PlainSocketImpl.socketConnect(Native 
>>> Method)
>>> ~[?:1.8.0_172]
>>>     [concat]     at java.net.AbstractPlainSocketImpl.doConnect(
>>> AbstractPlainSocketImpl.java:350) ~[?:1.8.0_172]
>>>     [concat]     at java.net.AbstractPlainSocketImpl.connectToAddress(
>>> AbstractPlainSocketImpl.java:206) ~[?:1.8.0_172]
>>>     [concat]     at java.net.AbstractPlainSocketImpl.connect(
>>> AbstractPlainSocketImpl.java:188) ~[?:1.8.0_172]
>>>     [concat]     at 
>>> java.net.SocksSocketImpl.connect(SocksSocketImpl.java:392)
>>> ~[?:1.8.0_172]
>>>     [concat]     at java.net.Socket.connect(Socket.java:589) 
>>> ~[?:1.8.0_172]
>>>     [concat]     at 
>>> org.apache.jmeter.protocol.tcp.sampler.TCPSampler.getSocket(TCPSampler.java:168)
>>> [ApacheJMeter_tcp.jar:4.1-SNAPSHOT r1835969]
>>>     [concat]     at org.apache.jmeter.protocol.
>>> tcp.sampler.TCPSampler.sample(TCPSampler.java:384)
>>> [ApacheJMeter_tcp.jar:4.1-SNAPSHOT r1835969]
>>>     [concat]     at 
>>> org.apache.jmeter.threads.JMeterThread.doSampling(JMeterThread.java:622) 
>>>
>>> [ApacheJMeter_core.jar:4.1-SNAPSHOT r1835969]
>>>     [concat]     at org.apache.jmeter.threads.JMeterThread.
>>> executeSamplePackage(JMeterThread.java:546) 
>>> [ApacheJMeter_core.jar:4.1-SNAPSHOT
>>> r1835969]
>>>     [concat]     at 
>>> org.apache.jmeter.threads.JMeterThread.processSampler(JMeterThread.java:486)
>>> [ApacheJMeter_core.jar:4.1-SNAPSHOT r1835969]
>>>     [concat]     at org.apache.jmeter.threads.
>>> JMeterThread.run(JMeterThread.java:253) 
>>> [ApacheJMeter_core.jar:4.1-SNAPSHOT
>>> r1835969]
>>>     [concat]     at java.lang.Thread.run(Thread.java:748) [?:1.8.0_172]
>>>     [concat] 2018-07-15 13:26:14,886 WARN o.a.j.p.t.s.TCPSampler: 
>>> Unknown
>>> host for tcp://localhostXXXX:2223
>>>     [concat] java.net.UnknownHostException: localhostXXXX
>>>     [concat]     at java.net.AbstractPlainSocketImpl.connect(
>>> AbstractPlainSocketImpl.java:184) ~[?:1.8.0_172]
>>>     [concat]     at 
>>> java.net.SocksSocketImpl.connect(SocksSocketImpl.java:392)
>>> ~[?:1.8.0_172]
>>>     [concat]     at java.net.Socket.connect(Socket.java:589) 
>>> ~[?:1.8.0_172]
>>>     [concat]     at 
>>> org.apache.jmeter.protocol.tcp.sampler.TCPSampler.getSocket(TCPSampler.java:168)
>>> [ApacheJMeter_tcp.jar:4.1-SNAPSHOT r1835969]
>>>     [concat]     at org.apache.jmeter.protocol.
>>> tcp.sampler.TCPSampler.sample(TCPSampler.java:384)
>>> [ApacheJMeter_tcp.jar:4.1-SNAPSHOT r1835969]
>>>     [concat]     at 
>>> org.apache.jmeter.threads.JMeterThread.doSampling(JMeterThread.java:622) 
>>>
>>> [ApacheJMeter_core.jar:4.1-SNAPSHOT r1835969]
>>>     [concat]     at org.apache.jmeter.threads.JMeterThread.
>>> executeSamplePackage(JMeterThread.java:546) 
>>> [ApacheJMeter_core.jar:4.1-SNAPSHOT
>>> r1835969]
>>>     [concat]     at 
>>> org.apache.jmeter.threads.JMeterThread.processSampler(JMeterThread.java:486)
>>> [ApacheJMeter_core.jar:4.1-SNAPSHOT r1835969]
>>>     [concat]     at org.apache.jmeter.threads.
>>> JMeterThread.run(JMeterThread.java:253) 
>>> [ApacheJMeter_core.jar:4.1-SNAPSHOT
>>> r1835969]
>>>     [concat]     at java.lang.Thread.run(Thread.java:748) [?:1.8.0_172]
>>>     [concat] 2018-07-15 13:26:14,890 ERROR o.a.j.p.t.s.TCPSampler: 
>>> Could
>>> not find protocol class 'org.foo.xxx'
>>>       [echo] TCP_TESTS output files compared OK
>>>
>>> batchtest:
>>>       [echo] Starting JDBC_TESTS with file JDBC_TESTS.jmx using -X
>>> -Jdummy=dummy
>>>     [jmeter] SLF4J: Class path contains multiple SLF4J bindings.
>>>     [jmeter] SLF4J: Found binding in [jar:<https://builds.apache.
>>> org/job/JMeter%20Ubuntu/ws/trunk/lib/log4j-slf4j-impl-2.
>>> 10.0.jar!/org/slf4j/impl/StaticLoggerBinder.class]>
>>>     [jmeter] SLF4J: Found binding in [jar:<https://builds.apache.
>>> org/job/JMeter%20Ubuntu/ws/trunk/lib/opt/activemq-all-5.
>>> 15.2.jar!/org/slf4j/impl/StaticLoggerBinder.class]>
>>>     [jmeter] SLF4J: See 
>>> http://www.slf4j.org/codes.html#multiple_bindings
>>> for an explanation.
>>>     [jmeter] SLF4J: Actual binding is of type 
>>> [org.apache.logging.slf4j.
>>> Log4jLoggerFactory]
>>>     [jmeter] Creating summariser <summary>
>>>     [jmeter] Created the tree successfully using 
>>> testfiles/JDBC_TESTS.jmx
>>>     [jmeter] Starting the test @ Sun Jul 15 13:26:18 UTC 2018
>>> (1531661178403)
>>>     [jmeter] Waiting for possible Shutdown/StopTestNow/Heapdump 
>>> message on
>>> port 4445
>>>     [jmeter] summary =     21 in 00:00:02 =   13.0/s Avg: 28 Min:    
0
>>> Max:   541 Err:     0 (0.00%)
>>>     [jmeter] Tidying up ...    @ Sun Jul 15 13:26:21 UTC 2018
>>> (1531661181153)
>>>     [jmeter] ... end of run
>>>     [concat] 2018-07-15 13:26:21,127 ERROR o.a.j.t.JMeterThread: Error
>>> while processing sampler: 'JDBC_With_Failing_PreProcessor'.
>>>     [concat] java.lang.IllegalArgumentException: Variable Name must 
>>> not be
>>> null in JDBC PreProcessor
>>>     [concat]     at org.apache.jmeter.protocol.jdbc.processor.
>>> AbstractJDBCProcessor.process(AbstractJDBCProcessor.java:45)
>>> ~[ApacheJMeter_jdbc.jar:4.1-SNAPSHOT r1835969]
>>>     [concat]     at org.apache.jmeter.protocol.jdbc.processor.
>>> JDBCPreProcessor.process(JDBCPreProcessor.java:33)
>>> ~[ApacheJMeter_jdbc.jar:4.1-SNAPSHOT r1835969]
>>>     [concat]     at org.apache.jmeter.threads.
>>> JMeterThread.runPreProcessors(JMeterThread.java:935)
>>> ~[ApacheJMeter_core.jar:4.1-SNAPSHOT r1835969]
>>>     [concat]     at org.apache.jmeter.threads.JMeterThread.
>>> executeSamplePackage(JMeterThread.java:537) 
>>> ~[ApacheJMeter_core.jar:4.1-SNAPSHOT
>>> r1835969]
>>>     [concat]     at 
>>> org.apache.jmeter.threads.JMeterThread.processSampler(JMeterThread.java:486)
>>> [ApacheJMeter_core.jar:4.1-SNAPSHOT r1835969]
>>>     [concat]     at org.apache.jmeter.threads.
>>> JMeterThread.run(JMeterThread.java:253) 
>>> [ApacheJMeter_core.jar:4.1-SNAPSHOT
>>> r1835969]
>>>     [concat]     at java.lang.Thread.run(Thread.java:748) [?:1.8.0_172]
>>>     [concat] 2018-07-15 13:26:21,138 ERROR o.a.j.t.JMeterThread: Error
>>> while processing sampler: 'JDBC_With_Failing_PostProcessor'.
>>>     [concat] java.lang.IllegalArgumentException: Variable Name must 
>>> not be
>>> null in JDBC PostProcessor
>>>     [concat]     at org.apache.jmeter.protocol.jdbc.processor.
>>> AbstractJDBCProcessor.process(AbstractJDBCProcessor.java:45)
>>> ~[ApacheJMeter_jdbc.jar:4.1-SNAPSHOT r1835969]
>>>     [concat]     at org.apache.jmeter.protocol.jdbc.processor.
>>> JDBCPostProcessor.process(JDBCPostProcessor.java:33)
>>> ~[ApacheJMeter_jdbc.jar:4.1-SNAPSHOT r1835969]
>>>     [concat]     at org.apache.jmeter.threads.JMeterThread.
>>> runPostProcessors(JMeterThread.java:925) 
>>> ~[ApacheJMeter_core.jar:4.1-SNAPSHOT
>>> r1835969]
>>>     [concat]     at org.apache.jmeter.threads.JMeterThread.
>>> executeSamplePackage(JMeterThread.java:564) 
>>> ~[ApacheJMeter_core.jar:4.1-SNAPSHOT
>>> r1835969]
>>>     [concat]     at 
>>> org.apache.jmeter.threads.JMeterThread.processSampler(JMeterThread.java:486)
>>> [ApacheJMeter_core.jar:4.1-SNAPSHOT r1835969]
>>>     [concat]     at org.apache.jmeter.threads.
>>> JMeterThread.run(JMeterThread.java:253) 
>>> [ApacheJMeter_core.jar:4.1-SNAPSHOT
>>> r1835969]
>>>     [concat]     at java.lang.Thread.run(Thread.java:748) [?:1.8.0_172]
>>>     [concat] 2018-07-15 13:26:21,139 WARN 
>>> o.a.j.p.j.p.AbstractJDBCProcessor:
>>> SQL Problem in JDBC PreProcessor: java.sql.SQLSyntaxErrorException:
>>> unexpected token: USERS
>>>     [concat] 2018-07-15 13:26:21,149 WARN 
>>> o.a.j.p.j.p.AbstractJDBCProcessor:
>>> SQL Problem in JDBC PostProcessor: java.sql.SQLSyntaxErrorException:
>>> unexpected token: USERS
>>>       [echo] JDBC_TESTS output files compared OK
>>>
>>> batchtest:
>>>       [echo] Starting JMS_TESTS with file JMS_TESTS.jmx using -X
>>> -Jdummy=dummy
>>>     [jmeter] SLF4J: Class path contains multiple SLF4J bindings.
>>>     [jmeter] SLF4J: Found binding in [jar:<https://builds.apache.
>>> org/job/JMeter%20Ubuntu/ws/trunk/lib/log4j-slf4j-impl-2.
>>> 10.0.jar!/org/slf4j/impl/StaticLoggerBinder.class]>
>>>     [jmeter] SLF4J: Found binding in [jar:<https://builds.apache.
>>> org/job/JMeter%20Ubuntu/ws/trunk/lib/opt/activemq-all-5.
>>> 15.2.jar!/org/slf4j/impl/StaticLoggerBinder.class]>
>>>     [jmeter] SLF4J: See 
>>> http://www.slf4j.org/codes.html#multiple_bindings
>>> for an explanation.
>>>     [jmeter] SLF4J: Actual binding is of type 
>>> [org.apache.logging.slf4j.
>>> Log4jLoggerFactory]
>>>     [jmeter] Creating summariser <summary>
>>>     [jmeter] Created the tree successfully using 
>>> testfiles/JMS_TESTS.jmx
>>>     [jmeter] Starting the test @ Sun Jul 15 13:26:23 UTC 2018
>>> (1531661183853)
>>>     [jmeter] Waiting for possible Shutdown/StopTestNow/Heapdump 
>>> message on
>>> port 4445
>>>     [jmeter] summary +      6 in 00:00:07 =    0.9/s Avg: 805 
>>> Min:     6
>>> Max:  2404 Err:     0 (0.00%) Active: 1 Started: 1 Finished: 0
>>>     [jmeter] summary +     21 in 00:00:29 =    0.7/s Avg: 540 
>>> Min:     0
>>> Max:  3001 Err:     0 (0.00%) Active: 1 Started: 1 Finished: 0
>>>     [jmeter] summary =     27 in 00:00:36 =    0.8/s Avg: 599 
>>> Min:     0
>>> Max:  3001 Err:     0 (0.00%)
>>>     [jmeter] summary =     27 in 00:00:36 =    0.8/s Avg: 599 
>>> Min:     0
>>> Max:  3001 Err:     0 (0.00%)
>>>     [jmeter] Tidying up ...    @ Sun Jul 15 13:27:00 UTC 2018
>>> (1531661220805)
>>>     [jmeter] ... end of run
>>>       [echo] JMS_TESTS output files compared OK
>>>
>>> batchtest:
>>>       [echo] Starting OS_TESTS with file OS_TESTS.jmx using -X 
>>> -Jdummy=dummy
>>>     [jmeter] SLF4J: Class path contains multiple SLF4J bindings.
>>>     [jmeter] SLF4J: Found binding in [jar:<https://builds.apache.
>>> org/job/JMeter%20Ubuntu/ws/trunk/lib/log4j-slf4j-impl-2.
>>> 10.0.jar!/org/slf4j/impl/StaticLoggerBinder.class]>
>>>     [jmeter] SLF4J: Found binding in [jar:<https://builds.apache.
>>> org/job/JMeter%20Ubuntu/ws/trunk/lib/opt/activemq-all-5.
>>> 15.2.jar!/org/slf4j/impl/StaticLoggerBinder.class]>
>>>     [jmeter] SLF4J: See 
>>> http://www.slf4j.org/codes.html#multiple_bindings
>>> for an explanation.
>>>     [jmeter] SLF4J: Actual binding is of type 
>>> [org.apache.logging.slf4j.
>>> Log4jLoggerFactory]
>>>     [jmeter] Creating summariser <summary>
>>>     [jmeter] Created the tree successfully using testfiles/OS_TESTS.jmx
>>>     [jmeter] Starting the test @ Sun Jul 15 13:27:03 UTC 2018
>>> (1531661223737)
>>>     [jmeter] Waiting for possible Shutdown/StopTestNow/Heapdump 
>>> message on
>>> port 4445
>>>     [jmeter] summary +      1 in 00:00:01 =    1.1/s Avg: 13 Min:   
13
>>> Max:    13 Err:     0 (0.00%) Active: 1 Started: 1 Finished: 0
>>>     [jmeter] summary +      2 in 00:00:01 =    1.9/s Avg: 502 
>>> Min:     2
>>> Max:  1003 Err:     0 (0.00%) Active: 0 Started: 1 Finished: 1
>>>     [jmeter] summary =      3 in 00:00:02 =    1.5/s Avg: 339 
>>> Min:     2
>>> Max:  1003 Err:     0 (0.00%)
>>>     [jmeter] Tidying up ...    @ Sun Jul 15 13:27:06 UTC 2018
>>> (1531661226016)
>>>     [jmeter] ... end of run
>>>       [echo] OS_TESTS output files compared OK
>>>
>>> batchtest:
>>>       [echo] Starting FTP_TESTS with file FTP_TESTS.jmx using -X
>>> -Jdummy=dummy
>>>     [jmeter] SLF4J: Class path contains multiple SLF4J bindings.
>>>     [jmeter] SLF4J: Found binding in [jar:<https://builds.apache.
>>> org/job/JMeter%20Ubuntu/ws/trunk/lib/log4j-slf4j-impl-2.
>>> 10.0.jar!/org/slf4j/impl/StaticLoggerBinder.class]>
>>>     [jmeter] SLF4J: Found binding in [jar:<https://builds.apache.
>>> org/job/JMeter%20Ubuntu/ws/trunk/lib/opt/activemq-all-5.
>>> 15.2.jar!/org/slf4j/impl/StaticLoggerBinder.class]>
>>>     [jmeter] SLF4J: See 
>>> http://www.slf4j.org/codes.html#multiple_bindings
>>> for an explanation.
>>>     [jmeter] SLF4J: Actual binding is of type 
>>> [org.apache.logging.slf4j.
>>> Log4jLoggerFactory]
>>>     [jmeter] Creating summariser <summary>
>>>     [jmeter] Created the tree successfully using 
>>> testfiles/FTP_TESTS.jmx
>>>     [jmeter] Starting the test @ Sun Jul 15 13:27:08 UTC 2018
>>> (1531661228622)
>>>     [jmeter] Waiting for possible Shutdown/StopTestNow/Heapdump 
>>> message on
>>> port 4445
>>>     [jmeter] summary =      6 in 00:00:03 =    2.3/s Avg: 210 
>>> Min:    15
>>> Max:   997 Err:     0 (0.00%)
>>>     [jmeter] Tidying up ...    @ Sun Jul 15 13:27:12 UTC 2018
>>> (1531661232116)
>>>     [jmeter] ... end of run
>>>       [echo] FTP_TESTS output files compared OK
>>>
>>> batchtest:
>>>       [echo] Starting Bug60607 with file Bug60607.jmx using -X 
>>> -Jdummy=dummy
>>>     [jmeter] SLF4J: Class path contains multiple SLF4J bindings.
>>>     [jmeter] SLF4J: Found binding in [jar:<https://builds.apache.
>>> org/job/JMeter%20Ubuntu/ws/trunk/lib/log4j-slf4j-impl-2.
>>> 10.0.jar!/org/slf4j/impl/StaticLoggerBinder.class]>
>>>     [jmeter] SLF4J: Found binding in [jar:<https://builds.apache.
>>> org/job/JMeter%20Ubuntu/ws/trunk/lib/opt/activemq-all-5.
>>> 15.2.jar!/org/slf4j/impl/StaticLoggerBinder.class]>
>>>     [jmeter] SLF4J: See 
>>> http://www.slf4j.org/codes.html#multiple_bindings
>>> for an explanation.
>>>     [jmeter] SLF4J: Actual binding is of type 
>>> [org.apache.logging.slf4j.
>>> Log4jLoggerFactory]
>>>     [jmeter] Creating summariser <summary>
>>>     [jmeter] Created the tree successfully using testfiles/Bug60607.jmx
>>>     [jmeter] Starting the test @ Sun Jul 15 13:27:14 UTC 2018
>>> (1531661234692)
>>>     [jmeter] Waiting for possible Shutdown/StopTestNow/Heapdump 
>>> message on
>>> port 4445
>>>     [jmeter] summary =      2 in 00:00:31 =    0.1/s Avg: 15305 
>>> Min:   507
>>> Max: 30103 Err:     0 (0.00%)
>>>     [jmeter] Tidying up ...    @ Sun Jul 15 13:27:46 UTC 2018
>>> (1531661266416)
>>>     [jmeter] ... end of run
>>>       [echo] Bug60607 output files compared OK
>>>
>>> batchtest:
>>>       [echo] Starting SlowCharsFeature_HttpClient4 with file
>>> SlowCharsFeature.jmx using -X -Jdummy=dummy
>>>     [jmeter] SLF4J: Class path contains multiple SLF4J bindings.
>>>     [jmeter] SLF4J: Found binding in [jar:<https://builds.apache.
>>> org/job/JMeter%20Ubuntu/ws/trunk/lib/log4j-slf4j-impl-2.
>>> 10.0.jar!/org/slf4j/impl/StaticLoggerBinder.class]>
>>>     [jmeter] SLF4J: Found binding in [jar:<https://builds.apache.
>>> org/job/JMeter%20Ubuntu/ws/trunk/lib/opt/activemq-all-5.
>>> 15.2.jar!/org/slf4j/impl/StaticLoggerBinder.class]>
>>>     [jmeter] SLF4J: See 
>>> http://www.slf4j.org/codes.html#multiple_bindings
>>> for an explanation.
>>>     [jmeter] SLF4J: Actual binding is of type 
>>> [org.apache.logging.slf4j.
>>> Log4jLoggerFactory]
>>>     [jmeter] Creating summariser <summary>
>>>     [jmeter] Created the tree successfully using
>>> testfiles/SlowCharsFeature.jmx
>>>     [jmeter] Starting the test @ Sun Jul 15 13:27:49 UTC 2018
>>> (1531661269565)
>>>     [jmeter] Waiting for possible Shutdown/StopTestNow/Heapdump 
>>> message on
>>> port 4445
>>>     [jmeter] summary =      5 in 00:00:32 =    0.2/s Avg: 6279 
>>> Min:   555
>>> Max: 11231 Err:     2 (40.00%)
>>>     [jmeter] Tidying up ...    @ Sun Jul 15 13:28:22 UTC 2018
>>> (1531661302228)
>>>     [jmeter] ... end of run
>>>
>>> BUILD FAILED
>>> <https://builds.apache.org/job/JMeter%20Ubuntu/ws/trunk/build.xml>:2956:

>>>
>>> The following error occurred while executing this line:
>>> <https://builds.apache.org/job/JMeter%20Ubuntu/ws/trunk/build.xml>:2779:

>>>
>>> CSV Files are not identical.
>>> <https://builds.apache.org/job/JMeter%20Ubuntu/ws/trunk/
>>> bin/testfiles/SlowCharsFeature_HttpClient4.csv>
>>> label,responseCode,responseMessage,threadName,dataType,success
>>> JSS_setCPS,200,OK,setUp Thread Group 1-1,text,true
>>> ApacheJMeter-HP-NonSecure,206,Partial Content,Thread Group 
>>> 1-1,text,true
>>> ApacheJMeter-HP-Secure,206,Partial Content,Thread Group 1-1,text,true
>>> HTTPS-SNI-without-timeout,206,Partial Content,Thread Group 
>>> 1-1,text,true
>>> HTTPS-SNI-with-timeout,206,Partial Content,Thread Group 1-1,text,true
>>>
>>> <https://builds.apache.org/job/JMeter%20Ubuntu/ws/trunk/
>>> bin/SlowCharsFeature_HttpClient4.csv>
>>> label,responseCode,responseMessage,threadName,dataType,success
>>> JSS_setCPS,200,OK,setUp Thread Group 1-1,text,true
>>> ApacheJMeter-HP-NonSecure,206,Partial Content,Thread Group 
>>> 1-1,text,true
>>> ApacheJMeter-HP-Secure,206,Partial Content,Thread Group 1-1,text,true
>>> HTTPS-SNI-without-timeout,206,Partial Content,Thread Group 
>>> 1-1,text,false
>>> HTTPS-SNI-with-timeout,206,Partial Content,Thread Group 1-1,text,false
>>>
>>> Total time: 7 minutes 16 seconds
>>> Build step 'Invoke Ant' marked build as failure
>>> WARN: Unable to locate 'report-task.txt' in the workspace. Did the
>>> SonarScanner succedeed?
>>> [locks-and-latches] Releasing all the locks
>>> [locks-and-latches] All the locks released
>>>
>>
>>
>


Mime
View raw message