jmeter-dev mailing list archives

Site index · List index
Message view « Date » · « Thread »
Top « Date » · « Thread »
From Apache Jenkins Server <jenk...@builds.apache.org>
Subject Build failed in Jenkins: JMeter-trunk #6841
Date Thu, 12 Jul 2018 09:06:28 GMT
See <https://builds.apache.org/job/JMeter-trunk/6841/display/redirect?page=changes>

Changes:

[milamber] Allow use epoch time as Date String value in function __dateTimeConvert
Bugzilla Id: 62533

------------------------------------------
[...truncated 192.96 KB...]
   [jmeter] summary +      1 in 00:00:00 =    2.0/s Avg:   488 Min:   488 Max:   488 Err:
    0 (0.00%) Active: 0 Started: 1 Finished: 1
   [jmeter] summary =      2 in 00:00:02 =    1.2/s Avg:   588 Min:   488 Max:   689 Err:
    0 (0.00%)
   [jmeter] Tidying up ...    @ Thu Jul 12 09:04:05 UTC 2018 (1531386245924)
   [jmeter] ... end of run
     [echo] TEST_HTTPS output files compared OK

batchtest:
     [echo] Starting TestCookieManager with file TestCookieManager.jmx using -X -Jdummy=dummy
   [jmeter] SLF4J: Class path contains multiple SLF4J bindings.
   [jmeter] SLF4J: Found binding in [jar:<https://builds.apache.org/job/JMeter-trunk/ws/trunk/lib/log4j-slf4j-impl-2.10.0.jar!/org/slf4j/impl/StaticLoggerBinder.class]>
   [jmeter] SLF4J: Found binding in [jar:<https://builds.apache.org/job/JMeter-trunk/ws/trunk/lib/opt/activemq-all-5.15.2.jar!/org/slf4j/impl/StaticLoggerBinder.class]>
   [jmeter] SLF4J: See http://www.slf4j.org/codes.html#multiple_bindings for an explanation.
   [jmeter] SLF4J: Actual binding is of type [org.apache.logging.slf4j.Log4jLoggerFactory]
   [jmeter] Creating summariser <summary>
   [jmeter] Created the tree successfully using testfiles/TestCookieManager.jmx
   [jmeter] Starting the test @ Thu Jul 12 09:04:09 UTC 2018 (1531386249203)
   [jmeter] Waiting for possible Shutdown/StopTestNow/Heapdump message on port 4445
   [jmeter] summary =     10 in 00:00:02 =    6.6/s Avg:   102 Min:     1 Max:   551 Err:
    0 (0.00%)
   [jmeter] Tidying up ...    @ Thu Jul 12 09:04:12 UTC 2018 (1531386252111)
   [jmeter] ... end of run
     [echo] TestCookieManager output files compared OK

batchtest:
     [echo] Starting TCP_TESTS with file TCP_TESTS.jmx using -X -Jdummy=dummy
   [jmeter] SLF4J: Class path contains multiple SLF4J bindings.
   [jmeter] SLF4J: Found binding in [jar:<https://builds.apache.org/job/JMeter-trunk/ws/trunk/lib/log4j-slf4j-impl-2.10.0.jar!/org/slf4j/impl/StaticLoggerBinder.class]>
   [jmeter] SLF4J: Found binding in [jar:<https://builds.apache.org/job/JMeter-trunk/ws/trunk/lib/opt/activemq-all-5.15.2.jar!/org/slf4j/impl/StaticLoggerBinder.class]>
   [jmeter] SLF4J: See http://www.slf4j.org/codes.html#multiple_bindings for an explanation.
   [jmeter] SLF4J: Actual binding is of type [org.apache.logging.slf4j.Log4jLoggerFactory]
   [jmeter] Creating summariser <summary>
   [jmeter] Created the tree successfully using testfiles/TCP_TESTS.jmx
   [jmeter] Starting the test @ Thu Jul 12 09:04:16 UTC 2018 (1531386256292)
   [jmeter] Waiting for possible Shutdown/StopTestNow/Heapdump message on port 4445
   [jmeter] 12/07/2018 09:04:21
   [jmeter] 
   [jmeter] 
   [jmeter] summary =     11 in 00:00:06 =    2.0/s Avg:   361 Min:     0 Max:  1025 Err:
    0 (0.00%)
   [jmeter] Tidying up ...    @ Thu Jul 12 09:04:23 UTC 2018 (1531386263094)
   [jmeter] ... end of run
   [concat] 2018-07-12 09:04:20,978 ERROR o.a.j.p.t.s.TCPSampler: 
   [concat] org.apache.jmeter.protocol.tcp.sampler.ReadException: Error reading from server,
bytes read: 0
   [concat] 	at org.apache.jmeter.protocol.tcp.sampler.TCPClientImpl.read(TCPClientImpl.java:131)
~[ApacheJMeter_tcp.jar:r1835709]
   [concat] 	at org.apache.jmeter.protocol.tcp.sampler.TCPSampler.sample(TCPSampler.java:402)
[ApacheJMeter_tcp.jar:r1835709]
   [concat] 	at org.apache.jmeter.threads.JMeterThread.doSampling(JMeterThread.java:622) [ApacheJMeter_core.jar:r1835709]
   [concat] 	at org.apache.jmeter.threads.JMeterThread.executeSamplePackage(JMeterThread.java:546)
[ApacheJMeter_core.jar:r1835709]
   [concat] 	at org.apache.jmeter.threads.JMeterThread.processSampler(JMeterThread.java:486)
[ApacheJMeter_core.jar:r1835709]
   [concat] 	at org.apache.jmeter.threads.JMeterThread.run(JMeterThread.java:253) [ApacheJMeter_core.jar:r1835709]
   [concat] 	at java.lang.Thread.run(Thread.java:748) [?:1.8.0_172]
   [concat] Caused by: java.net.SocketTimeoutException: Read timed out
   [concat] 	at java.net.SocketInputStream.socketRead0(Native Method) ~[?:1.8.0_172]
   [concat] 	at java.net.SocketInputStream.socketRead(SocketInputStream.java:116) ~[?:1.8.0_172]
   [concat] 	at java.net.SocketInputStream.read(SocketInputStream.java:171) ~[?:1.8.0_172]
   [concat] 	at java.net.SocketInputStream.read(SocketInputStream.java:141) ~[?:1.8.0_172]
   [concat] 	at java.net.SocketInputStream.read(SocketInputStream.java:127) ~[?:1.8.0_172]
   [concat] 	at org.apache.jmeter.protocol.tcp.sampler.TCPClientImpl.read(TCPClientImpl.java:114)
~[ApacheJMeter_tcp.jar:r1835709]
   [concat] 	... 6 more
   [concat] 2018-07-12 09:04:22,081 ERROR o.a.j.p.t.s.TCPSampler: 
   [concat] org.apache.jmeter.protocol.tcp.sampler.ReadException: 
   [concat] 	at org.apache.jmeter.protocol.tcp.sampler.BinaryTCPClientImpl.read(BinaryTCPClientImpl.java:152)
~[ApacheJMeter_tcp.jar:r1835709]
   [concat] 	at org.apache.jmeter.protocol.tcp.sampler.TCPSampler.sample(TCPSampler.java:402)
[ApacheJMeter_tcp.jar:r1835709]
   [concat] 	at org.apache.jmeter.threads.JMeterThread.doSampling(JMeterThread.java:622) [ApacheJMeter_core.jar:r1835709]
   [concat] 	at org.apache.jmeter.threads.JMeterThread.executeSamplePackage(JMeterThread.java:546)
[ApacheJMeter_core.jar:r1835709]
   [concat] 	at org.apache.jmeter.threads.JMeterThread.processSampler(JMeterThread.java:486)
[ApacheJMeter_core.jar:r1835709]
   [concat] 	at org.apache.jmeter.threads.JMeterThread.run(JMeterThread.java:253) [ApacheJMeter_core.jar:r1835709]
   [concat] 	at java.lang.Thread.run(Thread.java:748) [?:1.8.0_172]
   [concat] Caused by: java.net.SocketTimeoutException: Read timed out
   [concat] 	at java.net.SocketInputStream.socketRead0(Native Method) ~[?:1.8.0_172]
   [concat] 	at java.net.SocketInputStream.socketRead(SocketInputStream.java:116) ~[?:1.8.0_172]
   [concat] 	at java.net.SocketInputStream.read(SocketInputStream.java:171) ~[?:1.8.0_172]
   [concat] 	at java.net.SocketInputStream.read(SocketInputStream.java:141) ~[?:1.8.0_172]
   [concat] 	at java.net.SocketInputStream.read(SocketInputStream.java:127) ~[?:1.8.0_172]
   [concat] 	at org.apache.jmeter.protocol.tcp.sampler.BinaryTCPClientImpl.read(BinaryTCPClientImpl.java:134)
~[ApacheJMeter_tcp.jar:r1835709]
   [concat] 	... 6 more
   [concat] 2018-07-12 09:04:22,099 WARN o.a.j.p.t.s.TCPSampler: Could not create socket for
tcp://localhost:2223
   [concat] java.net.ConnectException: Connection refused (Connection refused)
   [concat] 	at java.net.PlainSocketImpl.socketConnect(Native Method) ~[?:1.8.0_172]
   [concat] 	at java.net.AbstractPlainSocketImpl.doConnect(AbstractPlainSocketImpl.java:350)
~[?:1.8.0_172]
   [concat] 	at java.net.AbstractPlainSocketImpl.connectToAddress(AbstractPlainSocketImpl.java:206)
~[?:1.8.0_172]
   [concat] 	at java.net.AbstractPlainSocketImpl.connect(AbstractPlainSocketImpl.java:188)
~[?:1.8.0_172]
   [concat] 	at java.net.SocksSocketImpl.connect(SocksSocketImpl.java:392) ~[?:1.8.0_172]
   [concat] 	at java.net.Socket.connect(Socket.java:589) ~[?:1.8.0_172]
   [concat] 	at org.apache.jmeter.protocol.tcp.sampler.TCPSampler.getSocket(TCPSampler.java:168)
[ApacheJMeter_tcp.jar:r1835709]
   [concat] 	at org.apache.jmeter.protocol.tcp.sampler.TCPSampler.sample(TCPSampler.java:384)
[ApacheJMeter_tcp.jar:r1835709]
   [concat] 	at org.apache.jmeter.threads.JMeterThread.doSampling(JMeterThread.java:622) [ApacheJMeter_core.jar:r1835709]
   [concat] 	at org.apache.jmeter.threads.JMeterThread.executeSamplePackage(JMeterThread.java:546)
[ApacheJMeter_core.jar:r1835709]
   [concat] 	at org.apache.jmeter.threads.JMeterThread.processSampler(JMeterThread.java:486)
[ApacheJMeter_core.jar:r1835709]
   [concat] 	at org.apache.jmeter.threads.JMeterThread.run(JMeterThread.java:253) [ApacheJMeter_core.jar:r1835709]
   [concat] 	at java.lang.Thread.run(Thread.java:748) [?:1.8.0_172]
   [concat] 2018-07-12 09:04:22,184 WARN o.a.j.p.t.s.TCPSampler: Unknown host for tcp://localhostXXXX:2223
   [concat] java.net.UnknownHostException: localhostXXXX
   [concat] 	at java.net.AbstractPlainSocketImpl.connect(AbstractPlainSocketImpl.java:184)
~[?:1.8.0_172]
   [concat] 	at java.net.SocksSocketImpl.connect(SocksSocketImpl.java:392) ~[?:1.8.0_172]
   [concat] 	at java.net.Socket.connect(Socket.java:589) ~[?:1.8.0_172]
   [concat] 	at org.apache.jmeter.protocol.tcp.sampler.TCPSampler.getSocket(TCPSampler.java:168)
[ApacheJMeter_tcp.jar:r1835709]
   [concat] 	at org.apache.jmeter.protocol.tcp.sampler.TCPSampler.sample(TCPSampler.java:384)
[ApacheJMeter_tcp.jar:r1835709]
   [concat] 	at org.apache.jmeter.threads.JMeterThread.doSampling(JMeterThread.java:622) [ApacheJMeter_core.jar:r1835709]
   [concat] 	at org.apache.jmeter.threads.JMeterThread.executeSamplePackage(JMeterThread.java:546)
[ApacheJMeter_core.jar:r1835709]
   [concat] 	at org.apache.jmeter.threads.JMeterThread.processSampler(JMeterThread.java:486)
[ApacheJMeter_core.jar:r1835709]
   [concat] 	at org.apache.jmeter.threads.JMeterThread.run(JMeterThread.java:253) [ApacheJMeter_core.jar:r1835709]
   [concat] 	at java.lang.Thread.run(Thread.java:748) [?:1.8.0_172]
   [concat] 2018-07-12 09:04:22,191 ERROR o.a.j.p.t.s.TCPSampler: Could not find protocol
class 'org.foo.xxx'
     [echo] TCP_TESTS output files compared OK

batchtest:
     [echo] Starting JDBC_TESTS with file JDBC_TESTS.jmx using -X -Jdummy=dummy
   [jmeter] SLF4J: Class path contains multiple SLF4J bindings.
   [jmeter] SLF4J: Found binding in [jar:<https://builds.apache.org/job/JMeter-trunk/ws/trunk/lib/log4j-slf4j-impl-2.10.0.jar!/org/slf4j/impl/StaticLoggerBinder.class]>
   [jmeter] SLF4J: Found binding in [jar:<https://builds.apache.org/job/JMeter-trunk/ws/trunk/lib/opt/activemq-all-5.15.2.jar!/org/slf4j/impl/StaticLoggerBinder.class]>
   [jmeter] SLF4J: See http://www.slf4j.org/codes.html#multiple_bindings for an explanation.
   [jmeter] SLF4J: Actual binding is of type [org.apache.logging.slf4j.Log4jLoggerFactory]
   [jmeter] Creating summariser <summary>
   [jmeter] Created the tree successfully using testfiles/JDBC_TESTS.jmx
   [jmeter] Starting the test @ Thu Jul 12 09:04:26 UTC 2018 (1531386266414)
   [jmeter] Waiting for possible Shutdown/StopTestNow/Heapdump message on port 4445
   [jmeter] summary =     21 in 00:00:02 =   13.3/s Avg:    24 Min:     0 Max:   432 Err:
    0 (0.00%)
   [jmeter] Tidying up ...    @ Thu Jul 12 09:04:29 UTC 2018 (1531386269267)
   [jmeter] ... end of run
   [concat] 2018-07-12 09:04:29,231 ERROR o.a.j.t.JMeterThread: Error while processing sampler:
'JDBC_With_Failing_PreProcessor'.
   [concat] java.lang.IllegalArgumentException: Variable Name must not be null in JDBC PreProcessor
   [concat] 	at org.apache.jmeter.protocol.jdbc.processor.AbstractJDBCProcessor.process(AbstractJDBCProcessor.java:45)
~[ApacheJMeter_jdbc.jar:r1835709]
   [concat] 	at org.apache.jmeter.protocol.jdbc.processor.JDBCPreProcessor.process(JDBCPreProcessor.java:33)
~[ApacheJMeter_jdbc.jar:r1835709]
   [concat] 	at org.apache.jmeter.threads.JMeterThread.runPreProcessors(JMeterThread.java:935)
~[ApacheJMeter_core.jar:r1835709]
   [concat] 	at org.apache.jmeter.threads.JMeterThread.executeSamplePackage(JMeterThread.java:537)
~[ApacheJMeter_core.jar:r1835709]
   [concat] 	at org.apache.jmeter.threads.JMeterThread.processSampler(JMeterThread.java:486)
[ApacheJMeter_core.jar:r1835709]
   [concat] 	at org.apache.jmeter.threads.JMeterThread.run(JMeterThread.java:253) [ApacheJMeter_core.jar:r1835709]
   [concat] 	at java.lang.Thread.run(Thread.java:748) [?:1.8.0_172]
   [concat] 2018-07-12 09:04:29,242 ERROR o.a.j.t.JMeterThread: Error while processing sampler:
'JDBC_With_Failing_PostProcessor'.
   [concat] java.lang.IllegalArgumentException: Variable Name must not be null in JDBC PostProcessor
   [concat] 	at org.apache.jmeter.protocol.jdbc.processor.AbstractJDBCProcessor.process(AbstractJDBCProcessor.java:45)
~[ApacheJMeter_jdbc.jar:r1835709]
   [concat] 	at org.apache.jmeter.protocol.jdbc.processor.JDBCPostProcessor.process(JDBCPostProcessor.java:33)
~[ApacheJMeter_jdbc.jar:r1835709]
   [concat] 	at org.apache.jmeter.threads.JMeterThread.runPostProcessors(JMeterThread.java:925)
~[ApacheJMeter_core.jar:r1835709]
   [concat] 	at org.apache.jmeter.threads.JMeterThread.executeSamplePackage(JMeterThread.java:564)
~[ApacheJMeter_core.jar:r1835709]
   [concat] 	at org.apache.jmeter.threads.JMeterThread.processSampler(JMeterThread.java:486)
[ApacheJMeter_core.jar:r1835709]
   [concat] 	at org.apache.jmeter.threads.JMeterThread.run(JMeterThread.java:253) [ApacheJMeter_core.jar:r1835709]
   [concat] 	at java.lang.Thread.run(Thread.java:748) [?:1.8.0_172]
   [concat] 2018-07-12 09:04:29,244 WARN o.a.j.p.j.p.AbstractJDBCProcessor: SQL Problem in
JDBC PreProcessor: java.sql.SQLSyntaxErrorException: unexpected token: USERS
   [concat] 2018-07-12 09:04:29,258 WARN o.a.j.p.j.p.AbstractJDBCProcessor: SQL Problem in
JDBC PostProcessor: java.sql.SQLSyntaxErrorException: unexpected token: USERS
     [echo] JDBC_TESTS output files compared OK

batchtest:
     [echo] Starting JMS_TESTS with file JMS_TESTS.jmx using -X -Jdummy=dummy
   [jmeter] SLF4J: Class path contains multiple SLF4J bindings.
   [jmeter] SLF4J: Found binding in [jar:<https://builds.apache.org/job/JMeter-trunk/ws/trunk/lib/log4j-slf4j-impl-2.10.0.jar!/org/slf4j/impl/StaticLoggerBinder.class]>
   [jmeter] SLF4J: Found binding in [jar:<https://builds.apache.org/job/JMeter-trunk/ws/trunk/lib/opt/activemq-all-5.15.2.jar!/org/slf4j/impl/StaticLoggerBinder.class]>
   [jmeter] SLF4J: See http://www.slf4j.org/codes.html#multiple_bindings for an explanation.
   [jmeter] SLF4J: Actual binding is of type [org.apache.logging.slf4j.Log4jLoggerFactory]
   [jmeter] Creating summariser <summary>
   [jmeter] Created the tree successfully using testfiles/JMS_TESTS.jmx
   [jmeter] Starting the test @ Thu Jul 12 09:04:32 UTC 2018 (1531386272532)
   [jmeter] Waiting for possible Shutdown/StopTestNow/Heapdump message on port 4445
   [jmeter] summary +     24 in 00:00:28 =    0.9/s Avg:   549 Min:     0 Max:  3001 Err:
    0 (0.00%) Active: 1 Started: 5 Finished: 4
   [jmeter] summary +      3 in 00:00:08 =    0.4/s Avg:  1032 Min:     1 Max:  3000 Err:
    0 (0.00%) Active: 0 Started: 1 Finished: 1
   [jmeter] summary =     27 in 00:00:36 =    0.8/s Avg:   603 Min:     0 Max:  3001 Err:
    0 (0.00%)
   [jmeter] Tidying up ...    @ Thu Jul 12 09:05:09 UTC 2018 (1531386309861)
   [jmeter] ... end of run
     [echo] JMS_TESTS output files compared OK

batchtest:
     [echo] Starting OS_TESTS with file OS_TESTS.jmx using -X -Jdummy=dummy
   [jmeter] SLF4J: Class path contains multiple SLF4J bindings.
   [jmeter] SLF4J: Found binding in [jar:<https://builds.apache.org/job/JMeter-trunk/ws/trunk/lib/log4j-slf4j-impl-2.10.0.jar!/org/slf4j/impl/StaticLoggerBinder.class]>
   [jmeter] SLF4J: Found binding in [jar:<https://builds.apache.org/job/JMeter-trunk/ws/trunk/lib/opt/activemq-all-5.15.2.jar!/org/slf4j/impl/StaticLoggerBinder.class]>
   [jmeter] SLF4J: See http://www.slf4j.org/codes.html#multiple_bindings for an explanation.
   [jmeter] SLF4J: Actual binding is of type [org.apache.logging.slf4j.Log4jLoggerFactory]
   [jmeter] Creating summariser <summary>
   [jmeter] Created the tree successfully using testfiles/OS_TESTS.jmx
   [jmeter] Starting the test @ Thu Jul 12 09:05:13 UTC 2018 (1531386313673)
   [jmeter] Waiting for possible Shutdown/StopTestNow/Heapdump message on port 4445
   [jmeter] summary =      3 in 00:00:02 =    1.5/s Avg:   340 Min:     7 Max:  1003 Err:
    0 (0.00%)
   [jmeter] Tidying up ...    @ Thu Jul 12 09:05:16 UTC 2018 (1531386316071)
   [jmeter] ... end of run
     [echo] OS_TESTS output files compared OK

batchtest:
     [echo] Starting FTP_TESTS with file FTP_TESTS.jmx using -X -Jdummy=dummy
   [jmeter] SLF4J: Class path contains multiple SLF4J bindings.
   [jmeter] SLF4J: Found binding in [jar:<https://builds.apache.org/job/JMeter-trunk/ws/trunk/lib/log4j-slf4j-impl-2.10.0.jar!/org/slf4j/impl/StaticLoggerBinder.class]>
   [jmeter] SLF4J: Found binding in [jar:<https://builds.apache.org/job/JMeter-trunk/ws/trunk/lib/opt/activemq-all-5.15.2.jar!/org/slf4j/impl/StaticLoggerBinder.class]>
   [jmeter] SLF4J: See http://www.slf4j.org/codes.html#multiple_bindings for an explanation.
   [jmeter] SLF4J: Actual binding is of type [org.apache.logging.slf4j.Log4jLoggerFactory]
   [jmeter] Creating summariser <summary>
   [jmeter] Created the tree successfully using testfiles/FTP_TESTS.jmx
   [jmeter] Starting the test @ Thu Jul 12 09:05:19 UTC 2018 (1531386319229)
   [jmeter] Waiting for possible Shutdown/StopTestNow/Heapdump message on port 4445
   [jmeter] summary =      6 in 00:00:03 =    2.4/s Avg:   206 Min:    16 Max:   973 Err:
    0 (0.00%)
   [jmeter] Tidying up ...    @ Thu Jul 12 09:05:23 UTC 2018 (1531386323084)
   [jmeter] ... end of run
     [echo] FTP_TESTS output files compared OK

batchtest:
     [echo] Starting Bug60607 with file Bug60607.jmx using -X -Jdummy=dummy
   [jmeter] SLF4J: Class path contains multiple SLF4J bindings.
   [jmeter] SLF4J: Found binding in [jar:<https://builds.apache.org/job/JMeter-trunk/ws/trunk/lib/log4j-slf4j-impl-2.10.0.jar!/org/slf4j/impl/StaticLoggerBinder.class]>
   [jmeter] SLF4J: Found binding in [jar:<https://builds.apache.org/job/JMeter-trunk/ws/trunk/lib/opt/activemq-all-5.15.2.jar!/org/slf4j/impl/StaticLoggerBinder.class]>
   [jmeter] SLF4J: See http://www.slf4j.org/codes.html#multiple_bindings for an explanation.
   [jmeter] SLF4J: Actual binding is of type [org.apache.logging.slf4j.Log4jLoggerFactory]
   [jmeter] Creating summariser <summary>
   [jmeter] Created the tree successfully using testfiles/Bug60607.jmx
   [jmeter] Starting the test @ Thu Jul 12 09:05:26 UTC 2018 (1531386326206)
   [jmeter] Waiting for possible Shutdown/StopTestNow/Heapdump message on port 4445
   [jmeter] summary =      2 in 00:00:31 =    0.1/s Avg: 15164 Min:   224 Max: 30105 Err:
    0 (0.00%)
   [jmeter] Tidying up ...    @ Thu Jul 12 09:05:57 UTC 2018 (1531386357835)
   [jmeter] ... end of run
     [echo] Bug60607 output files compared OK

batchtest:
     [echo] Starting SlowCharsFeature_HttpClient4 with file SlowCharsFeature.jmx using -X
-Jdummy=dummy
   [jmeter] SLF4J: Class path contains multiple SLF4J bindings.
   [jmeter] SLF4J: Found binding in [jar:<https://builds.apache.org/job/JMeter-trunk/ws/trunk/lib/log4j-slf4j-impl-2.10.0.jar!/org/slf4j/impl/StaticLoggerBinder.class]>
   [jmeter] SLF4J: Found binding in [jar:<https://builds.apache.org/job/JMeter-trunk/ws/trunk/lib/opt/activemq-all-5.15.2.jar!/org/slf4j/impl/StaticLoggerBinder.class]>
   [jmeter] SLF4J: See http://www.slf4j.org/codes.html#multiple_bindings for an explanation.
   [jmeter] SLF4J: Actual binding is of type [org.apache.logging.slf4j.Log4jLoggerFactory]
   [jmeter] Creating summariser <summary>
   [jmeter] Created the tree successfully using testfiles/SlowCharsFeature.jmx
   [jmeter] Starting the test @ Thu Jul 12 09:06:01 UTC 2018 (1531386361648)
   [jmeter] Waiting for possible Shutdown/StopTestNow/Heapdump message on port 4445
   [jmeter] summary +      1 in 00:00:01 =    1.5/s Avg:   618 Min:   618 Max:   618 Err:
    0 (0.00%) Active: 1 Started: 1 Finished: 0
   [jmeter] summary +      4 in 00:00:24 =    0.2/s Avg:  5867 Min:  5594 Max:  6123 Err:
    1 (25.00%) Active: 0 Started: 1 Finished: 1
   [jmeter] summary =      5 in 00:00:25 =    0.2/s Avg:  4817 Min:   618 Max:  6123 Err:
    1 (20.00%)
   [jmeter] Tidying up ...    @ Thu Jul 12 09:06:27 UTC 2018 (1531386387032)
   [jmeter] ... end of run

BUILD FAILED
<https://builds.apache.org/job/JMeter-trunk/ws/trunk/build.xml>:2956: The following
error occurred while executing this line:
<https://builds.apache.org/job/JMeter-trunk/ws/trunk/build.xml>:2779: CSV Files are
not identical.
        <https://builds.apache.org/job/JMeter-trunk/ws/trunk/bin/testfiles/SlowCharsFeature_HttpClient4.csv>
        label,responseCode,responseMessage,threadName,dataType,success
JSS_setCPS,200,OK,setUp Thread Group 1-1,text,true
ApacheJMeter-HP-NonSecure,206,Partial Content,Thread Group 1-1,text,true
ApacheJMeter-HP-Secure,206,Partial Content,Thread Group 1-1,text,true
HTTPS-SNI-without-timeout,206,Partial Content,Thread Group 1-1,text,true
HTTPS-SNI-with-timeout,206,Partial Content,Thread Group 1-1,text,true

        <https://builds.apache.org/job/JMeter-trunk/ws/trunk/bin/SlowCharsFeature_HttpClient4.csv>
        label,responseCode,responseMessage,threadName,dataType,success
JSS_setCPS,200,OK,setUp Thread Group 1-1,text,true
ApacheJMeter-HP-NonSecure,206,Partial Content,Thread Group 1-1,text,true
ApacheJMeter-HP-Secure,Non HTTP response code: org.apache.http.conn.HttpHostConnectException,"Non
HTTP response message: Connect to jmeter.apache.org:443 [jmeter.apache.org/40.79.78.1, jmeter.apache.org/95.216.24.32,
jmeter.apache.org/2a01:4f9:2a:185f:0:0:0:2] failed: Network is unreachable (connect failed)",Thread
Group 1-1,text,false
HTTPS-SNI-without-timeout,206,Partial Content,Thread Group 1-1,text,true
HTTPS-SNI-with-timeout,206,Partial Content,Thread Group 1-1,text,true

Total time: 8 minutes 53 seconds
Build step 'Invoke Ant' marked build as failure
WARN: Unable to locate 'report-task.txt' in the workspace. Did the SonarScanner succedeed?
[locks-and-latches] Releasing all the locks
[locks-and-latches] All the locks released
Archiving artifacts
Recording test results
ERROR: Step ?Publish JUnit test result report? failed: No test report files were found. Configuration
error?

Mime
View raw message