jmeter-dev mailing list archives

Site index · List index
Message view « Date » · « Thread »
Top « Date » · « Thread »
From Apache Jenkins Server <jenk...@builds.apache.org>
Subject Build failed in Jenkins: JMeter-trunk #6988
Date Wed, 19 Dec 2018 13:16:33 GMT
See <https://builds.apache.org/job/JMeter-trunk/6988/display/redirect?page=changes>

Changes:

[pmouawad] Bug 62959 - Ability to create a Test plan from a Curl command

Fix test failures due to missing french translation
order key alphabetically


Bugzilla Id: 62959

------------------------------------------
[...truncated 733.56 KB...]
    [junit] Running org.apache.jmeter.functions.TestSetProperty
    [junit] Tests run: 3, Failures: 0, Errors: 0, Skipped: 0, Time elapsed: 0.003 sec
    [junit] Running org.apache.jmeter.functions.TestSimpleFunctions
    [junit] Tests run: 17, Failures: 0, Errors: 0, Skipped: 0, Time elapsed: 0.034 sec
    [junit] Running org.apache.jmeter.functions.TestTimeFunction
    [junit] Tests run: 15, Failures: 0, Errors: 0, Skipped: 0, Time elapsed: 0.007 sec
    [junit] Running org.apache.jmeter.functions.TestTimeRandomDateFunction
    [junit] Tests run: 14, Failures: 0, Errors: 0, Skipped: 0, Time elapsed: 0.05 sec
    [junit] Running org.apache.jmeter.functions.TestTimeShiftFunction
    [junit] Tests run: 11, Failures: 0, Errors: 0, Skipped: 0, Time elapsed: 0.05 sec
    [junit] Running org.apache.jmeter.functions.TestUrlEncodeDecode
    [junit] Tests run: 3, Failures: 0, Errors: 0, Skipped: 0, Time elapsed: 0.011 sec
    [junit] Running org.apache.jmeter.functions.VariableTest
    [junit] Tests run: 1, Failures: 0, Errors: 0, Skipped: 0, Time elapsed: 0.002 sec
    [junit] Running org.apache.jmeter.gui.action.TestLoad
    [junit] Tests run: 85, Failures: 0, Errors: 0, Skipped: 0, Time elapsed: 1.649 sec
    [junit] Running org.apache.jmeter.gui.action.TestSave
    [junit] Tests run: 1, Failures: 0, Errors: 0, Skipped: 0, Time elapsed: 0.007 sec
    [junit] Running org.apache.jmeter.gui.action.template.TestTemplateManager
    [junit] Tests run: 3, Failures: 0, Errors: 0, Skipped: 0, Time elapsed: 0.025 sec
    [junit] Running org.apache.jmeter.gui.logging.TestGuiLogEventAppender
    [junit] Tests run: 1, Failures: 0, Errors: 0, Skipped: 0, Time elapsed: 0.034 sec
    [junit] Running org.apache.jmeter.gui.util.JSyntaxTextAreaTest
    [junit] Tests run: 2, Failures: 0, Errors: 0, Skipped: 0, Time elapsed: 0.007 sec
    [junit] Running org.apache.jmeter.junit.JMeterTest
    [junit] Tests run: 715, Failures: 0, Errors: 0, Skipped: 0, Time elapsed: 1.65 sec
    [junit] Running org.apache.jmeter.listeners.TestResultAction
    [junit] Tests run: 5, Failures: 0, Errors: 0, Skipped: 0, Time elapsed: 0.006 sec
    [junit] Running org.apache.jmeter.protocol.http.config.MultipartUrlConfigTest
    [junit] Tests run: 3, Failures: 0, Errors: 0, Skipped: 0, Time elapsed: 0.006 sec
    [junit] Running org.apache.jmeter.protocol.http.config.UrlConfigTest
    [junit] Tests run: 2, Failures: 0, Errors: 0, Skipped: 0, Time elapsed: 0.002 sec
    [junit] Running org.apache.jmeter.protocol.http.control.TestAuthManager
    [junit] Tests run: 6, Failures: 0, Errors: 0, Skipped: 0, Time elapsed: 0.006 sec
    [junit] Running org.apache.jmeter.protocol.http.control.TestAuthorization
    [junit] Tests run: 1, Failures: 0, Errors: 0, Skipped: 0, Time elapsed: 0.003 sec
    [junit] Running org.apache.jmeter.protocol.http.control.TestCacheManagerHC4
    [junit] Tests run: 24, Failures: 0, Errors: 0, Skipped: 0, Time elapsed: 12.798 sec
    [junit] Running org.apache.jmeter.protocol.http.control.TestCacheManagerUrlConnection
    [junit] Tests run: 23, Failures: 0, Errors: 0, Skipped: 0, Time elapsed: 12.665 sec
    [junit] Running org.apache.jmeter.protocol.http.control.TestDNSCacheManager
    [junit] Tests run: 12, Failures: 0, Errors: 0, Skipped: 0, Time elapsed: 0.324 sec
    [junit] Running org.apache.jmeter.protocol.http.control.TestHC4CookieManager
    [junit] Tests run: 33, Failures: 0, Errors: 0, Skipped: 0, Time elapsed: 0.085 sec
    [junit] Running org.apache.jmeter.protocol.http.control.TestHTTPMirrorThread
    [junit] Tests run: 9, Failures: 0, Errors: 0, Skipped: 0, Time elapsed: 0.952 sec
    [junit] Running org.apache.jmeter.protocol.http.control.gui.TestHttpTestSampleGui
    [junit] Tests run: 1, Failures: 0, Errors: 0, Skipped: 0, Time elapsed: 0.022 sec
    [junit] Running org.apache.jmeter.protocol.http.modifier.TestAnchorModifier
    [junit] Tests run: 18, Failures: 0, Errors: 0, Skipped: 0, Time elapsed: 0.116 sec
    [junit] Running org.apache.jmeter.protocol.http.modifier.TestURLRewritingModifier
    [junit] Tests run: 17, Failures: 0, Errors: 0, Skipped: 0, Time elapsed: 0.016 sec
    [junit] Running org.apache.jmeter.protocol.http.parser.TestBaseParser
    [junit] Tests run: 2, Failures: 0, Errors: 0, Skipped: 0, Time elapsed: 0.006 sec
    [junit] Running org.apache.jmeter.protocol.http.parser.TestBug60842HtmlParser
    [junit] Tests run: 42, Failures: 0, Errors: 0, Skipped: 0, Time elapsed: 0.05 sec
    [junit] Running org.apache.jmeter.protocol.http.parser.TestCssParser
    [junit] Tests run: 4, Failures: 0, Errors: 0, Skipped: 0, Time elapsed: 0.34 sec
    [junit] Running org.apache.jmeter.protocol.http.parser.TestHTMLParser
    [junit] Tests run: 103, Failures: 0, Errors: 0, Skipped: 0, Time elapsed: 0.334 sec
    [junit] Running org.apache.jmeter.protocol.http.parser.TestHtmlParsingUtils
    [junit] Tests run: 6, Failures: 0, Errors: 0, Skipped: 0, Time elapsed: 0.008 sec
    [junit] Running org.apache.jmeter.protocol.http.proxy.TestHttpRequestHdr
    [junit] Tests run: 10, Failures: 0, Errors: 0, Skipped: 0, Time elapsed: 0.287 sec
    [junit] Running org.apache.jmeter.protocol.http.proxy.TestProxyControl
    [junit] Tests run: 7, Failures: 0, Errors: 0, Skipped: 0, Time elapsed: 0.006 sec
    [junit] Running org.apache.jmeter.protocol.http.sampler.PackageTest
    [junit] Tests run: 1, Failures: 0, Errors: 0, Skipped: 0, Time elapsed: 0.039 sec
    [junit] Running org.apache.jmeter.protocol.http.sampler.PostWriterTest
    [junit] Tests run: 8, Failures: 0, Errors: 0, Skipped: 0, Time elapsed: 0.014 sec
    [junit] Running org.apache.jmeter.protocol.http.sampler.PutWriterTest
    [junit] Tests run: 2, Failures: 0, Errors: 0, Skipped: 0, Time elapsed: 0.017 sec
    [junit] Running org.apache.jmeter.protocol.http.sampler.TestHTTPSamplers
    [junit] Tests run: 19, Failures: 0, Errors: 0, Skipped: 0, Time elapsed: 0.636 sec
    [junit] Running org.apache.jmeter.protocol.http.sampler.TestHTTPSamplersAgainstHttpMirrorServer
    [junit] Tests run: 53, Failures: 0, Errors: 0, Skipped: 0, Time elapsed: 0.346 sec
    [junit] Running org.apache.jmeter.protocol.http.sampler.TestHttpWebdav
    [junit] Tests run: 2, Failures: 0, Errors: 0, Skipped: 0, Time elapsed: 0.004 sec
    [junit] Running org.apache.jmeter.protocol.http.util.TestHTTPArgument
    [junit] Tests run: 3, Failures: 0, Errors: 0, Skipped: 0, Time elapsed: 0.003 sec
    [junit] Running org.apache.jmeter.protocol.http.util.TestHTTPFileArg
    [junit] Tests run: 3, Failures: 0, Errors: 0, Skipped: 0, Time elapsed: 0.002 sec
    [junit] Running org.apache.jmeter.protocol.http.util.TestHTTPFileArgs
    [junit] Tests run: 5, Failures: 0, Errors: 0, Skipped: 0, Time elapsed: 0.014 sec
    [junit] Running org.apache.jmeter.protocol.http.util.accesslog.TestLogFilter
    [junit] Tests run: 6, Failures: 0, Errors: 0, Skipped: 0, Time elapsed: 0.006 sec
    [junit] Running org.apache.jmeter.protocol.http.util.accesslog.TestSessionFilter
    [junit] Tests run: 3, Failures: 0, Errors: 0, Skipped: 0, Time elapsed: 0.005 sec
    [junit] Running org.apache.jmeter.protocol.http.util.accesslog.TestTCLogParser
    [junit] Tests run: 4, Failures: 0, Errors: 0, Skipped: 0, Time elapsed: 0.003 sec
    [junit] Running org.apache.jmeter.protocol.http.visualizers.RequestViewHTTPTest
    [junit] Tests run: 7, Failures: 0, Errors: 0, Skipped: 0, Time elapsed: 0.005 sec
    [junit] Running org.apache.jmeter.protocol.jms.sampler.PublisherSamplerTest
    [junit] Tests run: 1, Failures: 0, Errors: 0, Skipped: 0, Time elapsed: 0.018 sec
    [junit] Running org.apache.jmeter.protocol.jms.sampler.render.BinaryMessageRendererTest
    [junit] Tests run: 8, Failures: 0, Errors: 0, Skipped: 0, Time elapsed: 0.029 sec
    [junit] Running org.apache.jmeter.protocol.jms.sampler.render.ObjectMessageRendererTest
    [junit] Tests run: 5, Failures: 0, Errors: 0, Skipped: 0, Time elapsed: 0.062 sec
    [junit] Running org.apache.jmeter.protocol.jms.sampler.render.TextMessageRendererTest
    [junit] Tests run: 7, Failures: 0, Errors: 0, Skipped: 0, Time elapsed: 0.006 sec
    [junit] Running org.apache.jmeter.protocol.ldap.config.gui.PackageTest
    [junit] Tests run: 1, Failures: 0, Errors: 0, Skipped: 0, Time elapsed: 0.006 sec
    [junit] Running org.apache.jmeter.protocol.mail.sampler.TestMailReaderSampler
    [junit] Tests run: 1, Failures: 0, Errors: 0, Skipped: 0, Time elapsed: 0.003 sec
    [junit] Running org.apache.jmeter.protocol.tcp.sampler.BinaryTCPClientImplTest
    [junit] Tests run: 3, Failures: 0, Errors: 0, Skipped: 0, Time elapsed: 0.004 sec
    [junit] Running org.apache.jmeter.protocol.tcp.sampler.LengthPrefixedBinaryTCPClientImplTest
    [junit] Tests run: 2, Failures: 0, Errors: 0, Skipped: 0, Time elapsed: 0.003 sec
    [junit] Running org.apache.jmeter.protocol.tcp.sampler.TCPClientDecoratorTest
    [junit] Tests run: 3, Failures: 0, Errors: 0, Skipped: 0, Time elapsed: 0.007 sec
    [junit] Running org.apache.jmeter.report.core.CsvSampleReaderTest
    [junit] Tests run: 6, Failures: 0, Errors: 0, Skipped: 0, Time elapsed: 0.027 sec
    [junit] Running org.apache.jmeter.report.core.SampleMetadataTest
    [junit] Tests run: 1, Failures: 0, Errors: 0, Skipped: 0, Time elapsed: 0.003 sec
    [junit] Running org.apache.jmeter.report.core.TestCsvSampleWriter
    [junit] Tests run: 5, Failures: 0, Errors: 0, Skipped: 0, Time elapsed: 0.005 sec
    [junit] Running org.apache.jmeter.report.dashboard.ApdexPerTransactionTest
    [junit] Tests run: 7, Failures: 0, Errors: 0, Skipped: 0, Time elapsed: 0.02 sec
    [junit] Running org.apache.jmeter.report.processor.ErrorsSummaryConsumerTest
    [junit] Tests run: 2, Failures: 0, Errors: 0, Skipped: 0, Time elapsed: 0.01 sec
    [junit] Running org.apache.jmeter.report.processor.FieldSampleComparatorTest
    [junit] Tests run: 1, Failures: 0, Errors: 0, Skipped: 0, Time elapsed: 0.003 sec
    [junit] Running org.apache.jmeter.report.processor.graph.impl.CustomGraphConsumerTest
    [junit] Tests run: 6, Failures: 0, Errors: 0, Skipped: 0, Time elapsed: 0.008 sec
    [junit] Running org.apache.jmeter.reporters.TestResultSaver
    [junit] Tests run: 5, Failures: 0, Errors: 0, Skipped: 0, Time elapsed: 0.006 sec
    [junit] Running org.apache.jmeter.resources.PackageTest
    [junit] Tests run: 365, Failures: 0, Errors: 0, Skipped: 0, Time elapsed: 0.917 sec
    [junit] Running org.apache.jmeter.resources.TestPropertiesFiles
    [junit] Tests run: 2, Failures: 0, Errors: 0, Skipped: 0, Time elapsed: 0.005 sec
    [junit] Running org.apache.jmeter.samplers.TestSampleResult
    [junit] Tests run: 16, Failures: 0, Errors: 0, Skipped: 0, Time elapsed: 3.846 sec
    [junit] Running org.apache.jmeter.samplers.TestSampleSaveConfiguration
    [junit] Tests run: 7, Failures: 0, Errors: 0, Skipped: 0, Time elapsed: 0.035 sec
    [junit] Running org.apache.jmeter.save.TestCSVSaveService
    [junit] Tests run: 11, Failures: 0, Errors: 0, Skipped: 0, Time elapsed: 0.008 sec
    [junit] Running org.apache.jmeter.save.TestSaveService
    [junit] Tests run: 5, Failures: 0, Errors: 0, Skipped: 0, Time elapsed: 0.669 sec
    [junit] Running org.apache.jmeter.testbeans.gui.PackageTest
    [junit] Tests run: 384, Failures: 0, Errors: 0, Skipped: 0, Time elapsed: 1.236 sec
    [junit] Running org.apache.jmeter.testbeans.gui.TestBooleanPropertyEditor
    [junit] Tests run: 2, Failures: 0, Errors: 0, Skipped: 0, Time elapsed: 0.004 sec
    [junit] Running org.apache.jmeter.testbeans.gui.TestComboStringEditor
    [junit] Tests run: 2, Failures: 0, Errors: 0, Skipped: 0, Time elapsed: 0.012 sec
    [junit] Running org.apache.jmeter.testbeans.gui.TestFieldStringEditor
    [junit] Tests run: 2, Failures: 0, Errors: 0, Skipped: 0, Time elapsed: 0.006 sec
    [junit] Running org.apache.jmeter.testelement.PackageTest
    [junit] Tests run: 2, Failures: 0, Errors: 0, Skipped: 0, Time elapsed: 0.003 sec
    [junit] Running org.apache.jmeter.testelement.TestElementTest
    [junit] Tests run: 135, Failures: 0, Errors: 0, Skipped: 0, Time elapsed: 0.147 sec
    [junit] Running org.apache.jmeter.testelement.TestHeaderManager
    [junit] Tests run: 2, Failures: 0, Errors: 0, Skipped: 0, Time elapsed: 0.005 sec
    [junit] Running org.apache.jmeter.testelement.TestNumberProperty
    [junit] Tests run: 5, Failures: 0, Errors: 0, Skipped: 0, Time elapsed: 0.005 sec
    [junit] Running org.apache.jmeter.testelement.property.AbstractPropertyTest
    [junit] Tests run: 6, Failures: 0, Errors: 0, Skipped: 0, Time elapsed: 0.007 sec
    [junit] Running org.apache.jmeter.testelement.property.MapPropertyTest
    [junit] Tests run: 2, Failures: 0, Errors: 0, Skipped: 0, Time elapsed: 0.004 sec
    [junit] Running org.apache.jmeter.testelement.property.PackageTest
    [junit] Tests run: 11, Failures: 0, Errors: 0, Skipped: 0, Time elapsed: 0.006 sec
    [junit] Running org.apache.jmeter.threads.TestJMeterContextService
    [junit] Tests run: 1, Failures: 0, Errors: 0, Skipped: 0, Time elapsed: 0.002 sec
    [junit] Running org.apache.jmeter.threads.TestJMeterThread
    [junit] Tests run: 2, Failures: 0, Errors: 0, Skipped: 0, Time elapsed: 0.005 sec
    [junit] Running org.apache.jmeter.threads.TestTestCompiler
    [junit] Tests run: 1, Failures: 0, Errors: 0, Skipped: 0, Time elapsed: 0.004 sec
    [junit] Running org.apache.jmeter.threads.TestUnmodifiableJMeterVariables
    [junit] Tests run: 17, Failures: 0, Errors: 0, Skipped: 0, Time elapsed: 0.012 sec
    [junit] Running org.apache.jmeter.timers.ConstantThroughputTimerTest
    [junit] Tests run: 9, Failures: 0, Errors: 0, Skipped: 0, Time elapsed: 0.547 sec
    [junit] Running org.apache.jmeter.timers.SyncTimerTest
    [junit] Tests run: 4, Failures: 0, Errors: 0, Skipped: 0, Time elapsed: 0.607 sec
    [junit] Running org.apache.jmeter.timers.TimerServiceTest
    [junit] Tests run: 1, Failures: 0, Errors: 0, Skipped: 0, Time elapsed: 0.003 sec
    [junit] Running org.apache.jmeter.timers.poissonarrivals.PreciseThroughputTimerTest
    [junit] Tests run: 2, Failures: 0, Errors: 0, Skipped: 0, Time elapsed: 0.041 sec
    [junit] Running org.apache.jmeter.util.JSR223TestElementTest
    [junit] Tests run: 2, Failures: 0, Errors: 0, Skipped: 0, Time elapsed: 0.01 sec
    [junit] Running org.apache.jmeter.util.PackageTest
    [junit] Tests run: 1, Failures: 0, Errors: 0, Skipped: 0, Time elapsed: 0.002 sec
    [junit] Running org.apache.jmeter.util.StringUtilitiesTest
    [junit] Tests run: 5, Failures: 0, Errors: 0, Skipped: 0, Time elapsed: 0.003 sec
    [junit] Running org.apache.jmeter.util.TestJMeterUtils
    [junit] Tests run: 3, Failures: 0, Errors: 0, Skipped: 0, Time elapsed: 0.004 sec
    [junit] Running org.apache.jmeter.util.XPathUtilTest
    [junit] Tests run: 5, Failures: 0, Errors: 0, Skipped: 0, Time elapsed: 0.63 sec
    [junit] Running org.apache.jmeter.visualizers.TestRenderAsJson
    [junit] Tests run: 8, Failures: 0, Errors: 0, Skipped: 0, Time elapsed: 0.005 sec
    [junit] Running org.apache.jmeter.visualizers.TestSampleCompareTo
    [junit] Tests run: 9, Failures: 0, Errors: 0, Skipped: 0, Time elapsed: 0.011 sec
    [junit] Running org.apache.jmeter.visualizers.TestSamplingStatCalculator
    [junit] Tests run: 2, Failures: 0, Errors: 0, Skipped: 0, Time elapsed: 0.003 sec
    [junit] Running org.apache.jmeter.visualizers.backend.SamplerMetricFixedModeTest
    [junit] Tests run: 3, Failures: 0, Errors: 0, Skipped: 0, Time elapsed: 0.299 sec
    [junit] Running org.apache.jmeter.visualizers.backend.SamplerMetricTimedModeTest
    [junit] Tests run: 2, Failures: 0, Errors: 0, Skipped: 0, Time elapsed: 0.004 sec
    [junit] Running org.apache.jorphan.TestFunctorUsers
    [junit] Tests run: 7, Failures: 0, Errors: 0, Skipped: 0, Time elapsed: 0.038 sec
    [junit] Running org.apache.jorphan.TestXMLBuffer
    [junit] Tests run: 4, Failures: 0, Errors: 0, Skipped: 0, Time elapsed: 0.004 sec
    [junit] Running org.apache.jorphan.collections.PackageTest
    [junit] Tests run: 5, Failures: 0, Errors: 0, Skipped: 0, Time elapsed: 0.014 sec
    [junit] Running org.apache.jorphan.exec.TestKeyToolUtils
    [junit] Tests run: 3, Failures: 0, Errors: 0, Skipped: 0, Time elapsed: 10.999 sec
    [junit] Running org.apache.jorphan.gui.MinMaxLongRendererTest
    [junit] Tests run: 5, Failures: 0, Errors: 0, Skipped: 0, Time elapsed: 0.005 sec
    [junit] Running org.apache.jorphan.gui.ObjectTableModelTest
    [junit] Tests run: 6, Failures: 0, Errors: 0, Skipped: 0, Time elapsed: 0.02 sec
    [junit] Running org.apache.jorphan.gui.ObjectTableSorterTest
    [junit] Tests run: 26, Failures: 0, Errors: 0, Skipped: 0, Time elapsed: 0.027 sec
    [junit] Running org.apache.jorphan.math.TestStatCalculator
    [junit] Tests run: 10, Failures: 0, Errors: 0, Skipped: 2, Time elapsed: 0.005 sec
    [junit] Running org.apache.jorphan.reflect.TestClassFinder
    [junit] Tests run: 10, Failures: 0, Errors: 0, Skipped: 0, Time elapsed: 17.803 sec
    [junit] Running org.apache.jorphan.reflect.TestClassTools
    [junit] Tests run: 4, Failures: 0, Errors: 0, Skipped: 0, Time elapsed: 0.006 sec
    [junit] Running org.apache.jorphan.reflect.TestFunctor
    [junit] Tests run: 6, Failures: 0, Errors: 0, Skipped: 0, Time elapsed: 0.008 sec
    [junit] Running org.apache.jorphan.util.TestConverter
    [junit] Tests run: 8, Failures: 0, Errors: 0, Skipped: 0, Time elapsed: 0.013 sec
    [junit] Running org.apache.jorphan.util.TestJorphanUtils
    [junit] Tests run: 40, Failures: 0, Errors: 0, Skipped: 0, Time elapsed: 0.015 sec

nightlysonar:

checkstyle:

_process_checkstyle_jars:

_check_exists:

_check_jarfile:
[checkstyle] Running Checkstyle 8.8 on 1739 files
[checkstyle] [ERROR] <https://builds.apache.org/job/JMeter-trunk/ws/trunk/test/src/org/apache/jmeter/curl/BasicCurlParserTest.java>:39:
Line is longer than 160 characters (found 361). [LineLength]
[checkstyle] [ERROR] <https://builds.apache.org/job/JMeter-trunk/ws/trunk/test/src/org/apache/jmeter/curl/BasicCurlParserTest.java>:50:
Line is longer than 160 characters (found 519). [LineLength]
[checkstyle] [ERROR] <https://builds.apache.org/job/JMeter-trunk/ws/trunk/test/src/org/apache/jmeter/curl/BasicCurlParserTest.java>:61:
Line is longer than 160 characters (found 506). [LineLength]
[checkstyle] [ERROR] <https://builds.apache.org/job/JMeter-trunk/ws/trunk/test/src/org/apache/jmeter/curl/BasicCurlParserTest.java>:83:
Line is longer than 160 characters (found 473). [LineLength]
[checkstyle] [ERROR] <https://builds.apache.org/job/JMeter-trunk/ws/trunk/test/src/org/apache/jmeter/curl/BasicCurlParserTest.java>:94:
Line is longer than 160 characters (found 509). [LineLength]

BUILD FAILED
<https://builds.apache.org/job/JMeter-trunk/ws/trunk/build.xml>:3610: Got 5 errors and
0 warnings.

Total time: 15 minutes 48 seconds
Build step 'Invoke Ant' marked build as failure
[locks-and-latches] Releasing all the locks
[locks-and-latches] All the locks released
Archiving artifacts
[Fast Archiver] Compressed 136.98 MB of artifacts by 29.4% relative to #6986
Recording test results

Mime
View raw message