jmeter-dev mailing list archives

Site index · List index
Message view « Date » · « Thread »
Top « Date » · « Thread »
From Apache Jenkins Server <jenk...@builds.apache.org>
Subject Build failed in Jenkins: JMeter-trunk #7028
Date Mon, 14 Jan 2019 23:00:33 GMT
See <https://builds.apache.org/job/JMeter-trunk/7028/display/redirect?page=changes>

Changes:

[pmouawad] Bug 63048 - JMeter does not retrieve link resources of type "shortcut icon" or
"icon"

Fix test failure
Bugzilla Id: 63048

[pmouawad] Bug 63048 - JMeter does not retrieve link resources of type "shortcut icon" or
"icon"

Fix test failure
Bugzilla Id: 63048

[pmouawad] Bug 63048 - JMeter does not retrieve link resources of type "shortcut icon" or
"icon"

Contributed by UbikLoadPack (https://ubikloadpack.com)
Bugzilla Id: 63048

[pmouawad] Better logging

[pmouawad] Better logging

------------------------------------------
[...truncated 300.56 KB...]
     [java] 	at sun.reflect.GeneratedMethodAccessor96.invoke(Unknown Source)
     [java] 	at sun.reflect.DelegatingMethodAccessorImpl.invoke(DelegatingMethodAccessorImpl.java:43)
     [java] 	at java.lang.reflect.Method.invoke(Method.java:498)
     [java] 	at junit.framework.TestCase.runTest(TestCase.java:176)
     [java] 	at junit.framework.TestCase.runBare(TestCase.java:141)
     [java] 	at junit.framework.TestResult$1.protect(TestResult.java:122)
     [java] 	at junit.framework.TestResult.runProtected(TestResult.java:142)
     [java] 	at junit.framework.TestResult.run(TestResult.java:125)
     [java] 	at junit.framework.TestCase.run(TestCase.java:129)
     [java] 	at junit.framework.TestSuite.runTest(TestSuite.java:252)
     [java] 	at junit.framework.TestSuite.run(TestSuite.java:247)
     [java] 	at junit.framework.TestSuite.runTest(TestSuite.java:252)
     [java] 	at junit.framework.TestSuite.run(TestSuite.java:247)
     [java] 	at junit.framework.TestSuite.runTest(TestSuite.java:252)
     [java] 	at junit.framework.TestSuite.run(TestSuite.java:247)
     [java] 	at org.junit.internal.runners.JUnit38ClassRunner.run(JUnit38ClassRunner.java:86)
     [java] 	at org.junit.runners.Suite.runChild(Suite.java:128)
     [java] 	at org.junit.runners.Suite.runChild(Suite.java:27)
     [java] 	at org.junit.runners.ParentRunner$3.run(ParentRunner.java:290)
     [java] 	at org.junit.runners.ParentRunner$1.schedule(ParentRunner.java:71)
     [java] 	at org.junit.runners.ParentRunner.runChildren(ParentRunner.java:288)
     [java] 	at org.junit.runners.ParentRunner.access$000(ParentRunner.java:58)
     [java] 	at org.junit.runners.ParentRunner$2.evaluate(ParentRunner.java:268)
     [java] 	at org.junit.runners.ParentRunner.run(ParentRunner.java:363)
     [java] 	at org.junit.runner.JUnitCore.run(JUnitCore.java:137)
     [java] 	at org.junit.runner.JUnitCore.run(JUnitCore.java:115)
     [java] 	at org.apache.jorphan.test.AllTests.main(AllTests.java:219)
     [java] Caused by: org.apache.oro.text.MalformedCachePatternException: Invalid expression:
<(?:!--.*?-->|BASE\s(?:[^>]*\s)?HREF\s*=\s*(?:"([^"]*)"|'([^']*)'|([^"'\s>\\][^\s>]*)(?=[\s>]))|(?:IMG|SCRIPT|FRAME|IFRAME|BGSOUND)\s(?:[^>]*\s)?SRC\s*=\s*(?:"([^"]*)"|'([^']*)'|([^"'\s>\\][^\s>]*)(?=[\s>]))|APPLET\s(?:[^>]*\s)?CODE(?:BASE)?\s*=\s*(?:"([^"]*)"|'([^']*)'|([^"'\s>\\][^\s>]*)(?=[\s>]))|(?:EMBED|OBJECT)\s(?:[^>]*\s)?(?:SRC|CODEBASE|DATA)\s*=\s*(?:"([^"]*)"|'([^']*)'|([^"'\s>\\][^\s>]*)(?=[\s>]))|(?:BODY|TABLE|TR|TD)\s(?:[^>]*\s)?BACKGROUND\s*=\s*(?:"([^"]*)"|'([^']*)'|([^"'\s>\\][^\s>]*)(?=[\s>]))|[^<]+?STYLE\s*=['"].*?URL\(\s*['"](.+?)['"]\s*\)|INPUT(?:\s(?:[^>]*\s)?(?:SRC\s*=\s*(?:"([^"]*)"|'([^']*)'|([^"'\s>\\][^\s>]*)(?=[\s>]))|TYPE\s*=\s*(?:"image"|'image'|image(?=[\s>])))){2,}|LINK(?:\s(?:[^>]*\s)?(?:HREF\s*=\s*(?:"([^"]*)"|'([^']*)'|([^"'\s>\\][^\s>]*)(?=[\s>]))|REL\s*=\s*(?:"stylesheet"|'stylesheet'|stylesheet(?=[\s>])))){2,}|REL\s*=\s*(?:"icon"|'icon'|icon(?=[\s>])))){2,}|REL\s*=\s*(?:"shortcut
icon"|'shortcut icon'|shortcut icon(?=[\s>])))){2,})
     [java] Unmatched parentheses.
     [java] 	at org.apache.oro.text.GenericPatternCache.getPattern(Unknown Source)
     [java] 	at org.apache.jmeter.protocol.http.parser.RegexpHTMLParser.getEmbeddedResourceURLs(RegexpHTMLParser.java:141)
     [java] 	... 30 more
     [java] 16) testParserList(org.apache.jmeter.protocol.http.parser.TestHTMLParser)
     [java] org.apache.jmeter.protocol.http.parser.HTMLParseException: Invalid expression:
<(?:!--.*?-->|BASE\s(?:[^>]*\s)?HREF\s*=\s*(?:"([^"]*)"|'([^']*)'|([^"'\s>\\][^\s>]*)(?=[\s>]))|(?:IMG|SCRIPT|FRAME|IFRAME|BGSOUND)\s(?:[^>]*\s)?SRC\s*=\s*(?:"([^"]*)"|'([^']*)'|([^"'\s>\\][^\s>]*)(?=[\s>]))|APPLET\s(?:[^>]*\s)?CODE(?:BASE)?\s*=\s*(?:"([^"]*)"|'([^']*)'|([^"'\s>\\][^\s>]*)(?=[\s>]))|(?:EMBED|OBJECT)\s(?:[^>]*\s)?(?:SRC|CODEBASE|DATA)\s*=\s*(?:"([^"]*)"|'([^']*)'|([^"'\s>\\][^\s>]*)(?=[\s>]))|(?:BODY|TABLE|TR|TD)\s(?:[^>]*\s)?BACKGROUND\s*=\s*(?:"([^"]*)"|'([^']*)'|([^"'\s>\\][^\s>]*)(?=[\s>]))|[^<]+?STYLE\s*=['"].*?URL\(\s*['"](.+?)['"]\s*\)|INPUT(?:\s(?:[^>]*\s)?(?:SRC\s*=\s*(?:"([^"]*)"|'([^']*)'|([^"'\s>\\][^\s>]*)(?=[\s>]))|TYPE\s*=\s*(?:"image"|'image'|image(?=[\s>])))){2,}|LINK(?:\s(?:[^>]*\s)?(?:HREF\s*=\s*(?:"([^"]*)"|'([^']*)'|([^"'\s>\\][^\s>]*)(?=[\s>]))|REL\s*=\s*(?:"stylesheet"|'stylesheet'|stylesheet(?=[\s>])))){2,}|REL\s*=\s*(?:"icon"|'icon'|icon(?=[\s>])))){2,}|REL\s*=\s*(?:"shortcut
icon"|'shortcut icon'|shortcut icon(?=[\s>])))){2,})
     [java] Unmatched parentheses.
     [java] 	at org.apache.jmeter.protocol.http.parser.RegexpHTMLParser.getEmbeddedResourceURLs(RegexpHTMLParser.java:184)
     [java] 	at org.apache.jmeter.protocol.http.parser.HTMLParser.getEmbeddedResourceURLs(HTMLParser.java:185)
     [java] 	at org.apache.jmeter.protocol.http.parser.TestHTMLParser.filetest(TestHTMLParser.java:390)
     [java] 	at org.apache.jmeter.protocol.http.parser.TestHTMLParser.testParserList(TestHTMLParser.java:359)
     [java] 	at sun.reflect.GeneratedMethodAccessor97.invoke(Unknown Source)
     [java] 	at sun.reflect.DelegatingMethodAccessorImpl.invoke(DelegatingMethodAccessorImpl.java:43)
     [java] 	at java.lang.reflect.Method.invoke(Method.java:498)
     [java] 	at junit.framework.TestCase.runTest(TestCase.java:176)
     [java] 	at junit.framework.TestCase.runBare(TestCase.java:141)
     [java] 	at junit.framework.TestResult$1.protect(TestResult.java:122)
     [java] 	at junit.framework.TestResult.runProtected(TestResult.java:142)
     [java] 	at junit.framework.TestResult.run(TestResult.java:125)
     [java] 	at junit.framework.TestCase.run(TestCase.java:129)
     [java] 	at junit.framework.TestSuite.runTest(TestSuite.java:252)
     [java] 	at junit.framework.TestSuite.run(TestSuite.java:247)
     [java] 	at junit.framework.TestSuite.runTest(TestSuite.java:252)
     [java] 	at junit.framework.TestSuite.run(TestSuite.java:247)
     [java] 	at junit.framework.TestSuite.runTest(TestSuite.java:252)
     [java] 	at junit.framework.TestSuite.run(TestSuite.java:247)
     [java] 	at org.junit.internal.runners.JUnit38ClassRunner.run(JUnit38ClassRunner.java:86)
     [java] 	at org.junit.runners.Suite.runChild(Suite.java:128)
     [java] 	at org.junit.runners.Suite.runChild(Suite.java:27)
     [java] 	at org.junit.runners.ParentRunner$3.run(ParentRunner.java:290)
     [java] 	at org.junit.runners.ParentRunner$1.schedule(ParentRunner.java:71)
     [java] 	at org.junit.runners.ParentRunner.runChildren(ParentRunner.java:288)
     [java] 	at org.junit.runners.ParentRunner.access$000(ParentRunner.java:58)
     [java] 	at org.junit.runners.ParentRunner$2.evaluate(ParentRunner.java:268)
     [java] 	at org.junit.runners.ParentRunner.run(ParentRunner.java:363)
     [java] 	at org.junit.runner.JUnitCore.run(JUnitCore.java:137)
     [java] 	at org.junit.runner.JUnitCore.run(JUnitCore.java:115)
     [java] 	at org.apache.jorphan.test.AllTests.main(AllTests.java:219)
     [java] Caused by: org.apache.oro.text.MalformedCachePatternException: Invalid expression:
<(?:!--.*?-->|BASE\s(?:[^>]*\s)?HREF\s*=\s*(?:"([^"]*)"|'([^']*)'|([^"'\s>\\][^\s>]*)(?=[\s>]))|(?:IMG|SCRIPT|FRAME|IFRAME|BGSOUND)\s(?:[^>]*\s)?SRC\s*=\s*(?:"([^"]*)"|'([^']*)'|([^"'\s>\\][^\s>]*)(?=[\s>]))|APPLET\s(?:[^>]*\s)?CODE(?:BASE)?\s*=\s*(?:"([^"]*)"|'([^']*)'|([^"'\s>\\][^\s>]*)(?=[\s>]))|(?:EMBED|OBJECT)\s(?:[^>]*\s)?(?:SRC|CODEBASE|DATA)\s*=\s*(?:"([^"]*)"|'([^']*)'|([^"'\s>\\][^\s>]*)(?=[\s>]))|(?:BODY|TABLE|TR|TD)\s(?:[^>]*\s)?BACKGROUND\s*=\s*(?:"([^"]*)"|'([^']*)'|([^"'\s>\\][^\s>]*)(?=[\s>]))|[^<]+?STYLE\s*=['"].*?URL\(\s*['"](.+?)['"]\s*\)|INPUT(?:\s(?:[^>]*\s)?(?:SRC\s*=\s*(?:"([^"]*)"|'([^']*)'|([^"'\s>\\][^\s>]*)(?=[\s>]))|TYPE\s*=\s*(?:"image"|'image'|image(?=[\s>])))){2,}|LINK(?:\s(?:[^>]*\s)?(?:HREF\s*=\s*(?:"([^"]*)"|'([^']*)'|([^"'\s>\\][^\s>]*)(?=[\s>]))|REL\s*=\s*(?:"stylesheet"|'stylesheet'|stylesheet(?=[\s>])))){2,}|REL\s*=\s*(?:"icon"|'icon'|icon(?=[\s>])))){2,}|REL\s*=\s*(?:"shortcut
icon"|'shortcut icon'|shortcut icon(?=[\s>])))){2,})
     [java] Unmatched parentheses.
     [java] 	at org.apache.oro.text.GenericPatternCache.getPattern(Unknown Source)
     [java] 	at org.apache.jmeter.protocol.http.parser.RegexpHTMLParser.getEmbeddedResourceURLs(RegexpHTMLParser.java:141)
     [java] 	... 30 more
     [java] 17) testParserSet(org.apache.jmeter.protocol.http.parser.TestHTMLParser)
     [java] org.apache.jmeter.protocol.http.parser.HTMLParseException: Invalid expression:
<(?:!--.*?-->|BASE\s(?:[^>]*\s)?HREF\s*=\s*(?:"([^"]*)"|'([^']*)'|([^"'\s>\\][^\s>]*)(?=[\s>]))|(?:IMG|SCRIPT|FRAME|IFRAME|BGSOUND)\s(?:[^>]*\s)?SRC\s*=\s*(?:"([^"]*)"|'([^']*)'|([^"'\s>\\][^\s>]*)(?=[\s>]))|APPLET\s(?:[^>]*\s)?CODE(?:BASE)?\s*=\s*(?:"([^"]*)"|'([^']*)'|([^"'\s>\\][^\s>]*)(?=[\s>]))|(?:EMBED|OBJECT)\s(?:[^>]*\s)?(?:SRC|CODEBASE|DATA)\s*=\s*(?:"([^"]*)"|'([^']*)'|([^"'\s>\\][^\s>]*)(?=[\s>]))|(?:BODY|TABLE|TR|TD)\s(?:[^>]*\s)?BACKGROUND\s*=\s*(?:"([^"]*)"|'([^']*)'|([^"'\s>\\][^\s>]*)(?=[\s>]))|[^<]+?STYLE\s*=['"].*?URL\(\s*['"](.+?)['"]\s*\)|INPUT(?:\s(?:[^>]*\s)?(?:SRC\s*=\s*(?:"([^"]*)"|'([^']*)'|([^"'\s>\\][^\s>]*)(?=[\s>]))|TYPE\s*=\s*(?:"image"|'image'|image(?=[\s>])))){2,}|LINK(?:\s(?:[^>]*\s)?(?:HREF\s*=\s*(?:"([^"]*)"|'([^']*)'|([^"'\s>\\][^\s>]*)(?=[\s>]))|REL\s*=\s*(?:"stylesheet"|'stylesheet'|stylesheet(?=[\s>])))){2,}|REL\s*=\s*(?:"icon"|'icon'|icon(?=[\s>])))){2,}|REL\s*=\s*(?:"shortcut
icon"|'shortcut icon'|shortcut icon(?=[\s>])))){2,})
     [java] Unmatched parentheses.
     [java] 	at org.apache.jmeter.protocol.http.parser.RegexpHTMLParser.getEmbeddedResourceURLs(RegexpHTMLParser.java:184)
     [java] 	at org.apache.jmeter.protocol.http.parser.HTMLParser.getEmbeddedResourceURLs(HTMLParser.java:116)
     [java] 	at org.apache.jmeter.protocol.http.parser.TestHTMLParser.filetest(TestHTMLParser.java:388)
     [java] 	at org.apache.jmeter.protocol.http.parser.TestHTMLParser.testParserSet(TestHTMLParser.java:353)
     [java] 	at sun.reflect.GeneratedMethodAccessor96.invoke(Unknown Source)
     [java] 	at sun.reflect.DelegatingMethodAccessorImpl.invoke(DelegatingMethodAccessorImpl.java:43)
     [java] 	at java.lang.reflect.Method.invoke(Method.java:498)
     [java] 	at junit.framework.TestCase.runTest(TestCase.java:176)
     [java] 	at junit.framework.TestCase.runBare(TestCase.java:141)
     [java] 	at junit.framework.TestResult$1.protect(TestResult.java:122)
     [java] 	at junit.framework.TestResult.runProtected(TestResult.java:142)
     [java] 	at junit.framework.TestResult.run(TestResult.java:125)
     [java] 	at junit.framework.TestCase.run(TestCase.java:129)
     [java] 	at junit.framework.TestSuite.runTest(TestSuite.java:252)
     [java] 	at junit.framework.TestSuite.run(TestSuite.java:247)
     [java] 	at junit.framework.TestSuite.runTest(TestSuite.java:252)
     [java] 	at junit.framework.TestSuite.run(TestSuite.java:247)
     [java] 	at junit.framework.TestSuite.runTest(TestSuite.java:252)
     [java] 	at junit.framework.TestSuite.run(TestSuite.java:247)
     [java] 	at org.junit.internal.runners.JUnit38ClassRunner.run(JUnit38ClassRunner.java:86)
     [java] 	at org.junit.runners.Suite.runChild(Suite.java:128)
     [java] 	at org.junit.runners.Suite.runChild(Suite.java:27)
     [java] 	at org.junit.runners.ParentRunner$3.run(ParentRunner.java:290)
     [java] 	at org.junit.runners.ParentRunner$1.schedule(ParentRunner.java:71)
     [java] 	at org.junit.runners.ParentRunner.runChildren(ParentRunner.java:288)
     [java] 	at org.junit.runners.ParentRunner.access$000(ParentRunner.java:58)
     [java] 	at org.junit.runners.ParentRunner$2.evaluate(ParentRunner.java:268)
     [java] 	at org.junit.runners.ParentRunner.run(ParentRunner.java:363)
     [java] 	at org.junit.runner.JUnitCore.run(JUnitCore.java:137)
     [java] 	at org.junit.runner.JUnitCore.run(JUnitCore.java:115)
     [java] 	at org.apache.jorphan.test.AllTests.main(AllTests.java:219)
     [java] Caused by: org.apache.oro.text.MalformedCachePatternException: Invalid expression:
<(?:!--.*?-->|BASE\s(?:[^>]*\s)?HREF\s*=\s*(?:"([^"]*)"|'([^']*)'|([^"'\s>\\][^\s>]*)(?=[\s>]))|(?:IMG|SCRIPT|FRAME|IFRAME|BGSOUND)\s(?:[^>]*\s)?SRC\s*=\s*(?:"([^"]*)"|'([^']*)'|([^"'\s>\\][^\s>]*)(?=[\s>]))|APPLET\s(?:[^>]*\s)?CODE(?:BASE)?\s*=\s*(?:"([^"]*)"|'([^']*)'|([^"'\s>\\][^\s>]*)(?=[\s>]))|(?:EMBED|OBJECT)\s(?:[^>]*\s)?(?:SRC|CODEBASE|DATA)\s*=\s*(?:"([^"]*)"|'([^']*)'|([^"'\s>\\][^\s>]*)(?=[\s>]))|(?:BODY|TABLE|TR|TD)\s(?:[^>]*\s)?BACKGROUND\s*=\s*(?:"([^"]*)"|'([^']*)'|([^"'\s>\\][^\s>]*)(?=[\s>]))|[^<]+?STYLE\s*=['"].*?URL\(\s*['"](.+?)['"]\s*\)|INPUT(?:\s(?:[^>]*\s)?(?:SRC\s*=\s*(?:"([^"]*)"|'([^']*)'|([^"'\s>\\][^\s>]*)(?=[\s>]))|TYPE\s*=\s*(?:"image"|'image'|image(?=[\s>])))){2,}|LINK(?:\s(?:[^>]*\s)?(?:HREF\s*=\s*(?:"([^"]*)"|'([^']*)'|([^"'\s>\\][^\s>]*)(?=[\s>]))|REL\s*=\s*(?:"stylesheet"|'stylesheet'|stylesheet(?=[\s>])))){2,}|REL\s*=\s*(?:"icon"|'icon'|icon(?=[\s>])))){2,}|REL\s*=\s*(?:"shortcut
icon"|'shortcut icon'|shortcut icon(?=[\s>])))){2,})
     [java] Unmatched parentheses.
     [java] 	at org.apache.oro.text.GenericPatternCache.getPattern(Unknown Source)
     [java] 	at org.apache.jmeter.protocol.http.parser.RegexpHTMLParser.getEmbeddedResourceURLs(RegexpHTMLParser.java:141)
     [java] 	... 30 more
     [java] 18) testParserList(org.apache.jmeter.protocol.http.parser.TestHTMLParser)
     [java] org.apache.jmeter.protocol.http.parser.HTMLParseException: Invalid expression:
<(?:!--.*?-->|BASE\s(?:[^>]*\s)?HREF\s*=\s*(?:"([^"]*)"|'([^']*)'|([^"'\s>\\][^\s>]*)(?=[\s>]))|(?:IMG|SCRIPT|FRAME|IFRAME|BGSOUND)\s(?:[^>]*\s)?SRC\s*=\s*(?:"([^"]*)"|'([^']*)'|([^"'\s>\\][^\s>]*)(?=[\s>]))|APPLET\s(?:[^>]*\s)?CODE(?:BASE)?\s*=\s*(?:"([^"]*)"|'([^']*)'|([^"'\s>\\][^\s>]*)(?=[\s>]))|(?:EMBED|OBJECT)\s(?:[^>]*\s)?(?:SRC|CODEBASE|DATA)\s*=\s*(?:"([^"]*)"|'([^']*)'|([^"'\s>\\][^\s>]*)(?=[\s>]))|(?:BODY|TABLE|TR|TD)\s(?:[^>]*\s)?BACKGROUND\s*=\s*(?:"([^"]*)"|'([^']*)'|([^"'\s>\\][^\s>]*)(?=[\s>]))|[^<]+?STYLE\s*=['"].*?URL\(\s*['"](.+?)['"]\s*\)|INPUT(?:\s(?:[^>]*\s)?(?:SRC\s*=\s*(?:"([^"]*)"|'([^']*)'|([^"'\s>\\][^\s>]*)(?=[\s>]))|TYPE\s*=\s*(?:"image"|'image'|image(?=[\s>])))){2,}|LINK(?:\s(?:[^>]*\s)?(?:HREF\s*=\s*(?:"([^"]*)"|'([^']*)'|([^"'\s>\\][^\s>]*)(?=[\s>]))|REL\s*=\s*(?:"stylesheet"|'stylesheet'|stylesheet(?=[\s>])))){2,}|REL\s*=\s*(?:"icon"|'icon'|icon(?=[\s>])))){2,}|REL\s*=\s*(?:"shortcut
icon"|'shortcut icon'|shortcut icon(?=[\s>])))){2,})
     [java] Unmatched parentheses.
     [java] 	at org.apache.jmeter.protocol.http.parser.RegexpHTMLParser.getEmbeddedResourceURLs(RegexpHTMLParser.java:184)
     [java] 	at org.apache.jmeter.protocol.http.parser.HTMLParser.getEmbeddedResourceURLs(HTMLParser.java:185)
     [java] 	at org.apache.jmeter.protocol.http.parser.TestHTMLParser.filetest(TestHTMLParser.java:390)
     [java] 	at org.apache.jmeter.protocol.http.parser.TestHTMLParser.testParserList(TestHTMLParser.java:359)
     [java] 	at sun.reflect.GeneratedMethodAccessor97.invoke(Unknown Source)
     [java] 	at sun.reflect.DelegatingMethodAccessorImpl.invoke(DelegatingMethodAccessorImpl.java:43)
     [java] 	at java.lang.reflect.Method.invoke(Method.java:498)
     [java] 	at junit.framework.TestCase.runTest(TestCase.java:176)
     [java] 	at junit.framework.TestCase.runBare(TestCase.java:141)
     [java] 	at junit.framework.TestResult$1.protect(TestResult.java:122)
     [java] 	at junit.framework.TestResult.runProtected(TestResult.java:142)
     [java] 	at junit.framework.TestResult.run(TestResult.java:125)
     [java] 	at junit.framework.TestCase.run(TestCase.java:129)
     [java] 	at junit.framework.TestSuite.runTest(TestSuite.java:252)
     [java] 	at junit.framework.TestSuite.run(TestSuite.java:247)
     [java] 	at junit.framework.TestSuite.runTest(TestSuite.java:252)
     [java] 	at junit.framework.TestSuite.run(TestSuite.java:247)
     [java] 	at junit.framework.TestSuite.runTest(TestSuite.java:252)
     [java] 	at junit.framework.TestSuite.run(TestSuite.java:247)
     [java] 	at org.junit.internal.runners.JUnit38ClassRunner.run(JUnit38ClassRunner.java:86)
     [java] 	at org.junit.runners.Suite.runChild(Suite.java:128)
     [java] 	at org.junit.runners.Suite.runChild(Suite.java:27)
     [java] 	at org.junit.runners.ParentRunner$3.run(ParentRunner.java:290)
     [java] 	at org.junit.runners.ParentRunner$1.schedule(ParentRunner.java:71)
     [java] 	at org.junit.runners.ParentRunner.runChildren(ParentRunner.java:288)
     [java] 	at org.junit.runners.ParentRunner.access$000(ParentRunner.java:58)
     [java] 	at org.junit.runners.ParentRunner$2.evaluate(ParentRunner.java:268)
     [java] 	at org.junit.runners.ParentRunner.run(ParentRunner.java:363)
     [java] 	at org.junit.runner.JUnitCore.run(JUnitCore.java:137)
     [java] 	at org.junit.runner.JUnitCore.run(JUnitCore.java:115)
     [java] 	at org.apache.jorphan.test.AllTests.main(AllTests.java:219)
     [java] Caused by: org.apache.oro.text.MalformedCachePatternException: Invalid expression:
<(?:!--.*?-->|BASE\s(?:[^>]*\s)?HREF\s*=\s*(?:"([^"]*)"|'([^']*)'|([^"'\s>\\][^\s>]*)(?=[\s>]))|(?:IMG|SCRIPT|FRAME|IFRAME|BGSOUND)\s(?:[^>]*\s)?SRC\s*=\s*(?:"([^"]*)"|'([^']*)'|([^"'\s>\\][^\s>]*)(?=[\s>]))|APPLET\s(?:[^>]*\s)?CODE(?:BASE)?\s*=\s*(?:"([^"]*)"|'([^']*)'|([^"'\s>\\][^\s>]*)(?=[\s>]))|(?:EMBED|OBJECT)\s(?:[^>]*\s)?(?:SRC|CODEBASE|DATA)\s*=\s*(?:"([^"]*)"|'([^']*)'|([^"'\s>\\][^\s>]*)(?=[\s>]))|(?:BODY|TABLE|TR|TD)\s(?:[^>]*\s)?BACKGROUND\s*=\s*(?:"([^"]*)"|'([^']*)'|([^"'\s>\\][^\s>]*)(?=[\s>]))|[^<]+?STYLE\s*=['"].*?URL\(\s*['"](.+?)['"]\s*\)|INPUT(?:\s(?:[^>]*\s)?(?:SRC\s*=\s*(?:"([^"]*)"|'([^']*)'|([^"'\s>\\][^\s>]*)(?=[\s>]))|TYPE\s*=\s*(?:"image"|'image'|image(?=[\s>])))){2,}|LINK(?:\s(?:[^>]*\s)?(?:HREF\s*=\s*(?:"([^"]*)"|'([^']*)'|([^"'\s>\\][^\s>]*)(?=[\s>]))|REL\s*=\s*(?:"stylesheet"|'stylesheet'|stylesheet(?=[\s>])))){2,}|REL\s*=\s*(?:"icon"|'icon'|icon(?=[\s>])))){2,}|REL\s*=\s*(?:"shortcut
icon"|'shortcut icon'|shortcut icon(?=[\s>])))){2,})
     [java] Unmatched parentheses.
     [java] 	at org.apache.oro.text.GenericPatternCache.getPattern(Unknown Source)
     [java] 	at org.apache.jmeter.protocol.http.parser.RegexpHTMLParser.getEmbeddedResourceURLs(RegexpHTMLParser.java:141)
     [java] 	... 30 more
     [java] 19) testParserSet(org.apache.jmeter.protocol.http.parser.TestHTMLParser)
     [java] org.apache.jmeter.protocol.http.parser.HTMLParseException: Invalid expression:
<(?:!--.*?-->|BASE\s(?:[^>]*\s)?HREF\s*=\s*(?:"([^"]*)"|'([^']*)'|([^"'\s>\\][^\s>]*)(?=[\s>]))|(?:IMG|SCRIPT|FRAME|IFRAME|BGSOUND)\s(?:[^>]*\s)?SRC\s*=\s*(?:"([^"]*)"|'([^']*)'|([^"'\s>\\][^\s>]*)(?=[\s>]))|APPLET\s(?:[^>]*\s)?CODE(?:BASE)?\s*=\s*(?:"([^"]*)"|'([^']*)'|([^"'\s>\\][^\s>]*)(?=[\s>]))|(?:EMBED|OBJECT)\s(?:[^>]*\s)?(?:SRC|CODEBASE|DATA)\s*=\s*(?:"([^"]*)"|'([^']*)'|([^"'\s>\\][^\s>]*)(?=[\s>]))|(?:BODY|TABLE|TR|TD)\s(?:[^>]*\s)?BACKGROUND\s*=\s*(?:"([^"]*)"|'([^']*)'|([^"'\s>\\][^\s>]*)(?=[\s>]))|[^<]+?STYLE\s*=['"].*?URL\(\s*['"](.+?)['"]\s*\)|INPUT(?:\s(?:[^>]*\s)?(?:SRC\s*=\s*(?:"([^"]*)"|'([^']*)'|([^"'\s>\\][^\s>]*)(?=[\s>]))|TYPE\s*=\s*(?:"image"|'image'|image(?=[\s>])))){2,}|LINK(?:\s(?:[^>]*\s)?(?:HREF\s*=\s*(?:"([^"]*)"|'([^']*)'|([^"'\s>\\][^\s>]*)(?=[\s>]))|REL\s*=\s*(?:"stylesheet"|'stylesheet'|stylesheet(?=[\s>])))){2,}|REL\s*=\s*(?:"icon"|'icon'|icon(?=[\s>])))){2,}|REL\s*=\s*(?:"shortcut
icon"|'shortcut icon'|shortcut icon(?=[\s>])))){2,})
     [java] Unmatched parentheses.
     [java] 	at org.apache.jmeter.protocol.http.parser.RegexpHTMLParser.getEmbeddedResourceURLs(RegexpHTMLParser.java:184)
     [java] 	at org.apache.jmeter.protocol.http.parser.HTMLParser.getEmbeddedResourceURLs(HTMLParser.java:116)
     [java] 	at org.apache.jmeter.protocol.http.parser.TestHTMLParser.filetest(TestHTMLParser.java:388)
     [java] 	at org.apache.jmeter.protocol.http.parser.TestHTMLParser.testParserSet(TestHTMLParser.java:353)
     [java] 	at sun.reflect.GeneratedMethodAccessor96.invoke(Unknown Source)
     [java] 	at sun.reflect.DelegatingMethodAccessorImpl.invoke(DelegatingMethodAccessorImpl.java:43)
     [java] 	at java.lang.reflect.Method.invoke(Method.java:498)
     [java] 	at junit.framework.TestCase.runTest(TestCase.java:176)
     [java] 	at junit.framework.TestCase.runBare(TestCase.java:141)
     [java] 	at junit.framework.TestResult$1.protect(TestResult.java:122)
     [java] 	at junit.framework.TestResult.runProtected(TestResult.java:142)
     [java] 	at junit.framework.TestResult.run(TestResult.java:125)
     [java] 	at junit.framework.TestCase.run(TestCase.java:129)
     [java] 	at junit.framework.TestSuite.runTest(TestSuite.java:252)
     [java] 	at junit.framework.TestSuite.run(TestSuite.java:247)
     [java] 	at junit.framework.TestSuite.runTest(TestSuite.java:252)
     [java] 	at junit.framework.TestSuite.run(TestSuite.java:247)
     [java] 	at junit.framework.TestSuite.runTest(TestSuite.java:252)
     [java] 	at junit.framework.TestSuite.run(TestSuite.java:247)
     [java] 	at org.junit.internal.runners.JUnit38ClassRunner.run(JUnit38ClassRunner.java:86)
     [java] 	at org.junit.runners.Suite.runChild(Suite.java:128)
     [java] 	at org.junit.runners.Suite.runChild(Suite.java:27)
     [java] 	at org.junit.runners.ParentRunner$3.run(ParentRunner.java:290)
     [java] 	at org.junit.runners.ParentRunner$1.schedule(ParentRunner.java:71)
     [java] 	at org.junit.runners.ParentRunner.runChildren(ParentRunner.java:288)
     [java] 	at org.junit.runners.ParentRunner.access$000(ParentRunner.java:58)
     [java] 	at org.junit.runners.ParentRunner$2.evaluate(ParentRunner.java:268)
     [java] 	at org.junit.runners.ParentRunner.run(ParentRunner.java:363)
     [java] 	at org.junit.runner.JUnitCore.run(JUnitCore.java:137)
     [java] 	at org.junit.runner.JUnitCore.run(JUnitCore.java:115)
     [java] 	at org.apache.jorphan.test.AllTests.main(AllTests.java:219)
     [java] Caused by: org.apache.oro.text.MalformedCachePatternException: Invalid expression:
<(?:!--.*?-->|BASE\s(?:[^>]*\s)?HREF\s*=\s*(?:"([^"]*)"|'([^']*)'|([^"'\s>\\][^\s>]*)(?=[\s>]))|(?:IMG|SCRIPT|FRAME|IFRAME|BGSOUND)\s(?:[^>]*\s)?SRC\s*=\s*(?:"([^"]*)"|'([^']*)'|([^"'\s>\\][^\s>]*)(?=[\s>]))|APPLET\s(?:[^>]*\s)?CODE(?:BASE)?\s*=\s*(?:"([^"]*)"|'([^']*)'|([^"'\s>\\][^\s>]*)(?=[\s>]))|(?:EMBED|OBJECT)\s(?:[^>]*\s)?(?:SRC|CODEBASE|DATA)\s*=\s*(?:"([^"]*)"|'([^']*)'|([^"'\s>\\][^\s>]*)(?=[\s>]))|(?:BODY|TABLE|TR|TD)\s(?:[^>]*\s)?BACKGROUND\s*=\s*(?:"([^"]*)"|'([^']*)'|([^"'\s>\\][^\s>]*)(?=[\s>]))|[^<]+?STYLE\s*=['"].*?URL\(\s*['"](.+?)['"]\s*\)|INPUT(?:\s(?:[^>]*\s)?(?:SRC\s*=\s*(?:"([^"]*)"|'([^']*)'|([^"'\s>\\][^\s>]*)(?=[\s>]))|TYPE\s*=\s*(?:"image"|'image'|image(?=[\s>])))){2,}|LINK(?:\s(?:[^>]*\s)?(?:HREF\s*=\s*(?:"([^"]*)"|'([^']*)'|([^"'\s>\\][^\s>]*)(?=[\s>]))|REL\s*=\s*(?:"stylesheet"|'stylesheet'|stylesheet(?=[\s>])))){2,}|REL\s*=\s*(?:"icon"|'icon'|icon(?=[\s>])))){2,}|REL\s*=\s*(?:"shortcut
icon"|'shortcut icon'|shortcut icon(?=[\s>])))){2,})
     [java] Unmatched parentheses.
     [java] 	at org.apache.oro.text.GenericPatternCache.getPattern(Unknown Source)
     [java] 	at org.apache.jmeter.protocol.http.parser.RegexpHTMLParser.getEmbeddedResourceURLs(RegexpHTMLParser.java:141)
     [java] 	... 30 more
     [java] 20) testParserList(org.apache.jmeter.protocol.http.parser.TestHTMLParser)
     [java] org.apache.jmeter.protocol.http.parser.HTMLParseException: Invalid expression:
<(?:!--.*?-->|BASE\s(?:[^>]*\s)?HREF\s*=\s*(?:"([^"]*)"|'([^']*)'|([^"'\s>\\][^\s>]*)(?=[\s>]))|(?:IMG|SCRIPT|FRAME|IFRAME|BGSOUND)\s(?:[^>]*\s)?SRC\s*=\s*(?:"([^"]*)"|'([^']*)'|([^"'\s>\\][^\s>]*)(?=[\s>]))|APPLET\s(?:[^>]*\s)?CODE(?:BASE)?\s*=\s*(?:"([^"]*)"|'([^']*)'|([^"'\s>\\][^\s>]*)(?=[\s>]))|(?:EMBED|OBJECT)\s(?:[^>]*\s)?(?:SRC|CODEBASE|DATA)\s*=\s*(?:"([^"]*)"|'([^']*)'|([^"'\s>\\][^\s>]*)(?=[\s>]))|(?:BODY|TABLE|TR|TD)\s(?:[^>]*\s)?BACKGROUND\s*=\s*(?:"([^"]*)"|'([^']*)'|([^"'\s>\\][^\s>]*)(?=[\s>]))|[^<]+?STYLE\s*=['"].*?URL\(\s*['"](.+?)['"]\s*\)|INPUT(?:\s(?:[^>]*\s)?(?:SRC\s*=\s*(?:"([^"]*)"|'([^']*)'|([^"'\s>\\][^\s>]*)(?=[\s>]))|TYPE\s*=\s*(?:"image"|'image'|image(?=[\s>])))){2,}|LINK(?:\s(?:[^>]*\s)?(?:HREF\s*=\s*(?:"([^"]*)"|'([^']*)'|([^"'\s>\\][^\s>]*)(?=[\s>]))|REL\s*=\s*(?:"stylesheet"|'stylesheet'|stylesheet(?=[\s>])))){2,}|REL\s*=\s*(?:"icon"|'icon'|icon(?=[\s>])))){2,}|REL\s*=\s*(?:"shortcut
icon"|'shortcut icon'|shortcut icon(?=[\s>])))){2,})
     [java] Unmatched parentheses.
     [java] 	at org.apache.jmeter.protocol.http.parser.RegexpHTMLParser.getEmbeddedResourceURLs(RegexpHTMLParser.java:184)
     [java] 	at org.apache.jmeter.protocol.http.parser.HTMLParser.getEmbeddedResourceURLs(HTMLParser.java:185)
     [java] 	at org.apache.jmeter.protocol.http.parser.TestHTMLParser.filetest(TestHTMLParser.java:390)
     [java] 	at org.apache.jmeter.protocol.http.parser.TestHTMLParser.testParserList(TestHTMLParser.java:359)
     [java] 	at sun.reflect.GeneratedMethodAccessor97.invoke(Unknown Source)
     [java] 	at sun.reflect.DelegatingMethodAccessorImpl.invoke(DelegatingMethodAccessorImpl.java:43)
     [java] 	at java.lang.reflect.Method.invoke(Method.java:498)
     [java] 	at junit.framework.TestCase.runTest(TestCase.java:176)
     [java] 	at junit.framework.TestCase.runBare(TestCase.java:141)
     [java] 	at junit.framework.TestResult$1.protect(TestResult.java:122)
     [java] 	at junit.framework.TestResult.runProtected(TestResult.java:142)
     [java] 	at junit.framework.TestResult.run(TestResult.java:125)
     [java] 	at junit.framework.TestCase.run(TestCase.java:129)
     [java] 	at junit.framework.TestSuite.runTest(TestSuite.java:252)
     [java] 	at junit.framework.TestSuite.run(TestSuite.java:247)
     [java] 	at junit.framework.TestSuite.runTest(TestSuite.java:252)
     [java] 	at junit.framework.TestSuite.run(TestSuite.java:247)
     [java] 	at junit.framework.TestSuite.runTest(TestSuite.java:252)
     [java] 	at junit.framework.TestSuite.run(TestSuite.java:247)
     [java] 	at org.junit.internal.runners.JUnit38ClassRunner.run(JUnit38ClassRunner.java:86)
     [java] 	at org.junit.runners.Suite.runChild(Suite.java:128)
     [java] 	at org.junit.runners.Suite.runChild(Suite.java:27)
     [java] 	at org.junit.runners.ParentRunner$3.run(ParentRunner.java:290)
     [java] 	at org.junit.runners.ParentRunner$1.schedule(ParentRunner.java:71)
     [java] 	at org.junit.runners.ParentRunner.runChildren(ParentRunner.java:288)
     [java] 	at org.junit.runners.ParentRunner.access$000(ParentRunner.java:58)
     [java] 	at org.junit.runners.ParentRunner$2.evaluate(ParentRunner.java:268)
     [java] 	at org.junit.runners.ParentRunner.run(ParentRunner.java:363)
     [java] 	at org.junit.runner.JUnitCore.run(JUnitCore.java:137)
     [java] 	at org.junit.runner.JUnitCore.run(JUnitCore.java:115)
     [java] 	at org.apache.jorphan.test.AllTests.main(AllTests.java:219)
     [java] Caused by: org.apache.oro.text.MalformedCachePatternException: Invalid expression:
<(?:!--.*?-->|BASE\s(?:[^>]*\s)?HREF\s*=\s*(?:"([^"]*)"|'([^']*)'|([^"'\s>\\][^\s>]*)(?=[\s>]))|(?:IMG|SCRIPT|FRAME|IFRAME|BGSOUND)\s(?:[^>]*\s)?SRC\s*=\s*(?:"([^"]*)"|'([^']*)'|([^"'\s>\\][^\s>]*)(?=[\s>]))|APPLET\s(?:[^>]*\s)?CODE(?:BASE)?\s*=\s*(?:"([^"]*)"|'([^']*)'|([^"'\s>\\][^\s>]*)(?=[\s>]))|(?:EMBED|OBJECT)\s(?:[^>]*\s)?(?:SRC|CODEBASE|DATA)\s*=\s*(?:"([^"]*)"|'([^']*)'|([^"'\s>\\][^\s>]*)(?=[\s>]))|(?:BODY|TABLE|TR|TD)\s(?:[^>]*\s)?BACKGROUND\s*=\s*(?:"([^"]*)"|'([^']*)'|([^"'\s>\\][^\s>]*)(?=[\s>]))|[^<]+?STYLE\s*=['"].*?URL\(\s*['"](.+?)['"]\s*\)|INPUT(?:\s(?:[^>]*\s)?(?:SRC\s*=\s*(?:"([^"]*)"|'([^']*)'|([^"'\s>\\][^\s>]*)(?=[\s>]))|TYPE\s*=\s*(?:"image"|'image'|image(?=[\s>])))){2,}|LINK(?:\s(?:[^>]*\s)?(?:HREF\s*=\s*(?:"([^"]*)"|'([^']*)'|([^"'\s>\\][^\s>]*)(?=[\s>]))|REL\s*=\s*(?:"stylesheet"|'stylesheet'|stylesheet(?=[\s>])))){2,}|REL\s*=\s*(?:"icon"|'icon'|icon(?=[\s>])))){2,}|REL\s*=\s*(?:"shortcut
icon"|'shortcut icon'|shortcut icon(?=[\s>])))){2,})
     [java] Unmatched parentheses.
     [java] 	at org.apache.oro.text.GenericPatternCache.getPattern(Unknown Source)
     [java] 	at org.apache.jmeter.protocol.http.parser.RegexpHTMLParser.getEmbeddedResourceURLs(RegexpHTMLParser.java:141)
     [java] 	... 30 more
     [java] 
     [java] FAILURES!!!
     [java] Tests run: 3291,  Failures: 20
     [java] 
     [java] ................................................................................
     [java] Time: 4.638
     [java] 
     [java] OK (80 tests)
     [java] 

BUILD FAILED
<https://builds.apache.org/job/JMeter-trunk/ws/trunk/build.xml>:3098: Java returned:
1

Total time: 2 minutes 58 seconds
Build step 'Invoke Ant' marked build as failure
[locks-and-latches] Releasing all the locks
[locks-and-latches] All the locks released
Archiving artifacts
Recording test results
ERROR: Step ?Publish JUnit test result report? failed: Test reports were found but none of
them are new. Did leafNodes run? 
For example, <https://builds.apache.org/job/JMeter-trunk/ws/trunk/reports/TEST-org.apache.commons.cli.avalon.ClutilTestCase.xml>
is 6 days 14 hr old


Mime
View raw message