jmeter-dev mailing list archives

Site index · List index
Message view « Date » · « Thread »
Top « Date » · « Thread »
From Apache Jenkins Server <jenk...@builds.apache.org>
Subject Build failed in Jenkins: JMeter Windows #1241
Date Tue, 08 Jan 2019 08:31:40 GMT
See <https://builds.apache.org/job/JMeter%20Windows/1241/display/redirect?page=changes>

Changes:

[pmouawad] Bug 59633 : Menus <code>Save Test Plan as</code>, <code>Save
as Test Fragment</code> and <code>Save Selection as ...</code> should use
a new file name in File Dialog
Bugzilla Id: 59633

------------------------------------------
[...truncated 584.14 KB...]
   [concat] 	at java.net.Socket.connect(Socket.java:589) ~[?:1.8.0_152]
   [concat] 	at org.apache.jmeter.protocol.tcp.sampler.TCPSampler.getSocket(TCPSampler.java:168)
[ApacheJMeter_tcp.jar:r1850715]
   [concat] 	at org.apache.jmeter.protocol.tcp.sampler.TCPSampler.sample(TCPSampler.java:384)
[ApacheJMeter_tcp.jar:r1850715]
   [concat] 	at org.apache.jmeter.threads.JMeterThread.doSampling(JMeterThread.java:622) [ApacheJMeter_core.jar:r1850715]
   [concat] 	at org.apache.jmeter.threads.JMeterThread.executeSamplePackage(JMeterThread.java:546)
[ApacheJMeter_core.jar:r1850715]
   [concat] 	at org.apache.jmeter.threads.JMeterThread.processSampler(JMeterThread.java:486)
[ApacheJMeter_core.jar:r1850715]
   [concat] 	at org.apache.jmeter.threads.JMeterThread.run(JMeterThread.java:253) [ApacheJMeter_core.jar:r1850715]
   [concat] 	at java.lang.Thread.run(Thread.java:748) [?:1.8.0_152]
   [concat] 2019-01-08 00:28:46,639 ERROR o.a.j.p.t.s.TCPSampler: Could not find protocol
class 'org.foo.xxx'
     [echo] TCP_TESTS output files compared OK

batchtest:
     [echo] Starting JDBC_TESTS with file JDBC_TESTS.jmx using -X -Jdummy=dummy
   [jmeter] SLF4J: Class path contains multiple SLF4J bindings.
   [jmeter] SLF4J: Found binding in [jar:file:/F:/jenkins/jenkins-slave/workspace/JMeter%20Windows/trunk/lib/log4j-slf4j-impl-2.11.1.jar!/org/slf4j/impl/StaticLoggerBinder.class]
   [jmeter] SLF4J: Found binding in [jar:file:/F:/jenkins/jenkins-slave/workspace/JMeter%20Windows/trunk/lib/opt/activemq-all-5.15.7.jar!/org/slf4j/impl/StaticLoggerBinder.class]
   [jmeter] SLF4J: See http://www.slf4j.org/codes.html#multiple_bindings for an explanation.
   [jmeter] SLF4J: Actual binding is of type [org.apache.logging.slf4j.Log4jLoggerFactory]
   [jmeter] Jan 08, 2019 12:28:50 AM java.util.prefs.WindowsPreferences <init>
   [jmeter] Creating summariser <summary>
   [jmeter] Created the tree successfully using testfiles/JDBC_TESTS.jmx
   [jmeter] WARNING: Could not open/create prefs root node Software\JavaSoft\Prefs at root
0x80000002. Windows RegCreateKeyEx(...) returned error code 5.
   [jmeter] Starting the test @ Tue Jan 08 00:28:50 PST 2019 (1546936130283)
   [jmeter] Waiting for possible Shutdown/StopTestNow/HeapDump/ThreadDump message on port
4445
   [jmeter] summary =     21 in 00:00:02 =   11.7/s Avg:    31 Min:     0 Max:   596 Err:
    0 (0.00%)
   [jmeter] Tidying up ...    @ Tue Jan 08 00:28:53 PST 2019 (1546936133525)
   [jmeter] ... end of run
   [concat] 2019-01-08 00:28:53,479 ERROR o.a.j.t.JMeterThread: Error while processing sampler:
'JDBC_With_Failing_PreProcessor'.
   [concat] java.lang.IllegalArgumentException: Variable Name must not be null in JDBC PreProcessor
   [concat] 	at org.apache.jmeter.protocol.jdbc.processor.AbstractJDBCProcessor.process(AbstractJDBCProcessor.java:45)
~[ApacheJMeter_jdbc.jar:r1850715]
   [concat] 	at org.apache.jmeter.protocol.jdbc.processor.JDBCPreProcessor.process(JDBCPreProcessor.java:33)
~[ApacheJMeter_jdbc.jar:r1850715]
   [concat] 	at org.apache.jmeter.threads.JMeterThread.runPreProcessors(JMeterThread.java:935)
~[ApacheJMeter_core.jar:r1850715]
   [concat] 	at org.apache.jmeter.threads.JMeterThread.executeSamplePackage(JMeterThread.java:537)
~[ApacheJMeter_core.jar:r1850715]
   [concat] 	at org.apache.jmeter.threads.JMeterThread.processSampler(JMeterThread.java:486)
[ApacheJMeter_core.jar:r1850715]
   [concat] 	at org.apache.jmeter.threads.JMeterThread.run(JMeterThread.java:253) [ApacheJMeter_core.jar:r1850715]
   [concat] 	at java.lang.Thread.run(Thread.java:748) [?:1.8.0_152]
   [concat] 2019-01-08 00:28:53,494 ERROR o.a.j.t.JMeterThread: Error while processing sampler:
'JDBC_With_Failing_PostProcessor'.
   [concat] java.lang.IllegalArgumentException: Variable Name must not be null in JDBC PostProcessor
   [concat] 	at org.apache.jmeter.protocol.jdbc.processor.AbstractJDBCProcessor.process(AbstractJDBCProcessor.java:45)
~[ApacheJMeter_jdbc.jar:r1850715]
   [concat] 	at org.apache.jmeter.protocol.jdbc.processor.JDBCPostProcessor.process(JDBCPostProcessor.java:33)
~[ApacheJMeter_jdbc.jar:r1850715]
   [concat] 	at org.apache.jmeter.threads.JMeterThread.runPostProcessors(JMeterThread.java:925)
~[ApacheJMeter_core.jar:r1850715]
   [concat] 	at org.apache.jmeter.threads.JMeterThread.executeSamplePackage(JMeterThread.java:564)
~[ApacheJMeter_core.jar:r1850715]
   [concat] 	at org.apache.jmeter.threads.JMeterThread.processSampler(JMeterThread.java:486)
[ApacheJMeter_core.jar:r1850715]
   [concat] 	at org.apache.jmeter.threads.JMeterThread.run(JMeterThread.java:253) [ApacheJMeter_core.jar:r1850715]
   [concat] 	at java.lang.Thread.run(Thread.java:748) [?:1.8.0_152]
   [concat] 2019-01-08 00:28:53,495 WARN o.a.j.p.j.p.AbstractJDBCProcessor: SQL Problem in
JDBC PreProcessor: java.sql.SQLSyntaxErrorException: unexpected token: USERS
   [concat] 2019-01-08 00:28:53,504 WARN o.a.j.p.j.p.AbstractJDBCProcessor: SQL Problem in
JDBC PostProcessor: java.sql.SQLSyntaxErrorException: unexpected token: USERS
     [echo] JDBC_TESTS output files compared OK

batchtest:
     [echo] Starting JMS_TESTS with file JMS_TESTS.jmx using -X -Jdummy=dummy
   [jmeter] SLF4J: Class path contains multiple SLF4J bindings.
   [jmeter] SLF4J: Found binding in [jar:file:/F:/jenkins/jenkins-slave/workspace/JMeter%20Windows/trunk/lib/log4j-slf4j-impl-2.11.1.jar!/org/slf4j/impl/StaticLoggerBinder.class]
   [jmeter] SLF4J: Found binding in [jar:file:/F:/jenkins/jenkins-slave/workspace/JMeter%20Windows/trunk/lib/opt/activemq-all-5.15.7.jar!/org/slf4j/impl/StaticLoggerBinder.class]
   [jmeter] SLF4J: See http://www.slf4j.org/codes.html#multiple_bindings for an explanation.
   [jmeter] SLF4J: Actual binding is of type [org.apache.logging.slf4j.Log4jLoggerFactory]
   [jmeter] Jan 08, 2019 12:28:57 AM java.util.prefs.WindowsPreferences <init>
   [jmeter] WARNING: Could not open/create prefs root node Software\JavaSoft\Prefs at root
0x80000002. Windows RegCreateKeyEx(...) returned error code 5.
   [jmeter] Creating summariser <summary>
   [jmeter] Created the tree successfully using testfiles/JMS_TESTS.jmx
   [jmeter] Starting the test @ Tue Jan 08 00:28:57 PST 2019 (1546936137201)
   [jmeter] Waiting for possible Shutdown/StopTestNow/HeapDump/ThreadDump message on port
4445
   [jmeter] summary +      1 in 00:00:03 =    0.3/s Avg:  2882 Min:  2882 Max:  2882 Err:
    0 (0.00%) Active: 1 Started: 1 Finished: 0
   [jmeter] summary +     26 in 00:00:34 =    0.8/s Avg:   530 Min:     0 Max:  3001 Err:
    0 (0.00%) Active: 1 Started: 1 Finished: 0
   [jmeter] summary =     27 in 00:00:37 =    0.7/s Avg:   617 Min:     0 Max:  3001 Err:
    0 (0.00%)
   [jmeter] summary =     27 in 00:00:37 =    0.7/s Avg:   617 Min:     0 Max:  3001 Err:
    0 (0.00%)
   [jmeter] Tidying up ...    @ Tue Jan 08 00:29:35 PST 2019 (1546936175206)
   [jmeter] ... end of run
     [echo] JMS_TESTS output files compared OK

batchtest:
     [echo] Starting OS_TESTS with file OS_TESTS.jmx using -X -Jdummy=dummy
   [jmeter] SLF4J: Class path contains multiple SLF4J bindings.
   [jmeter] SLF4J: Found binding in [jar:file:/F:/jenkins/jenkins-slave/workspace/JMeter%20Windows/trunk/lib/log4j-slf4j-impl-2.11.1.jar!/org/slf4j/impl/StaticLoggerBinder.class]
   [jmeter] SLF4J: Found binding in [jar:file:/F:/jenkins/jenkins-slave/workspace/JMeter%20Windows/trunk/lib/opt/activemq-all-5.15.7.jar!/org/slf4j/impl/StaticLoggerBinder.class]
   [jmeter] SLF4J: See http://www.slf4j.org/codes.html#multiple_bindings for an explanation.
   [jmeter] SLF4J: Actual binding is of type [org.apache.logging.slf4j.Log4jLoggerFactory]
   [jmeter] Creating summariser <summary>
   [jmeter] Created the tree successfully using testfiles/OS_TESTS.jmx
   [jmeter] Starting the test @ Tue Jan 08 00:29:39 PST 2019 (1546936179137)
   [jmeter] Waiting for possible Shutdown/StopTestNow/HeapDump/ThreadDump message on port
4445
   [jmeter] Jan 08, 2019 12:29:39 AM java.util.prefs.WindowsPreferences <init>
   [jmeter] WARNING: Could not open/create prefs root node Software\JavaSoft\Prefs at root
0x80000002. Windows RegCreateKeyEx(...) returned error code 5.
   [jmeter] summary =      3 in 00:00:03 =    1.2/s Avg:   438 Min:    52 Max:  1023 Err:
    0 (0.00%)
   [jmeter] Tidying up ...    @ Tue Jan 08 00:29:42 PST 2019 (1546936182004)
   [jmeter] ... end of run
     [echo] OS_TESTS output files compared OK

batchtest:
     [echo] Starting FTP_TESTS with file FTP_TESTS.jmx using -X -Jdummy=dummy
   [jmeter] SLF4J: Class path contains multiple SLF4J bindings.
   [jmeter] SLF4J: Found binding in [jar:file:/F:/jenkins/jenkins-slave/workspace/JMeter%20Windows/trunk/lib/log4j-slf4j-impl-2.11.1.jar!/org/slf4j/impl/StaticLoggerBinder.class]
   [jmeter] SLF4J: Found binding in [jar:file:/F:/jenkins/jenkins-slave/workspace/JMeter%20Windows/trunk/lib/opt/activemq-all-5.15.7.jar!/org/slf4j/impl/StaticLoggerBinder.class]
   [jmeter] SLF4J: See http://www.slf4j.org/codes.html#multiple_bindings for an explanation.
   [jmeter] SLF4J: Actual binding is of type [org.apache.logging.slf4j.Log4jLoggerFactory]
   [jmeter] Creating summariser <summary>
   [jmeter] Created the tree successfully using testfiles/FTP_TESTS.jmx
   [jmeter] Starting the test @ Tue Jan 08 00:29:45 PST 2019 (1546936185476)
   [jmeter] Waiting for possible Shutdown/StopTestNow/HeapDump/ThreadDump message on port
4445
   [jmeter] Jan 08, 2019 12:29:45 AM java.util.prefs.WindowsPreferences <init>
   [jmeter] WARNING: Could not open/create prefs root node Software\JavaSoft\Prefs at root
0x80000002. Windows RegCreateKeyEx(...) returned error code 5.
   [jmeter] summary =      6 in 00:00:03 =    2.1/s Avg:   276 Min:    22 Max:  1365 Err:
    0 (0.00%)
   [jmeter] Tidying up ...    @ Tue Jan 08 00:29:49 PST 2019 (1546936189786)
   [jmeter] ... end of run
     [echo] FTP_TESTS output files compared OK

batchtest:
     [echo] Starting Bug60607 with file Bug60607.jmx using -X -Jdummy=dummy
   [jmeter] SLF4J: Class path contains multiple SLF4J bindings.
   [jmeter] SLF4J: Found binding in [jar:file:/F:/jenkins/jenkins-slave/workspace/JMeter%20Windows/trunk/lib/log4j-slf4j-impl-2.11.1.jar!/org/slf4j/impl/StaticLoggerBinder.class]
   [jmeter] SLF4J: Found binding in [jar:file:/F:/jenkins/jenkins-slave/workspace/JMeter%20Windows/trunk/lib/opt/activemq-all-5.15.7.jar!/org/slf4j/impl/StaticLoggerBinder.class]
   [jmeter] SLF4J: See http://www.slf4j.org/codes.html#multiple_bindings for an explanation.
   [jmeter] SLF4J: Actual binding is of type [org.apache.logging.slf4j.Log4jLoggerFactory]
   [jmeter] Creating summariser <summary>
   [jmeter] Created the tree successfully using testfiles/Bug60607.jmx
   [jmeter] Starting the test @ Tue Jan 08 00:29:53 PST 2019 (1546936193399)
   [jmeter] Jan 08, 2019 12:29:53 AM java.util.prefs.WindowsPreferences <init>
   [jmeter] WARNING: Could not open/create prefs root node Software\JavaSoft\Prefs at root
0x80000002. Windows RegCreateKeyEx(...) returned error code 5.
   [jmeter] Waiting for possible Shutdown/StopTestNow/HeapDump/ThreadDump message on port
4445
   [jmeter] summary =      2 in 00:00:31 =    0.1/s Avg: 15151 Min:   172 Max: 30131 Err:
    0 (0.00%)
   [jmeter] Tidying up ...    @ Tue Jan 08 00:30:25 PST 2019 (1546936225026)
   [jmeter] ... end of run
     [echo] Bug60607 output files compared OK

batchtest:
     [echo] Starting SlowCharsFeature_HttpClient4 with file SlowCharsFeature.jmx using -X
-Jdummy=dummy
   [jmeter] SLF4J: Class path contains multiple SLF4J bindings.
   [jmeter] SLF4J: Found binding in [jar:file:/F:/jenkins/jenkins-slave/workspace/JMeter%20Windows/trunk/lib/log4j-slf4j-impl-2.11.1.jar!/org/slf4j/impl/StaticLoggerBinder.class]
   [jmeter] SLF4J: Found binding in [jar:file:/F:/jenkins/jenkins-slave/workspace/JMeter%20Windows/trunk/lib/opt/activemq-all-5.15.7.jar!/org/slf4j/impl/StaticLoggerBinder.class]
   [jmeter] SLF4J: See http://www.slf4j.org/codes.html#multiple_bindings for an explanation.
   [jmeter] SLF4J: Actual binding is of type [org.apache.logging.slf4j.Log4jLoggerFactory]
   [jmeter] Jan 08, 2019 12:30:29 AM java.util.prefs.WindowsPreferences <init>
   [jmeter] Creating summariser <summary>
   [jmeter] Created the tree successfully using testfiles/SlowCharsFeature.jmx
   [jmeter] Starting the test @ Tue Jan 08 00:30:29 PST 2019 (1546936229398)
   [jmeter] Waiting for possible Shutdown/StopTestNow/HeapDump/ThreadDump message on port
4445
   [jmeter] WARNING: Could not open/create prefs root node Software\JavaSoft\Prefs at root
0x80000002. Windows RegCreateKeyEx(...) returned error code 5.
   [jmeter] summary +      1 in 00:00:01 =    1.2/s Avg:   770 Min:   770 Max:   770 Err:
    0 (0.00%) Active: 1 Started: 1 Finished: 0
   [jmeter] summary +      4 in 00:00:32 =    0.1/s Avg:  7770 Min:  5587 Max: 14194 Err:
    0 (0.00%) Active: 1 Started: 1 Finished: 0
   [jmeter] summary =      5 in 00:00:33 =    0.2/s Avg:  6370 Min:   770 Max: 14194 Err:
    0 (0.00%)
   [jmeter] summary =      5 in 00:00:33 =    0.2/s Avg:  6370 Min:   770 Max: 14194 Err:
    0 (0.00%)
   [jmeter] Tidying up ...    @ Tue Jan 08 00:31:02 PST 2019 (1546936262805)
   [jmeter] ... end of run
     [echo] SlowCharsFeature_HttpClient4 output files compared OK

batchtest:
     [echo] Starting SlowCharsFeature_Java with file SlowCharsFeature.jmx using -X -Jjmeter.httpsampler=Java
   [jmeter] SLF4J: Class path contains multiple SLF4J bindings.
   [jmeter] SLF4J: Found binding in [jar:file:/F:/jenkins/jenkins-slave/workspace/JMeter%20Windows/trunk/lib/log4j-slf4j-impl-2.11.1.jar!/org/slf4j/impl/StaticLoggerBinder.class]
   [jmeter] SLF4J: Found binding in [jar:file:/F:/jenkins/jenkins-slave/workspace/JMeter%20Windows/trunk/lib/opt/activemq-all-5.15.7.jar!/org/slf4j/impl/StaticLoggerBinder.class]
   [jmeter] SLF4J: See http://www.slf4j.org/codes.html#multiple_bindings for an explanation.
   [jmeter] SLF4J: Actual binding is of type [org.apache.logging.slf4j.Log4jLoggerFactory]
   [jmeter] Jan 08, 2019 12:31:06 AM java.util.prefs.WindowsPreferences <init>
   [jmeter] Creating summariser <summary>
   [jmeter] Created the tree successfully using testfiles/SlowCharsFeature.jmx
   [jmeter] WARNING: Could not open/create prefs root node Software\JavaSoft\Prefs at root
0x80000002. Windows RegCreateKeyEx(...) returned error code 5.
   [jmeter] Starting the test @ Tue Jan 08 00:31:06 PST 2019 (1546936266823)
   [jmeter] Waiting for possible Shutdown/StopTestNow/HeapDump/ThreadDump message on port
4445
   [jmeter] summary =      4 in 00:00:16 =    0.2/s Avg:  3893 Min:   714 Max:  5807 Err:
    1 (25.00%)
   [jmeter] Tidying up ...    @ Tue Jan 08 00:31:23 PST 2019 (1546936283983)
   [jmeter] ... end of run
Target 'batchtest' failed with message 'CSV Files are not identical.
        <https://builds.apache.org/job/JMeter%20Windows/ws/trunk\bin\testfiles\SlowCharsFeature_Java.csv>
        label,responseCode,responseMessage,threadName,dataType,success
JSS_setCPS,200,OK,setUp Thread Group 1-1,text,true
ApacheJMeter-HP-Secure,206,Partial Content,Thread Group 1-1,text,true
HTTPS-SNI-without-timeout,206,Partial Content,Thread Group 1-1,text,true
HTTPS-SNI-with-timeout,206,Partial Content,Thread Group 1-1,text,true

        <https://builds.apache.org/job/JMeter%20Windows/ws/trunk\bin\SlowCharsFeature_Java.csv>
        label,responseCode,responseMessage,threadName,dataType,success
JSS_setCPS,200,OK,setUp Thread Group 1-1,text,true
ApacheJMeter-HP-Secure,Non HTTP response code: java.net.SocketTimeoutException,Non HTTP response
message: connect timed out,Thread Group 1-1,text,false
HTTPS-SNI-without-timeout,206,Partial Content,Thread Group 1-1,text,true
HTTPS-SNI-with-timeout,206,Partial Content,Thread Group 1-1,text,true'.
Target 'batch_scripts' failed with message 'The following error occurred while executing this
line:
<https://builds.apache.org/job/JMeter%20Windows/ws/trunk\build.xml>:2788: CSV Files
are not identical.
        <https://builds.apache.org/job/JMeter%20Windows/ws/trunk\bin\testfiles\SlowCharsFeature_Java.csv>
        label,responseCode,responseMessage,threadName,dataType,success
JSS_setCPS,200,OK,setUp Thread Group 1-1,text,true
ApacheJMeter-HP-Secure,206,Partial Content,Thread Group 1-1,text,true
HTTPS-SNI-without-timeout,206,Partial Content,Thread Group 1-1,text,true
HTTPS-SNI-with-timeout,206,Partial Content,Thread Group 1-1,text,true

        <https://builds.apache.org/job/JMeter%20Windows/ws/trunk\bin\SlowCharsFeature_Java.csv>
        label,responseCode,responseMessage,threadName,dataType,success
JSS_setCPS,200,OK,setUp Thread Group 1-1,text,true
ApacheJMeter-HP-Secure,Non HTTP response code: java.net.SocketTimeoutException,Non HTTP response
message: connect timed out,Thread Group 1-1,text,false
HTTPS-SNI-without-timeout,206,Partial Content,Thread Group 1-1,text,true
HTTPS-SNI-with-timeout,206,Partial Content,Thread Group 1-1,text,true'.
Cannot execute '_allbatchtests' - 'batch_scripts' failed or was not executed.
Cannot execute 'test' - '_allbatchtests' failed or was not executed.

download_checkstyle:

_process_checkstyle_jars:

_check_exists:

_check_jarfile:
     [echo] Checking checkstyle-8.8-all.jar
     [echo] Deleting checkstyle-8.8-all.jar (excluding checkstyle-8.8-all.jar)

setproxy:

_get_jarfile:
     [echo] Fetching: lib/opt/checkstyle-8.8-all.jar
      [get] Getting: https://downloads.sourceforge.net/checkstyle/checkstyle/8.8/checkstyle-8.8-all.jar?ts=1546935693741&use_mirror=autoselect/checkstyle-8.8-all.jar
      [get] To: <https://builds.apache.org/job/JMeter%20Windows/ws/trunk\build\checkstyle-8.8-all.jar>
      [get] https://downloads.sourceforge.net/checkstyle/checkstyle/8.8/checkstyle-8.8-all.jar?ts=1546935693741&use_mirror=autoselect/checkstyle-8.8-all.jar
permanently moved to https://downloads.sourceforge.net/project/checkstyle/OldFiles/8.8/checkstyle-8.8-all.jar?use_mirror=autoselect%2Fcheckstyle-8.8-all.jar
      [get] https://downloads.sourceforge.net/project/checkstyle/OldFiles/8.8/checkstyle-8.8-all.jar?use_mirror=autoselect%2Fcheckstyle-8.8-all.jar
moved to https://master.dl.sourceforge.net/project/checkstyle/OldFiles/8.8/checkstyle-8.8-all.jar

_checkSHA512:
     [echo] Checksum OK: checkstyle-8.8-all.jar
     [move] Moving 1 file to <https://builds.apache.org/job/JMeter%20Windows/ws/trunk\lib\opt>
     [move] Attempting to rename: <https://builds.apache.org/job/JMeter%20Windows/ws/trunk\build\checkstyle-8.8-all.jar>
to <https://builds.apache.org/job/JMeter%20Windows/ws/trunk\lib\opt\checkstyle-8.8-all.jar>

setproxy:

_get_zipfile:

checkstyle:

_process_checkstyle_jars:

_check_exists:

_check_jarfile:
[checkstyle] Running Checkstyle 8.8 on 1741 files

BUILD FAILED
<https://builds.apache.org/job/JMeter%20Windows/ws/trunk\build.xml>:2976: The following
error occurred while executing this line:
<https://builds.apache.org/job/JMeter%20Windows/ws/trunk\build.xml>:2788: CSV Files
are not identical.
        <https://builds.apache.org/job/JMeter%20Windows/ws/trunk\bin\testfiles\SlowCharsFeature_Java.csv>
        label,responseCode,responseMessage,threadName,dataType,success
JSS_setCPS,200,OK,setUp Thread Group 1-1,text,true
ApacheJMeter-HP-Secure,206,Partial Content,Thread Group 1-1,text,true
HTTPS-SNI-without-timeout,206,Partial Content,Thread Group 1-1,text,true
HTTPS-SNI-with-timeout,206,Partial Content,Thread Group 1-1,text,true

        <https://builds.apache.org/job/JMeter%20Windows/ws/trunk\bin\SlowCharsFeature_Java.csv>
        label,responseCode,responseMessage,threadName,dataType,success
JSS_setCPS,200,OK,setUp Thread Group 1-1,text,true
ApacheJMeter-HP-Secure,Non HTTP response code: java.net.SocketTimeoutException,Non HTTP response
message: connect timed out,Thread Group 1-1,text,false
HTTPS-SNI-without-timeout,206,Partial Content,Thread Group 1-1,text,true
HTTPS-SNI-with-timeout,206,Partial Content,Thread Group 1-1,text,true

Total time: 10 minutes 8 seconds
Build step 'Invoke Ant' marked build as failure

Mime
View raw message