jmeter-dev mailing list archives

Site index · List index
Message view « Date » · « Thread »
Top « Date » · « Thread »
From Apache Jenkins Server <jenk...@builds.apache.org>
Subject Build failed in Jenkins: JMeter-trunk #7011
Date Tue, 01 Jan 2019 22:58:49 GMT
See <https://builds.apache.org/job/JMeter-trunk/7011/display/redirect>

------------------------------------------
[...truncated 249.59 KB...]
AU        docs/images/screenshots/dns-cache-manager.png
AU        docs/images/screenshots/ws_listener.png
AU        docs/images/screenshots/save_image.png
AU        docs/images/screenshots/modification.png
AU        docs/images/screenshots/regex_extractor.png
A         docs/images/screenshots/jms
AU        docs/images/screenshots/jms/jms_pub.png
AU        docs/images/screenshots/jms/jms_sub.png
AU        docs/images/screenshots/jms/JMS_Point-to-Point.png
AU        docs/images/screenshots/JMETER_4.0.png
AU        docs/images/screenshots/jmspublisher.png
AU        docs/images/screenshots/java_defaults.png
AU        docs/images/screenshots/example-running.png
AU        docs/images/screenshots/login-config.png
AU        docs/images/screenshots/regex_user_params.png
AU        docs/images/screenshots/comparison_assertion_visualizer.png
AU        docs/images/screenshots/example-remote-start.png
AU        docs/images/screenshots/counter.png
AU        docs/images/screenshots/xpath_extractor.png
AU        docs/images/screenshots/simpledatawriter.png
A         docs/images/jmeter_square.svg
AU        docs/images/asf-logo.svg
AU        docs/images/twitter.png
AU        docs/images/mstile-144x144.png
AU        docs/images/favicon.png
AU        docs/images/jmeter.png
AU        docs/images/jmeter_square.png
AU        docs/images/apple-touch-icon.png
AU        docs/images/asf-logo.png
AU        docs/images/logo.svg
A         docs/demos
AU        docs/demos/AssertionTestPlan.jmx
AU        docs/demos/forEachTestPlan.jmx
AU        docs/demos/ProxyServerTestPlan.jmx
AU        docs/demos/LoopTestPlan.jmx
AU        docs/demos/JDBC-Pre-Post-Processor.jmx
AU        docs/demos/RegEx-User-Parameters.jmx
AU        docs/demos/ForEachTest2.jmx
AU        docs/demos/InterleaveTestPlan2.jmx
AU        docs/demos/HeaderManagerTestPlan.jmx
AU        docs/demos/OnceOnlyTestPlan.jmx
AU        docs/demos/BeanShellAssertion.bsh
AU        docs/demos/SimpleTestPlan.jmx
AU        docs/demos/AuthManagerTestPlan.jmx
AU        docs/demos/InterleaveTestPlan.jmx
AU        docs/demos/URLRewritingExample.jmx
AU        docs/demos/JMSPointToPoint.jmx
AU        docs/mail2.html
AU        docs/index.html
AU        docs/changes.html
A         docs/usermanual
AU        docs/usermanual/properties_reference.html
AU        docs/usermanual/include_controller_tutorial.pdf
AU        docs/usermanual/build-web-test-plan.html
AU        docs/usermanual/component_reference.html
AU        docs/usermanual/ldapanswer_xml.html
AU        docs/usermanual/get-started.html
AU        docs/usermanual/build-adv-web-test-plan.html
AU        docs/usermanual/build-db-test-plan.html
AU        docs/usermanual/test_plan.html
AU        docs/usermanual/build-monitor-test-plan.html
AU        docs/usermanual/build-jms-point-to-point-test-plan.html
AU        docs/usermanual/build-ws-test-plan.html
AU        docs/usermanual/regular_expressions.html
AU        docs/usermanual/build-ldapext-test-plan.html
AU        docs/usermanual/glossary.html
AU        docs/usermanual/remote-test.html
AU        docs/usermanual/listeners.html
AU        docs/usermanual/functions.html
AU        docs/usermanual/best-practices.html
AU        docs/usermanual/generating-dashboard.html
AU        docs/usermanual/include_controller_tutorial.html
AU        docs/usermanual/jmeter_tutorial.html
AU        docs/usermanual/jmeter_distributed_testing_step_by_step.pdf
AU        docs/usermanual/jmeter_proxy_step_by_step.pdf
AU        docs/usermanual/jmeter_accesslog_sampler_step_by_step.html
AU        docs/usermanual/jmeter_accesslog_sampler_step_by_step.pdf
AU        docs/usermanual/build-ldap-test-plan.html
AU        docs/usermanual/history_future.html
AU        docs/usermanual/build-ftp-test-plan.html
AU        docs/usermanual/ldapops_tutor.html
AU        docs/usermanual/junitsampler_tutorial.html
AU        docs/usermanual/realtime-results.html
AU        docs/usermanual/build-test-plan.html
AU        docs/usermanual/junitsampler_tutorial.pdf
AU        docs/usermanual/jmeter_distributed_testing_step_by_step.html
AU        docs/usermanual/boss.html
AU        docs/usermanual/hints_and_tips.html
AU        docs/usermanual/jmeter_proxy_step_by_step.html
AU        docs/usermanual/index.html
AU        docs/usermanual/build-jms-topic-test-plan.html
AU        docs/download_jmeter.cgi
AU        docs/issues.html
AU        docs/download_jmeter.html
AU        docs/nightly.html
AU        docs/devguide-dashboard.html
A         docs/localising
AU        docs/localising/index.html
A         docs/extending
AU        docs/extending/jmeter_tutorial.pdf
AU        docs/mail.html
AU        docs/jmeter_irc.html
A         res
A         res/maven
AU        res/maven/ApacheJMeter_config.pom
AU        res/maven/ApacheJMeter_junit-test.pom
AU        res/maven/ApacheJMeter_functions.pom
AU        res/maven/ApacheJMeter_http.pom
AU        res/maven/ApacheJMeter.pom
AU        res/maven/ApacheJMeter_ldap.pom
AU        res/maven/ApacheJMeter_java.pom
AU        res/maven/ApacheJMeter_mail.pom
AU        res/maven/ApacheJMeter_components.pom
AU        res/maven/ApacheJMeter_mongodb.pom
AU        res/maven/ApacheJMeter_native.pom
AU        res/maven/ApacheJMeter_tcp.pom
AU        res/maven/ApacheJMeter_core.pom
AU        res/maven/jorphan.pom
AU        res/maven/ApacheJMeter_parent.pom
AU        res/maven/ApacheJMeter_ftp.pom
AU        res/maven/ApacheJMeter_jms.pom
AU        res/maven/ApacheJMeter_junit.pom
AU        res/maven/ApacheJMeter_jdbc.pom
A         res/META-INF
AU        res/META-INF/default.notice
AU        res/META-INF/default.license
AU        res/META-INF/jmeter_as_ascii_art.txt
AU        eclipse.project
AU        build.properties
AU        README.md
AU        checkstyle.xml
AU        build.xml
A         .codecov.yml
AU        fb-excludes.xml
 U        .
At revision 1850139

org.tmatesoft.svn.core.SVNException: svn: E130003: Parser configuration problem: namespace
reporting is not enabled
	at org.tmatesoft.svn.core.internal.wc.SVNErrorManager.error(SVNErrorManager.java:70)
	at org.tmatesoft.svn.core.internal.wc.SVNErrorManager.error(SVNErrorManager.java:57)
	at org.tmatesoft.svn.core.internal.io.dav.http.HTTPConnection.request(HTTPConnection.java:760)
	at org.tmatesoft.svn.core.internal.io.dav.http.HTTPConnection.request(HTTPConnection.java:352)
	at org.tmatesoft.svn.core.internal.io.dav.http.HTTPConnection.request(HTTPConnection.java:340)
	at org.tmatesoft.svn.core.internal.io.dav.DAVConnection.performHttpRequest(DAVConnection.java:910)
	at org.tmatesoft.svn.core.internal.io.dav.DAVConnection.doReport(DAVConnection.java:363)
	at org.tmatesoft.svn.core.internal.io.dav.DAVConnection.doReport(DAVConnection.java:353)
	at org.tmatesoft.svn.core.internal.io.dav.DAVRepository.logImpl(DAVRepository.java:1003)
	at org.tmatesoft.svn.core.io.SVNRepository.log(SVNRepository.java:1041)
	at org.tmatesoft.svn.core.internal.wc2.remote.SvnRemoteLog.run(SvnRemoteLog.java:181)
	at org.tmatesoft.svn.core.internal.wc2.remote.SvnRemoteLog.run(SvnRemoteLog.java:35)
	at org.tmatesoft.svn.core.internal.wc2.SvnOperationRunner.run(SvnOperationRunner.java:21)
	at org.tmatesoft.svn.core.wc2.SvnOperationFactory.run(SvnOperationFactory.java:1239)
	at org.tmatesoft.svn.core.wc2.SvnOperation.run(SvnOperation.java:294)
	at org.tmatesoft.svn.core.wc.SVNLogClient.doLog(SVNLogClient.java:968)
	at org.tmatesoft.svn.core.wc.SVNLogClient.doLog(SVNLogClient.java:873)
	at hudson.scm.SubversionChangeLogBuilder.buildModule(SubversionChangeLogBuilder.java:190)
Caused: hudson.util.IOException2: revision check failed on http://svn.apache.org/repos/asf/jmeter/trunk
	at hudson.scm.SubversionChangeLogBuilder.buildModule(SubversionChangeLogBuilder.java:204)
	at hudson.scm.SubversionChangeLogBuilder.run(SubversionChangeLogBuilder.java:124)
	at hudson.scm.SubversionSCM.calcChangeLog(SubversionSCM.java:757)
	at hudson.scm.SubversionSCM.checkout(SubversionSCM.java:898)
	at hudson.scm.SCM.checkout(SCM.java:504)
	at hudson.model.AbstractProject.checkout(AbstractProject.java:1208)
	at hudson.model.AbstractBuild$AbstractBuildExecution.defaultCheckout(AbstractBuild.java:574)
	at jenkins.scm.SCMCheckoutStrategy.checkout(SCMCheckoutStrategy.java:86)
	at hudson.model.AbstractBuild$AbstractBuildExecution.run(AbstractBuild.java:499)
	at hudson.model.Run.execute(Run.java:1810)
	at hudson.model.FreeStyleBuild.run(FreeStyleBuild.java:43)
	at hudson.model.ResourceController.execute(ResourceController.java:97)
	at hudson.model.Executor.run(Executor.java:429)
Retrying after 10 seconds
Reverting <https://builds.apache.org/job/JMeter-trunk/ws/trunk> to depth infinity with
ignoreExternals: false
Updating http://svn.apache.org/repos/asf/jmeter/trunk at revision '2019-01-01T22:57:24.223
+0000'
At revision 1850139

org.tmatesoft.svn.core.SVNException: svn: E130003: Parser configuration problem: namespace
reporting is not enabled
	at org.tmatesoft.svn.core.internal.wc.SVNErrorManager.error(SVNErrorManager.java:70)
	at org.tmatesoft.svn.core.internal.wc.SVNErrorManager.error(SVNErrorManager.java:57)
	at org.tmatesoft.svn.core.internal.io.dav.http.HTTPConnection.request(HTTPConnection.java:760)
	at org.tmatesoft.svn.core.internal.io.dav.http.HTTPConnection.request(HTTPConnection.java:352)
	at org.tmatesoft.svn.core.internal.io.dav.http.HTTPConnection.request(HTTPConnection.java:340)
	at org.tmatesoft.svn.core.internal.io.dav.DAVConnection.performHttpRequest(DAVConnection.java:910)
	at org.tmatesoft.svn.core.internal.io.dav.DAVConnection.doReport(DAVConnection.java:363)
	at org.tmatesoft.svn.core.internal.io.dav.DAVConnection.doReport(DAVConnection.java:353)
	at org.tmatesoft.svn.core.internal.io.dav.DAVRepository.logImpl(DAVRepository.java:1003)
	at org.tmatesoft.svn.core.io.SVNRepository.log(SVNRepository.java:1041)
	at org.tmatesoft.svn.core.internal.wc2.remote.SvnRemoteLog.run(SvnRemoteLog.java:181)
	at org.tmatesoft.svn.core.internal.wc2.remote.SvnRemoteLog.run(SvnRemoteLog.java:35)
	at org.tmatesoft.svn.core.internal.wc2.SvnOperationRunner.run(SvnOperationRunner.java:21)
	at org.tmatesoft.svn.core.wc2.SvnOperationFactory.run(SvnOperationFactory.java:1239)
	at org.tmatesoft.svn.core.wc2.SvnOperation.run(SvnOperation.java:294)
	at org.tmatesoft.svn.core.wc.SVNLogClient.doLog(SVNLogClient.java:968)
	at org.tmatesoft.svn.core.wc.SVNLogClient.doLog(SVNLogClient.java:873)
	at hudson.scm.SubversionChangeLogBuilder.buildModule(SubversionChangeLogBuilder.java:190)
Caused: hudson.util.IOException2: revision check failed on http://svn.apache.org/repos/asf/jmeter/trunk
	at hudson.scm.SubversionChangeLogBuilder.buildModule(SubversionChangeLogBuilder.java:204)
	at hudson.scm.SubversionChangeLogBuilder.run(SubversionChangeLogBuilder.java:124)
	at hudson.scm.SubversionSCM.calcChangeLog(SubversionSCM.java:757)
	at hudson.scm.SubversionSCM.checkout(SubversionSCM.java:898)
	at hudson.scm.SCM.checkout(SCM.java:504)
	at hudson.model.AbstractProject.checkout(AbstractProject.java:1208)
	at hudson.model.AbstractBuild$AbstractBuildExecution.defaultCheckout(AbstractBuild.java:574)
	at jenkins.scm.SCMCheckoutStrategy.checkout(SCMCheckoutStrategy.java:86)
	at hudson.model.AbstractBuild$AbstractBuildExecution.run(AbstractBuild.java:499)
	at hudson.model.Run.execute(Run.java:1810)
	at hudson.model.FreeStyleBuild.run(FreeStyleBuild.java:43)
	at hudson.model.ResourceController.execute(ResourceController.java:97)
	at hudson.model.Executor.run(Executor.java:429)
Retrying after 10 seconds
Reverting <https://builds.apache.org/job/JMeter-trunk/ws/trunk> to depth infinity with
ignoreExternals: false
Updating http://svn.apache.org/repos/asf/jmeter/trunk at revision '2019-01-01T22:57:24.223
+0000'
At revision 1850139

org.tmatesoft.svn.core.SVNException: svn: E130003: Parser configuration problem: namespace
reporting is not enabled
	at org.tmatesoft.svn.core.internal.wc.SVNErrorManager.error(SVNErrorManager.java:70)
	at org.tmatesoft.svn.core.internal.wc.SVNErrorManager.error(SVNErrorManager.java:57)
	at org.tmatesoft.svn.core.internal.io.dav.http.HTTPConnection.request(HTTPConnection.java:760)
	at org.tmatesoft.svn.core.internal.io.dav.http.HTTPConnection.request(HTTPConnection.java:352)
	at org.tmatesoft.svn.core.internal.io.dav.http.HTTPConnection.request(HTTPConnection.java:340)
	at org.tmatesoft.svn.core.internal.io.dav.DAVConnection.performHttpRequest(DAVConnection.java:910)
	at org.tmatesoft.svn.core.internal.io.dav.DAVConnection.doReport(DAVConnection.java:363)
	at org.tmatesoft.svn.core.internal.io.dav.DAVConnection.doReport(DAVConnection.java:353)
	at org.tmatesoft.svn.core.internal.io.dav.DAVRepository.logImpl(DAVRepository.java:1003)
	at org.tmatesoft.svn.core.io.SVNRepository.log(SVNRepository.java:1041)
	at org.tmatesoft.svn.core.internal.wc2.remote.SvnRemoteLog.run(SvnRemoteLog.java:181)
	at org.tmatesoft.svn.core.internal.wc2.remote.SvnRemoteLog.run(SvnRemoteLog.java:35)
	at org.tmatesoft.svn.core.internal.wc2.SvnOperationRunner.run(SvnOperationRunner.java:21)
	at org.tmatesoft.svn.core.wc2.SvnOperationFactory.run(SvnOperationFactory.java:1239)
	at org.tmatesoft.svn.core.wc2.SvnOperation.run(SvnOperation.java:294)
	at org.tmatesoft.svn.core.wc.SVNLogClient.doLog(SVNLogClient.java:968)
	at org.tmatesoft.svn.core.wc.SVNLogClient.doLog(SVNLogClient.java:873)
	at hudson.scm.SubversionChangeLogBuilder.buildModule(SubversionChangeLogBuilder.java:190)
Caused: hudson.util.IOException2: revision check failed on http://svn.apache.org/repos/asf/jmeter/trunk
	at hudson.scm.SubversionChangeLogBuilder.buildModule(SubversionChangeLogBuilder.java:204)
	at hudson.scm.SubversionChangeLogBuilder.run(SubversionChangeLogBuilder.java:124)
	at hudson.scm.SubversionSCM.calcChangeLog(SubversionSCM.java:757)
	at hudson.scm.SubversionSCM.checkout(SubversionSCM.java:898)
	at hudson.scm.SCM.checkout(SCM.java:504)
	at hudson.model.AbstractProject.checkout(AbstractProject.java:1208)
	at hudson.model.AbstractBuild$AbstractBuildExecution.defaultCheckout(AbstractBuild.java:574)
	at jenkins.scm.SCMCheckoutStrategy.checkout(SCMCheckoutStrategy.java:86)
	at hudson.model.AbstractBuild$AbstractBuildExecution.run(AbstractBuild.java:499)
	at hudson.model.Run.execute(Run.java:1810)
	at hudson.model.FreeStyleBuild.run(FreeStyleBuild.java:43)
	at hudson.model.ResourceController.execute(ResourceController.java:97)
	at hudson.model.Executor.run(Executor.java:429)
Archiving artifacts
Recording test results
ERROR: Step ‘Publish JUnit test result report’ failed: No test report files were found.
Configuration error?

Mime
View raw message