jmeter-dev mailing list archives

Site index · List index
Message view « Date » · « Thread »
Top « Date » · « Thread »
From Apache Jenkins Server <jenk...@builds.apache.org>
Subject Build failed in Jenkins: JMeter-trunk #7177
Date Wed, 15 May 2019 20:56:17 GMT
See <https://builds.apache.org/job/JMeter-trunk/7177/display/redirect>

------------------------------------------
[...truncated 480.96 KB...]
  [javadoc] Loading source files for package org.apache.jmeter.extractor.json.jsonpath.gui...
  [javadoc] Loading source files for package org.apache.jmeter.extractor.json.render...
  [javadoc] Loading source files for package org.apache.jmeter.modifiers...
  [javadoc] Loading source files for package org.apache.jmeter.modifiers.gui...
  [javadoc] Loading source files for package org.apache.jmeter.sampler...
  [javadoc] Loading source files for package org.apache.jmeter.sampler.gui...
  [javadoc] Loading source files for package org.apache.jmeter.thinktime...
  [javadoc] Loading source files for package org.apache.jmeter.timers.poissonarrivals...
  [javadoc] Loading source files for package org.apache.jmeter.validation...
  [javadoc] Loading source files for package org.apache.jmeter.visualizers.backend.graphite...
  [javadoc] Loading source files for package org.apache.jmeter.visualizers.backend.influxdb...
  [javadoc] Loading source files for package org.apache.jmeter.visualizers.utils...
  [javadoc] Loading source files for package org.apache.jmeter.protocol.http.api.auth...
  [javadoc] Loading source files for package org.apache.jmeter.protocol.http.config...
  [javadoc] Loading source files for package org.apache.jmeter.protocol.http.config.gui...
  [javadoc] Loading source files for package org.apache.jmeter.protocol.http.control...
  [javadoc] Loading source files for package org.apache.jmeter.protocol.http.control.gui...
  [javadoc] Loading source files for package org.apache.jmeter.protocol.http.curl...
  [javadoc] Loading source files for package org.apache.jmeter.protocol.http.gui...
  [javadoc] Loading source files for package org.apache.jmeter.protocol.http.gui.action...
  [javadoc] Loading source files for package org.apache.jmeter.protocol.http.modifier...
  [javadoc] Loading source files for package org.apache.jmeter.protocol.http.modifier.gui...
  [javadoc] Loading source files for package org.apache.jmeter.protocol.http.parser...
  [javadoc] Loading source files for package org.apache.jmeter.protocol.http.proxy...
  [javadoc] Loading source files for package org.apache.jmeter.protocol.http.proxy.gui...
  [javadoc] Loading source files for package org.apache.jmeter.protocol.http.sampler...
  [javadoc] Loading source files for package org.apache.jmeter.protocol.http.sampler.hc...
  [javadoc] Loading source files for package org.apache.jmeter.protocol.http.util...
  [javadoc] Loading source files for package org.apache.jmeter.protocol.http.util.accesslog...
  [javadoc] Loading source files for package org.apache.jmeter.protocol.http.visualizers...
  [javadoc] Loading source files for package org.apache.jmeter.protocol.ftp.config.gui...
  [javadoc] Loading source files for package org.apache.jmeter.protocol.ftp.control.gui...
  [javadoc] Loading source files for package org.apache.jmeter.protocol.ftp.sampler...
  [javadoc] Loading source files for package org.apache.jmeter.protocol.jdbc...
  [javadoc] Loading source files for package org.apache.jmeter.protocol.jdbc.config...
  [javadoc] Loading source files for package org.apache.jmeter.protocol.jdbc.processor...
  [javadoc] Loading source files for package org.apache.jmeter.protocol.jdbc.sampler...
  [javadoc] Loading source files for package org.apache.jmeter.protocol.java.config...
  [javadoc] Loading source files for package org.apache.jmeter.protocol.java.config.gui...
  [javadoc] Loading source files for package org.apache.jmeter.protocol.java.control.gui...
  [javadoc] Loading source files for package org.apache.jmeter.protocol.java.sampler...
  [javadoc] Loading source files for package org.apache.jmeter.protocol.java.test...
  [javadoc] Loading source files for package org.apache.jorphan.collections...
  [javadoc] Loading source files for package org.apache.jorphan.documentation...
  [javadoc] Loading source files for package org.apache.jorphan.exec...
  [javadoc] Loading source files for package org.apache.jorphan.gui...
  [javadoc] Loading source files for package org.apache.jorphan.gui.layout...
  [javadoc] Loading source files for package org.apache.jorphan.io...
  [javadoc] Loading source files for package org.apache.jorphan.logging...
  [javadoc] Loading source files for package org.apache.jorphan.math...
  [javadoc] Loading source files for package org.apache.jorphan.reflect...
  [javadoc] Loading source files for package org.apache.jorphan.test...
  [javadoc] Loading source files for package org.apache.jorphan.util...
  [javadoc] Loading source files for package org.apache.jmeter.protocol.ldap.config.gui...
  [javadoc] Loading source files for package org.apache.jmeter.protocol.ldap.control.gui...
  [javadoc] Loading source files for package org.apache.jmeter.protocol.ldap.sampler...
  [javadoc] Loading source files for package org.apache.jmeter.protocol.tcp.config.gui...
  [javadoc] Loading source files for package org.apache.jmeter.protocol.tcp.control.gui...
  [javadoc] Loading source files for package org.apache.jmeter.protocol.tcp.sampler...
  [javadoc] Loading source files for package org.apache.jmeter.examples.sampler...
  [javadoc] Loading source files for package org.apache.jmeter.examples.sampler.gui...
  [javadoc] Loading source files for package org.apache.jmeter.examples.testbeans.example1...
  [javadoc] Loading source files for package org.apache.jmeter.examples.testbeans.example2...
  [javadoc] Loading source files for package org.apache.jmeter.examples.testbeans.example3...
  [javadoc] Loading source files for package org.apache.jmeter.protocol.mail.sampler...
  [javadoc] Loading source files for package org.apache.jmeter.protocol.mail.sampler.gui...
  [javadoc] Loading source files for package org.apache.jmeter.protocol.smtp.sampler...
  [javadoc] Loading source files for package org.apache.jmeter.protocol.smtp.sampler.gui...
  [javadoc] Loading source files for package org.apache.jmeter.protocol.smtp.sampler.protocol...
  [javadoc] Loading source files for package org.apache.jmeter.protocol.jms...
  [javadoc] Loading source files for package org.apache.jmeter.protocol.jms.client...
  [javadoc] Loading source files for package org.apache.jmeter.protocol.jms.control.gui...
  [javadoc] Loading source files for package org.apache.jmeter.protocol.jms.sampler...
  [javadoc] Loading source files for package org.apache.jmeter.protocol.jms.sampler.render...
  [javadoc] Loading source files for package org.apache.jmeter.protocol.system...
  [javadoc] Loading source files for package org.apache.jmeter.protocol.system.gui...
  [javadoc] Loading source files for package org.apache.jmeter.protocol.mongodb.config...
  [javadoc] Loading source files for package org.apache.jmeter.protocol.mongodb.mongo...
  [javadoc] Loading source files for package org.apache.jmeter.protocol.mongodb.sampler...
  [javadoc] Constructing Javadoc information...
  [javadoc] Standard Doclet version 1.8.0_191
  [javadoc] Building tree for all the packages and classes...
  [javadoc] Building index for all the packages and classes...
  [javadoc] Building index for all classes...

compile-tests:
    [mkdir] Created dir: <https://builds.apache.org/job/JMeter-trunk/ws/trunk/build/test>
    [javac] Compiling 197 source files to <https://builds.apache.org/job/JMeter-trunk/ws/trunk/build/test>
    [javac] Note: Some input files use or override a deprecated API.
    [javac] Note: Recompile with -Xlint:deprecation for details.
  [groovyc] Compiling 30 source files to <https://builds.apache.org/job/JMeter-trunk/ws/trunk/build/test>
  [groovyc] <https://builds.apache.org/job/JMeter-trunk/ws/trunk/test/src/org/apache/jmeter/assertions/MD5HexAssertionSpec.groovy>
  [groovyc] <https://builds.apache.org/job/JMeter-trunk/ws/trunk/test/src/org/apache/jmeter/assertions/gui/AssertionGuiSpec.groovy>
  [groovyc] <https://builds.apache.org/job/JMeter-trunk/ws/trunk/test/src/org/apache/jmeter/control/RandomOrderControllerSpec.groovy>
  [groovyc] <https://builds.apache.org/job/JMeter-trunk/ws/trunk/test/src/org/apache/jmeter/control/RunTimeSpec.groovy>
  [groovyc] <https://builds.apache.org/job/JMeter-trunk/ws/trunk/test/src/org/apache/jmeter/control/ThroughputControllerSpec.groovy>
  [groovyc] <https://builds.apache.org/job/JMeter-trunk/ws/trunk/test/src/org/apache/jmeter/engine/util/PackageSpec.groovy>
  [groovyc] <https://builds.apache.org/job/JMeter-trunk/ws/trunk/test/src/org/apache/jmeter/extractor/BoundaryExtractorSpec.groovy>
  [groovyc] <https://builds.apache.org/job/JMeter-trunk/ws/trunk/test/src/org/apache/jmeter/extractor/JoddExtractorSpec.groovy>
  [groovyc] <https://builds.apache.org/job/JMeter-trunk/ws/trunk/test/src/org/apache/jmeter/extractor/json/render/RenderAsJsonRendererSpec.groovy>
  [groovyc] <https://builds.apache.org/job/JMeter-trunk/ws/trunk/test/src/org/apache/jmeter/functions/ChangeCaseSpec.groovy>
  [groovyc] <https://builds.apache.org/job/JMeter-trunk/ws/trunk/test/src/org/apache/jmeter/functions/gui/FunctionHelperSpec.groovy>
  [groovyc] <https://builds.apache.org/job/JMeter-trunk/ws/trunk/test/src/org/apache/jmeter/gui/HtmlReportGUISpec.groovy>
  [groovyc] <https://builds.apache.org/job/JMeter-trunk/ws/trunk/test/src/org/apache/jmeter/gui/action/HtmlReportGeneratorSpec.groovy>
  [groovyc] <https://builds.apache.org/job/JMeter-trunk/ws/trunk/test/src/org/apache/jmeter/gui/util/MenuFactorySpec.groovy>
  [groovyc] <https://builds.apache.org/job/JMeter-trunk/ws/trunk/test/src/org/apache/jmeter/junit/spock/JMeterSpec.groovy>
  [groovyc] <https://builds.apache.org/job/JMeter-trunk/ws/trunk/test/src/org/apache/jmeter/protocol/http/control/DNSCacheManagerSpec.groovy>
  [groovyc] <https://builds.apache.org/job/JMeter-trunk/ws/trunk/test/src/org/apache/jmeter/protocol/http/util/HTTPUtilsSpec.groovy>
  [groovyc] <https://builds.apache.org/job/JMeter-trunk/ws/trunk/test/src/org/apache/jmeter/protocol/jdbc/sampler/JDBCSamplerSpec.groovy>
  [groovyc] <https://builds.apache.org/job/JMeter-trunk/ws/trunk/test/src/org/apache/jmeter/report/core/SampleMetadataParserSpec.groovy>
  [groovyc] <https://builds.apache.org/job/JMeter-trunk/ws/trunk/test/src/org/apache/jmeter/report/dashboard/ReportGeneratorSpec.groovy>
  [groovyc] <https://builds.apache.org/job/JMeter-trunk/ws/trunk/test/src/org/apache/jmeter/report/processor/ApdexSummaryConsumerSpec.groovy>
  [groovyc] <https://builds.apache.org/job/JMeter-trunk/ws/trunk/test/src/org/apache/jmeter/report/processor/FieldSampleComparatorSpec.groovy>
  [groovyc] <https://builds.apache.org/job/JMeter-trunk/ws/trunk/test/src/org/apache/jmeter/report/processor/ListResultDataSpec.groovy>
  [groovyc] <https://builds.apache.org/job/JMeter-trunk/ws/trunk/test/src/org/apache/jmeter/report/processor/Top5ErrorsBySamplerConsumerSpec.groovy>
  [groovyc] <https://builds.apache.org/job/JMeter-trunk/ws/trunk/test/src/org/apache/jmeter/report/processor/Top5ErrorsSummaryDataSpec.groovy>
  [groovyc] <https://builds.apache.org/job/JMeter-trunk/ws/trunk/test/src/org/apache/jmeter/report/processor/graph/impl/ResponseTimePercentilesOverTimeGraphConsumerSpec.groovy>
  [groovyc] <https://builds.apache.org/job/JMeter-trunk/ws/trunk/test/src/org/apache/jmeter/services/FileServerSpec.groovy>
  [groovyc] <https://builds.apache.org/job/JMeter-trunk/ws/trunk/test/src/org/apache/jmeter/timers/UniformRandomTimerSpec.groovy>
  [groovyc] <https://builds.apache.org/job/JMeter-trunk/ws/trunk/test/src/org/apache/jorphan/io/TextFileSpec.groovy>
  [groovyc] <https://builds.apache.org/job/JMeter-trunk/ws/trunk/test/src/org/apache/jorphan/util/ConverterSpec.groovy>

_test:
     [echo] 
     [echo]    gump.run = false
     [echo]    java.awt.headless = true
     [echo]    test.headless = true
     [echo]    user.dir = <https://builds.apache.org/job/JMeter-trunk/ws/trunk>
     [echo]    basedir = <https://builds.apache.org/job/JMeter-trunk/ws/trunk>
     [echo]    test dir = build/test
     [echo]    test dir gump = build/test
     [echo]    testsaveservice.saveout = ${testsaveservice.saveout}
     [echo]    test.encoding = UTF-8
     [echo]     
     [java] SLF4J: Class path contains multiple SLF4J bindings.
     [java] SLF4J: Found binding in [jar:<https://builds.apache.org/job/JMeter-trunk/ws/trunk/lib/log4j-slf4j-impl-2.11.1.jar!/org/slf4j/impl/StaticLoggerBinder.class]>
     [java] SLF4J: Found binding in [jar:<https://builds.apache.org/job/JMeter-trunk/ws/trunk/lib/opt/activemq-all-5.15.8.jar!/org/slf4j/impl/StaticLoggerBinder.class]>
     [java] SLF4J: See http://www.slf4j.org/codes.html#multiple_bindings for an explanation.
     [java] SLF4J: Actual binding is of type [org.apache.logging.slf4j.Log4jLoggerFactory]
     [java] Setting JMeterHome: <https://builds.apache.org/job/JMeter-trunk/ws/trunk>
     [java] Using initializeProperties() from org.apache.jmeter.util.JMeterUtils
     [java] Setting up initial properties using: <https://builds.apache.org/job/JMeter-trunk/ws/trunk/bin/jmeter.properties>
     [java] Initializing Properties: <https://builds.apache.org/job/JMeter-trunk/ws/trunk/bin/jmeter.properties>
     [java] JMeterVersion=r1859307
     [java] java.version=1.8.0_191
     [java] java.home=/usr/local/asfpackages/java/jdk1.8.0_191/jre
     [java] file.encoding=UTF-8
     [java] default encoding=UTF-8
     [java] user.dir=<https://builds.apache.org/job/JMeter-trunk/ws/trunk/bin>
     [java] Locale=en_US
     [java] os.name=Linux
     [java] os.version=4.4.0-138-generic
     [java] JCE max key length = 2147483647
     [java] +++++++++++
     [java] java.awt.headless=true
     [java] java.awt.graphicsenv=sun.awt.X11GraphicsEnvironment
     [java] ------------
     [java] Searching junit tests in : build/test
     [java] o.a.j.junit.JMeterTest INFO: JMeterGUIComponent: skipping some tests org.apache.jmeter.testbeans.gui.TestBeanGUI
     [java] o.a.j.junit.JMeterTest Error creating org.apache.jmeter.SplashScreen java.awt.HeadlessException
     [java] o.a.j.junit.JMeterTest Error creating org.apache.jmeter.config.gui.RowDetailDialog
java.awt.HeadlessException
     [java] o.a.j.junit.JMeterTest Error creating org.apache.jmeter.functions.gui.FunctionHelper
java.awt.HeadlessException
     [java] o.a.j.junit.JMeterTest WARN: java.io.Serializable: NoSuchMethodException  org.apache.jmeter.gui.GlobalUndoableEdit,
missing empty Constructor or Constructor with Object parameter
     [java] o.a.j.junit.JMeterTest Error creating org.apache.jmeter.gui.MainFrame java.awt.HeadlessException
     [java] o.a.j.junit.JMeterTest Error creating org.apache.jmeter.gui.SavePropertyDialog
java.awt.HeadlessException
     [java] o.a.j.junit.JMeterTest Error creating org.apache.jmeter.gui.action.SearchTreeDialog
java.awt.HeadlessException
     [java] o.a.j.junit.JMeterTest Error creating org.apache.jmeter.gui.action.SelectTemplatesDialog
java.awt.HeadlessException
     [java] o.a.j.junit.JMeterTest Error creating org.apache.jmeter.gui.util.EscapeDialog
java.awt.HeadlessException
     [java] o.a.j.junit.JMeterTest Error creating org.apache.jmeter.gui.util.JSyntaxTextArea
java.awt.HeadlessException
     [java] o.a.j.junit.JMeterTest Error creating org.apache.jmeter.protocol.http.proxy.gui.RecorderDialog
java.awt.HeadlessException
     [java] o.a.j.junit.JMeterTest WARN: java.io.Serializable: NoSuchMethodException  org.apache.jmeter.rmi.RMIServerSocketFactoryImpl,
missing empty Constructor or Constructor with Object parameter
     [java] o.a.j.junit.JMeterTest WARN: java.io.Serializable: NoSuchMethodException  org.apache.jmeter.rmi.SSLRMIServerSocketFactory,
missing empty Constructor or Constructor with Object parameter
     [java] java.rmi.server.hostname=null
     [java] asf926.gq1.ygridcore.net/67.195.81.162
     [java] isSiteLocalAddress:false
     [java] isAnyLocalAddress:false
     [java] isLinkLocalAddress:false
     [java] isLoopbackAddress:false
     [java] isMulticastAddress:false
     [java] localhost/127.0.0.1
     [java] isSiteLocalAddress:false
     [java] isAnyLocalAddress:false
     [java] isLinkLocalAddress:false
     [java] isLoopbackAddress:true
     [java] isMulticastAddress:false
     [java] ====================
     [java] asf926.gq1.ygridcore.net/67.195.81.162
     [java] isSiteLocalAddress:false
     [java] isAnyLocalAddress:false
     [java] isLinkLocalAddress:false
     [java] isLoopbackAddress:false
     [java] isMulticastAddress:false
     [java] Interfaces: {name:veth832eb37 (veth832eb37) => [/fe80:0:0:0:9c12:a2ff:fe38:29df%veth832eb37/64
[null]], name:docker0 (docker0) => [/fe80:0:0:0:42:5dff:fe81:6372%docker0/64 [null], /172.17.0.1/16
[/0.0.0.0]], name:eno1 (eno1) => [/fe80:0:0:0:92b1:1cff:fe38:6ea1%eno1/64 [null], /67.195.81.162/26
[/67.195.81.191]], name:lo (lo) => [/0:0:0:0:0:0:0:1%lo/128 [null], /127.0.0.1/8 [null]]}
     [java] java.rmi.server.hostname=null
     [java] ..............................................................................................................................................................I.........................................................Throwing
on Engine creation to simulate failure
     [java] Throwing on Engine creation to simulate failure
     [java] .........................................................................................................................................................I.I........................................................................................................................................................................................................................................................................E............................................II..................................................................................................................................................................................................................................................................................................................................................................................................................................................................................................................................................................................................................................................................................................................................................................................................................................................................................................................................................................................................................................................................................................................................................................................................................................................................................................................................................................................................................................................................................................................................................................................................................................................................................................................................................................................................................................................Ignoring
missing junit_failure_default_code=0001 in org/apache/jmeter/resources/messages_fr.properties
     [java] Ignoring missing aggregate_report_90=90% in org/apache/jmeter/resources/messages_fr.properties
     [java] Ignoring missing junit_error_default_code=9999 in org/apache/jmeter/resources/messages_fr.properties
     [java] Ignoring missing junit_success_default_code=1000 in org/apache/jmeter/resources/messages_fr.properties
     [java] ..........................................................................................................................................................................................................................................................................................................................................................................................................................................................................................................................................................................................................................................................................................................................................................................................II................................................................................................................
     [java] Time: 39.095
     [java] There was 1 failure:
     [java] 1) testWriteToFile(org.apache.jmeter.functions.TestStringtoFile)
     [java] java.lang.AssertionError: This method 'Stringtofile' should have successfully
run
     [java] 	at org.junit.Assert.fail(Assert.java:88)
     [java] 	at org.junit.Assert.assertTrue(Assert.java:41)
     [java] 	at org.apache.jmeter.functions.TestStringtoFile.testWriteToFile(TestStringtoFile.java:76)
     [java] 	at sun.reflect.NativeMethodAccessorImpl.invoke0(Native Method)
     [java] 	at sun.reflect.NativeMethodAccessorImpl.invoke(NativeMethodAccessorImpl.java:62)
     [java] 	at sun.reflect.DelegatingMethodAccessorImpl.invoke(DelegatingMethodAccessorImpl.java:43)
     [java] 	at java.lang.reflect.Method.invoke(Method.java:498)
     [java] 	at org.junit.runners.model.FrameworkMethod$1.runReflectiveCall(FrameworkMethod.java:50)
     [java] 	at org.junit.internal.runners.model.ReflectiveCallable.run(ReflectiveCallable.java:12)
     [java] 	at org.junit.runners.model.FrameworkMethod.invokeExplosively(FrameworkMethod.java:47)
     [java] 	at org.junit.internal.runners.statements.InvokeMethod.evaluate(InvokeMethod.java:17)
     [java] 	at org.junit.internal.runners.statements.RunBefores.evaluate(RunBefores.java:26)
     [java] 	at org.junit.rules.ExternalResource$1.evaluate(ExternalResource.java:48)
     [java] 	at org.junit.rules.RunRules.evaluate(RunRules.java:20)
     [java] 	at org.junit.runners.ParentRunner.runLeaf(ParentRunner.java:325)
     [java] 	at org.junit.runners.BlockJUnit4ClassRunner.runChild(BlockJUnit4ClassRunner.java:78)
     [java] 	at org.junit.runners.BlockJUnit4ClassRunner.runChild(BlockJUnit4ClassRunner.java:57)
     [java] 	at org.junit.runners.ParentRunner$3.run(ParentRunner.java:290)
     [java] 	at java.util.concurrent.Executors$RunnableAdapter.call(Executors.java:511)
     [java] 	at java.util.concurrent.FutureTask.run(FutureTask.java:266)
     [java] 	at java.util.concurrent.ThreadPoolExecutor.runWorker(ThreadPoolExecutor.java:1149)
     [java] 	at java.util.concurrent.ThreadPoolExecutor$Worker.run(ThreadPoolExecutor.java:624)
     [java] 	at java.lang.Thread.run(Thread.java:748)
     [java] 
     [java] FAILURES!!!
     [java] Tests run: 3329,  Failures: 1
     [java] 
     [java] ......................................................................................
     [java] Time: 20.394
     [java] 
     [java] OK (86 tests)
     [java] 

BUILD FAILED
<https://builds.apache.org/job/JMeter-trunk/ws/trunk/build.xml>:3192: Java returned:
1

Total time: 3 minutes 12 seconds
Build step 'Invoke Ant' marked build as failure
WARN: Unable to locate 'report-task.txt' in the workspace. Did the SonarScanner succedeed?
[locks-and-latches] Releasing all the locks
[locks-and-latches] All the locks released
Archiving artifacts
Recording test results
ERROR: Step ?Publish JUnit test result report? failed: No test report files were found. Configuration
error?

Mime
View raw message