jmeter-dev mailing list archives

Site index · List index
Message view « Date » · « Thread »
Top « Date » · « Thread »
From Apache Jenkins Server <jenk...@builds.apache.org>
Subject Build failed in Jenkins: JMeter-trunk #7176
Date Wed, 15 May 2019 19:21:25 GMT
See <https://builds.apache.org/job/JMeter-trunk/7176/display/redirect?page=changes>

Changes:

[pmouawad] Remove test from coverage report

------------------------------------------
[...truncated 424.84 KB...]
     [echo] Fetching: lib/xmlpull-1.1.3.1.jar
      [get] Getting: https://repo1.maven.org/maven2/xmlpull/xmlpull/1.1.3.1/xmlpull-1.1.3.1.jar
      [get] To: <https://builds.apache.org/job/JMeter-trunk/ws/trunk/build/xmlpull-1.1.3.1.jar>

_checkSHA512:
     [echo] Checksum OK: xmlpull-1.1.3.1.jar
     [move] Moving 1 file to <https://builds.apache.org/job/JMeter-trunk/ws/trunk/lib>
     [move] Attempting to rename: <https://builds.apache.org/job/JMeter-trunk/ws/trunk/build/xmlpull-1.1.3.1.jar>
to <https://builds.apache.org/job/JMeter-trunk/ws/trunk/lib/xmlpull-1.1.3.1.jar>

setproxy:

_get_zipfile:

_check_exists:

_check_jarfile:
     [echo] Checking xpp3_min-1.1.4c.jar
     [echo] Deleting xpp3_min-1.1.4c.jar (excluding xpp3_min-1.1.4c.jar)

setproxy:

_get_jarfile:
     [echo] Fetching: lib/xpp3_min-1.1.4c.jar
      [get] Getting: https://repo1.maven.org/maven2/xpp3/xpp3_min/1.1.4c/xpp3_min-1.1.4c.jar
      [get] To: <https://builds.apache.org/job/JMeter-trunk/ws/trunk/build/xpp3_min-1.1.4c.jar>

_checkSHA512:
     [echo] Checksum OK: xpp3_min-1.1.4c.jar
     [move] Moving 1 file to <https://builds.apache.org/job/JMeter-trunk/ws/trunk/lib>
     [move] Attempting to rename: <https://builds.apache.org/job/JMeter-trunk/ws/trunk/build/xpp3_min-1.1.4c.jar>
to <https://builds.apache.org/job/JMeter-trunk/ws/trunk/lib/xpp3_min-1.1.4c.jar>

setproxy:

_get_zipfile:

_check_exists:

_check_jarfile:
     [echo] Checking xstream-1.4.11.jar
     [echo] Deleting xstream-* (excluding xstream-1.4.11.jar)

setproxy:

_get_jarfile:
     [echo] Fetching: lib/xstream-1.4.11.jar
      [get] Getting: https://repo1.maven.org/maven2/com/thoughtworks/xstream/xstream/1.4.11/xstream-1.4.11.jar
      [get] To: <https://builds.apache.org/job/JMeter-trunk/ws/trunk/build/xstream-1.4.11.jar>

_checkSHA512:
     [echo] Checksum OK: xstream-1.4.11.jar
     [move] Moving 1 file to <https://builds.apache.org/job/JMeter-trunk/ws/trunk/lib>
     [move] Attempting to rename: <https://builds.apache.org/job/JMeter-trunk/ws/trunk/build/xstream-1.4.11.jar>
to <https://builds.apache.org/job/JMeter-trunk/ws/trunk/lib/xstream-1.4.11.jar>

setproxy:

_get_zipfile:

_check_exists:

_check_jarfile:
     [echo] Checking hsqldb-2.4.1.jar
     [echo] Deleting hsqldb-* (excluding hsqldb-2.4.1.jar)

setproxy:

_get_jarfile:
     [echo] Fetching: <https://builds.apache.org/job/JMeter-trunk/ws/trunk/lib/opt/hsqldb-2.4.1.jar>
      [get] Getting: https://repo1.maven.org/maven2/org/hsqldb/hsqldb/2.4.1/hsqldb-2.4.1.jar
      [get] To: <https://builds.apache.org/job/JMeter-trunk/ws/trunk/build/hsqldb-2.4.1.jar>

_checkSHA512:
     [echo] Checksum OK: hsqldb-2.4.1.jar
     [move] Moving 1 file to <https://builds.apache.org/job/JMeter-trunk/ws/trunk/lib/opt>
     [move] Attempting to rename: <https://builds.apache.org/job/JMeter-trunk/ws/trunk/build/hsqldb-2.4.1.jar>
to <https://builds.apache.org/job/JMeter-trunk/ws/trunk/lib/opt/hsqldb-2.4.1.jar>

setproxy:

_get_zipfile:

_check_exists:

_check_jarfile:
     [echo] Checking activemq-all-5.15.8.jar
     [echo] Deleting activemq-all-* (excluding activemq-all-5.15.8.jar)

setproxy:

_get_jarfile:
     [echo] Fetching: <https://builds.apache.org/job/JMeter-trunk/ws/trunk/lib/opt/activemq-all-5.15.8.jar>
      [get] Getting: https://repo1.maven.org/maven2/org/apache/activemq/activemq-all/5.15.8/activemq-all-5.15.8.jar
      [get] To: <https://builds.apache.org/job/JMeter-trunk/ws/trunk/build/activemq-all-5.15.8.jar>

_checkSHA512:
     [echo] Checksum OK: activemq-all-5.15.8.jar
     [move] Moving 1 file to <https://builds.apache.org/job/JMeter-trunk/ws/trunk/lib/opt>
     [move] Attempting to rename: <https://builds.apache.org/job/JMeter-trunk/ws/trunk/build/activemq-all-5.15.8.jar>
to <https://builds.apache.org/job/JMeter-trunk/ws/trunk/lib/opt/activemq-all-5.15.8.jar>

setproxy:

_get_zipfile:

_check_exists:

_check_jarfile:
     [echo] Checking mina-core-2.0.19.jar
     [echo] Deleting mina-core-* (excluding mina-core-2.0.19.jar)

setproxy:

_get_jarfile:
     [echo] Fetching: <https://builds.apache.org/job/JMeter-trunk/ws/trunk/lib/opt/mina-core-2.0.19.jar>
      [get] Getting: https://repo1.maven.org/maven2/org/apache/mina/mina-core/2.0.19/mina-core-2.0.19.jar
      [get] To: <https://builds.apache.org/job/JMeter-trunk/ws/trunk/build/mina-core-2.0.19.jar>

_checkSHA512:
     [echo] Checksum OK: mina-core-2.0.19.jar
     [move] Moving 1 file to <https://builds.apache.org/job/JMeter-trunk/ws/trunk/lib/opt>
     [move] Attempting to rename: <https://builds.apache.org/job/JMeter-trunk/ws/trunk/build/mina-core-2.0.19.jar>
to <https://builds.apache.org/job/JMeter-trunk/ws/trunk/lib/opt/mina-core-2.0.19.jar>

setproxy:

_get_zipfile:

_check_exists:

_check_jarfile:
     [echo] Checking ftplet-api-1.1.1.jar
     [echo] Deleting ftplet-api-* (excluding ftplet-api-1.1.1.jar)

setproxy:

_get_jarfile:
     [echo] Fetching: <https://builds.apache.org/job/JMeter-trunk/ws/trunk/lib/opt/ftplet-api-1.1.1.jar>
      [get] Getting: https://repo1.maven.org/maven2/org/apache/ftpserver/ftplet-api/1.1.1/ftplet-api-1.1.1.jar
      [get] To: <https://builds.apache.org/job/JMeter-trunk/ws/trunk/build/ftplet-api-1.1.1.jar>

_checkSHA512:
     [echo] Checksum OK: ftplet-api-1.1.1.jar
     [move] Moving 1 file to <https://builds.apache.org/job/JMeter-trunk/ws/trunk/lib/opt>
     [move] Attempting to rename: <https://builds.apache.org/job/JMeter-trunk/ws/trunk/build/ftplet-api-1.1.1.jar>
to <https://builds.apache.org/job/JMeter-trunk/ws/trunk/lib/opt/ftplet-api-1.1.1.jar>

setproxy:

_get_zipfile:

_check_exists:

_check_jarfile:
     [echo] Checking ftpserver-core-1.1.1.jar
     [echo] Deleting ftpserver-core-* (excluding ftpserver-core-1.1.1.jar)

setproxy:

_get_jarfile:
     [echo] Fetching: <https://builds.apache.org/job/JMeter-trunk/ws/trunk/lib/opt/ftpserver-core-1.1.1.jar>
      [get] Getting: https://repo1.maven.org/maven2/org/apache/ftpserver/ftpserver-core/1.1.1/ftpserver-core-1.1.1.jar
      [get] To: <https://builds.apache.org/job/JMeter-trunk/ws/trunk/build/ftpserver-core-1.1.1.jar>

_checkSHA512:
     [echo] Checksum OK: ftpserver-core-1.1.1.jar
     [move] Moving 1 file to <https://builds.apache.org/job/JMeter-trunk/ws/trunk/lib/opt>
     [move] Attempting to rename: <https://builds.apache.org/job/JMeter-trunk/ws/trunk/build/ftpserver-core-1.1.1.jar>
to <https://builds.apache.org/job/JMeter-trunk/ws/trunk/lib/opt/ftpserver-core-1.1.1.jar>

setproxy:

_get_zipfile:

_check_exists:

_check_jarfile:
     [echo] Checking org.jacoco.ant-0.8.3-nodeps.jar
     [echo] Deleting org.jacoco.ant-0.8.3-nodeps.jar (excluding org.jacoco.ant-0.8.3-nodeps.jar)

setproxy:

_get_jarfile:
     [echo] Fetching: <https://builds.apache.org/job/JMeter-trunk/ws/trunk/lib/opt/org.jacoco.ant-0.8.3-nodeps.jar>
      [get] Getting: https://repo1.maven.org/maven2/org/jacoco/org.jacoco.ant/0.8.3/org.jacoco.ant-0.8.3-nodeps.jar
      [get] To: <https://builds.apache.org/job/JMeter-trunk/ws/trunk/build/org.jacoco.ant-0.8.3-nodeps.jar>

_checkSHA512:
     [echo] Checksum OK: org.jacoco.ant-0.8.3-nodeps.jar
     [move] Moving 1 file to <https://builds.apache.org/job/JMeter-trunk/ws/trunk/lib/opt>
     [move] Attempting to rename: <https://builds.apache.org/job/JMeter-trunk/ws/trunk/build/org.jacoco.ant-0.8.3-nodeps.jar>
to <https://builds.apache.org/job/JMeter-trunk/ws/trunk/lib/opt/org.jacoco.ant-0.8.3-nodeps.jar>

setproxy:

_get_zipfile:

_check_exists:

_check_jarfile:
     [echo] Checking sonarqube-ant-task-2.5.jar
     [echo] Deleting sonarqube-ant-task-2.5.jar (excluding sonarqube-ant-task-2.5.jar)

setproxy:

_get_jarfile:
     [echo] Fetching: <https://builds.apache.org/job/JMeter-trunk/ws/trunk/lib/opt/sonarqube-ant-task-2.5.jar>
      [get] Getting: https://repo1.maven.org/maven2/org/sonarsource/scanner/ant/sonarqube-ant-task/2.5/sonarqube-ant-task-2.5.jar
      [get] To: <https://builds.apache.org/job/JMeter-trunk/ws/trunk/build/sonarqube-ant-task-2.5.jar>

_checkSHA512:
     [echo] Checksum OK: sonarqube-ant-task-2.5.jar
     [move] Moving 1 file to <https://builds.apache.org/job/JMeter-trunk/ws/trunk/lib/opt>
     [move] Attempting to rename: <https://builds.apache.org/job/JMeter-trunk/ws/trunk/build/sonarqube-ant-task-2.5.jar>
to <https://builds.apache.org/job/JMeter-trunk/ws/trunk/lib/opt/sonarqube-ant-task-2.5.jar>

setproxy:

_get_zipfile:

download_checkstyle:

_process_checkstyle_jars:

_check_exists:

_check_jarfile:
     [echo] Checking checkstyle-8.8-all.jar
     [echo] Deleting checkstyle-8.8-all.jar (excluding checkstyle-8.8-all.jar)

setproxy:

_get_jarfile:
     [echo] Fetching: lib/opt/checkstyle-8.8-all.jar
      [get] Getting: https://downloads.sourceforge.net/checkstyle/checkstyle/8.8/checkstyle-8.8-all.jar?ts=1557948063428&use_mirror=autoselect/checkstyle-8.8-all.jar
      [get] To: <https://builds.apache.org/job/JMeter-trunk/ws/trunk/build/checkstyle-8.8-all.jar>
      [get] https://downloads.sourceforge.net/checkstyle/checkstyle/8.8/checkstyle-8.8-all.jar?ts=1557948063428&use_mirror=autoselect/checkstyle-8.8-all.jar
permanently moved to https://downloads.sourceforge.net/project/checkstyle/OldFiles/8.8/checkstyle-8.8-all.jar?use_mirror=autoselect%2Fcheckstyle-8.8-all.jar
      [get] https://downloads.sourceforge.net/project/checkstyle/OldFiles/8.8/checkstyle-8.8-all.jar?use_mirror=autoselect%2Fcheckstyle-8.8-all.jar
moved to https://master.dl.sourceforge.net/project/checkstyle/OldFiles/8.8/checkstyle-8.8-all.jar
      [get] Error opening connection java.io.IOException: Server returned HTTP response code:
503 for URL: https://master.dl.sourceforge.net/project/checkstyle/OldFiles/8.8/checkstyle-8.8-all.jar
      [get] Error opening connection java.io.IOException: Server returned HTTP response code:
503 for URL: https://master.dl.sourceforge.net/project/checkstyle/OldFiles/8.8/checkstyle-8.8-all.jar
      [get] Error opening connection java.io.IOException: Server returned HTTP response code:
503 for URL: https://master.dl.sourceforge.net/project/checkstyle/OldFiles/8.8/checkstyle-8.8-all.jar
      [get] Can't get https://downloads.sourceforge.net/checkstyle/checkstyle/8.8/checkstyle-8.8-all.jar?ts=1557948063428&use_mirror=autoselect/checkstyle-8.8-all.jar
to <https://builds.apache.org/job/JMeter-trunk/ws/trunk/build/checkstyle-8.8-all.jar>

BUILD FAILED
<https://builds.apache.org/job/JMeter-trunk/ws/trunk/build.xml>:3610: The following
error occurred while executing this line:
<https://builds.apache.org/job/JMeter-trunk/ws/trunk/build.xml>:3551: The following
error occurred while executing this line:
<https://builds.apache.org/job/JMeter-trunk/ws/trunk/build.xml>:3350: The following
error occurred while executing this line:
<https://builds.apache.org/job/JMeter-trunk/ws/trunk/build.xml>:3394: The following
error occurred while executing this line:
<https://builds.apache.org/job/JMeter-trunk/ws/trunk/build.xml>:3424: Can't get https://downloads.sourceforge.net/checkstyle/checkstyle/8.8/checkstyle-8.8-all.jar?ts=1557948063428&use_mirror=autoselect/checkstyle-8.8-all.jar
to <https://builds.apache.org/job/JMeter-trunk/ws/trunk/build/checkstyle-8.8-all.jar>

Total time: 21 seconds
Build step 'Invoke Ant' marked build as failure
WARN: Unable to locate 'report-task.txt' in the workspace. Did the SonarScanner succedeed?
[locks-and-latches] Releasing all the locks
[locks-and-latches] All the locks released
Archiving artifacts
Recording test results
ERROR: Step ?Publish JUnit test result report? failed: No test report files were found. Configuration
error?

Mime
View raw message