jmeter-dev mailing list archives

Site index · List index
Message view « Date » · « Thread »
Top « Date » · « Thread »
From Apache Jenkins Server <jenk...@builds.apache.org>
Subject Build failed in Jenkins: JMeter-trunk #7201
Date Mon, 27 May 2019 10:01:02 GMT
See <https://builds.apache.org/job/JMeter-trunk/7201/display/redirect?page=changes>

Changes:

[vladimirsitnikov] Use assumeTrue in testTimerBSH so it is properly marked as skipped in case
it is skipped

[vladimirsitnikov] Enforce Locale.US for tests that verify numeric processing (e.g. 0.42)

[vladimirsitnikov] Add gitattributes, normalize line endings

------------------------------------------
[...truncated 164.99 KB...]
  [groovyc] <https://builds.apache.org/job/JMeter-trunk/ws/trunk/test/src/org/apache/jmeter/report/processor/Top5ErrorsBySamplerConsumerSpec.groovy>
  [groovyc] <https://builds.apache.org/job/JMeter-trunk/ws/trunk/test/src/org/apache/jmeter/report/processor/Top5ErrorsSummaryDataSpec.groovy>
  [groovyc] <https://builds.apache.org/job/JMeter-trunk/ws/trunk/test/src/org/apache/jmeter/report/processor/graph/impl/ResponseTimePercentilesOverTimeGraphConsumerSpec.groovy>
  [groovyc] <https://builds.apache.org/job/JMeter-trunk/ws/trunk/test/src/org/apache/jmeter/services/FileServerSpec.groovy>
  [groovyc] <https://builds.apache.org/job/JMeter-trunk/ws/trunk/test/src/org/apache/jmeter/timers/UniformRandomTimerSpec.groovy>
  [groovyc] <https://builds.apache.org/job/JMeter-trunk/ws/trunk/test/src/org/apache/jorphan/io/TextFileSpec.groovy>
  [groovyc] <https://builds.apache.org/job/JMeter-trunk/ws/trunk/test/src/org/apache/jorphan/util/ConverterSpec.groovy>

_test:
     [echo] 
     [echo]    gump.run = false
     [echo]    java.awt.headless = true
     [echo]    test.headless = true
     [echo]    user.dir = <https://builds.apache.org/job/JMeter-trunk/ws/trunk>
     [echo]    basedir = <https://builds.apache.org/job/JMeter-trunk/ws/trunk>
     [echo]    test dir = build/test
     [echo]    test dir gump = build/test
     [echo]    testsaveservice.saveout = ${testsaveservice.saveout}
     [echo]    test.encoding = UTF-8
     [echo]     
     [java] SLF4J: Class path contains multiple SLF4J bindings.
     [java] SLF4J: Found binding in [jar:<https://builds.apache.org/job/JMeter-trunk/ws/trunk/lib/log4j-slf4j-impl-2.11.1.jar!/org/slf4j/impl/StaticLoggerBinder.class]>
     [java] SLF4J: Found binding in [jar:<https://builds.apache.org/job/JMeter-trunk/ws/trunk/lib/opt/activemq-all-5.15.8.jar!/org/slf4j/impl/StaticLoggerBinder.class]>
     [java] SLF4J: See http://www.slf4j.org/codes.html#multiple_bindings for an explanation.
     [java] SLF4J: Actual binding is of type [org.apache.logging.slf4j.Log4jLoggerFactory]
     [java] Setting JMeterHome: <https://builds.apache.org/job/JMeter-trunk/ws/trunk>
     [java] Using initializeProperties() from org.apache.jmeter.util.JMeterUtils
     [java] Setting up initial properties using: <https://builds.apache.org/job/JMeter-trunk/ws/trunk/bin/jmeter.properties>
     [java] Initializing Properties: <https://builds.apache.org/job/JMeter-trunk/ws/trunk/bin/jmeter.properties>
     [java] JMeterVersion=r1860117
     [java] java.version=1.8.0_191
     [java] java.home=/usr/local/asfpackages/java/jdk1.8.0_191/jre
     [java] file.encoding=UTF-8
     [java] default encoding=UTF-8
     [java] user.dir=<https://builds.apache.org/job/JMeter-trunk/ws/trunk/bin>
     [java] Locale=en_US
     [java] os.name=Linux
     [java] os.version=4.4.0-138-generic
     [java] JCE max key length = 2147483647
     [java] +++++++++++
     [java] java.awt.headless=true
     [java] java.awt.graphicsenv=sun.awt.X11GraphicsEnvironment
     [java] ------------
     [java] Searching junit tests in : build/test
     [java] o.a.j.junit.JMeterTest INFO: JMeterGUIComponent: skipping some tests org.apache.jmeter.testbeans.gui.TestBeanGUI
     [java] o.a.j.junit.JMeterTest Error creating org.apache.jmeter.SplashScreen java.awt.HeadlessException
     [java] o.a.j.junit.JMeterTest Error creating org.apache.jmeter.config.gui.RowDetailDialog
java.awt.HeadlessException
     [java] o.a.j.junit.JMeterTest Error creating org.apache.jmeter.functions.gui.FunctionHelper
java.awt.HeadlessException
     [java] o.a.j.junit.JMeterTest WARN: java.io.Serializable: NoSuchMethodException  org.apache.jmeter.gui.GlobalUndoableEdit,
missing empty Constructor or Constructor with Object parameter
     [java] o.a.j.junit.JMeterTest Error creating org.apache.jmeter.gui.MainFrame java.awt.HeadlessException
     [java] o.a.j.junit.JMeterTest Error creating org.apache.jmeter.gui.SavePropertyDialog
java.awt.HeadlessException
     [java] o.a.j.junit.JMeterTest Error creating org.apache.jmeter.gui.action.SearchTreeDialog
java.awt.HeadlessException
     [java] o.a.j.junit.JMeterTest Error creating org.apache.jmeter.gui.action.SelectTemplatesDialog
java.awt.HeadlessException
     [java] o.a.j.junit.JMeterTest Error creating org.apache.jmeter.gui.util.EscapeDialog
java.awt.HeadlessException
     [java] o.a.j.junit.JMeterTest Error creating org.apache.jmeter.gui.util.JSyntaxTextArea
java.awt.HeadlessException
     [java] o.a.j.junit.JMeterTest Error creating org.apache.jmeter.protocol.http.proxy.gui.RecorderDialog
java.awt.HeadlessException
     [java] o.a.j.junit.JMeterTest WARN: java.io.Serializable: NoSuchMethodException  org.apache.jmeter.rmi.RMIServerSocketFactoryImpl,
missing empty Constructor or Constructor with Object parameter
     [java] o.a.j.junit.JMeterTest WARN: java.io.Serializable: NoSuchMethodException  org.apache.jmeter.rmi.SSLRMIServerSocketFactory,
missing empty Constructor or Constructor with Object parameter
     [java] ............................................................................................................................................................I...........................................................Throwing
on Engine creation to simulate failure
     [java] java.rmi.server.hostname=null
     [java] asf935.gq1.ygridcore.net/67.195.81.176
     [java] isSiteLocalAddress:false
     [java] isAnyLocalAddress:false
     [java] isLinkLocalAddress:false
     [java] isLoopbackAddress:false
     [java] isMulticastAddress:false
     [java] localhost/127.0.0.1
     [java] isSiteLocalAddress:false
     [java] isAnyLocalAddress:false
     [java] isLinkLocalAddress:false
     [java] isLoopbackAddress:true
     [java] isMulticastAddress:false
     [java] ====================
     [java] asf935.gq1.ygridcore.net/67.195.81.176
     [java] isSiteLocalAddress:false
     [java] isAnyLocalAddress:false
     [java] isLinkLocalAddress:false
     [java] isLoopbackAddress:false
     [java] isMulticastAddress:false
     [java] Interfaces: {name:docker0 (docker0) => [/fe80:0:0:0:42:35ff:fe42:a701%docker0/64
[null], /172.17.0.1/16 [/0.0.0.0]], name:enp5s0f0 (enp5s0f0) => [/fe80:0:0:0:28c:faff:fe5b:3bc4%enp5s0f0/64
[null], /67.195.81.176/26 [/67.195.81.191]], name:lo (lo) => [/0:0:0:0:0:0:0:1%lo/128 [null],
/127.0.0.1/8 [null]]}
     [java] Choose 172.17.0.1 to talk to external services
     [java] java.rmi.server.hostname=null
     [java] .........................................................................................................................................................I.I........................................................................................................................................................................................................................................................................E............................................II..................................................................................................................................................................................................................................................................................................................................................................................................................................................................................................................................................................................................................................................................................................................................................................................................................................................................................................................................................................................................................................................................................................................................................................................................................................................................................................................................................................................................................................................................................................................................................................................................................................................................................................................................................................................................................................................Ignoring
missing junit_failure_default_code=0001 in org/apache/jmeter/resources/messages_fr.properties
     [java] Ignoring missing aggregate_report_90=90% in org/apache/jmeter/resources/messages_fr.properties
     [java] Ignoring missing junit_error_default_code=9999 in org/apache/jmeter/resources/messages_fr.properties
     [java] Ignoring missing junit_success_default_code=1000 in org/apache/jmeter/resources/messages_fr.properties
     [java] ........................................................................................................................................................................................................................................................................................................................................................................................................................................................................................................................................................................................................................................................................................................................................................................................I.I.................................................................................................................
     [java] Time: 45.645
     [java] There was 1 failure:
     [java] 1) testWriteToFile(org.apache.jmeter.functions.TestStringtoFile)
     [java] java.lang.AssertionError: This method 'Stringtofile' should have successfully
run
     [java] 	at org.junit.Assert.fail(Assert.java:88)
     [java] 	at org.junit.Assert.assertTrue(Assert.java:41)
     [java] 	at org.apache.jmeter.functions.TestStringtoFile.testWriteToFile(TestStringtoFile.java:76)
     [java] 	at sun.reflect.NativeMethodAccessorImpl.invoke0(Native Method)
     [java] 	at sun.reflect.NativeMethodAccessorImpl.invoke(NativeMethodAccessorImpl.java:62)
     [java] 	at sun.reflect.DelegatingMethodAccessorImpl.invoke(DelegatingMethodAccessorImpl.java:43)
     [java] 	at java.lang.reflect.Method.invoke(Method.java:498)
     [java] 	at org.junit.runners.model.FrameworkMethod$1.runReflectiveCall(FrameworkMethod.java:50)
     [java] 	at org.junit.internal.runners.model.ReflectiveCallable.run(ReflectiveCallable.java:12)
     [java] 	at org.junit.runners.model.FrameworkMethod.invokeExplosively(FrameworkMethod.java:47)
     [java] 	at org.junit.internal.runners.statements.InvokeMethod.evaluate(InvokeMethod.java:17)
     [java] 	at org.junit.internal.runners.statements.RunBefores.evaluate(RunBefores.java:26)
     [java] 	at org.junit.rules.ExternalResource$1.evaluate(ExternalResource.java:48)
     [java] 	at org.junit.rules.RunRules.evaluate(RunRules.java:20)
     [java] 	at org.junit.runners.ParentRunner.runLeaf(ParentRunner.java:325)
     [java] 	at org.junit.runners.BlockJUnit4ClassRunner.runChild(BlockJUnit4ClassRunner.java:78)
     [java] 	at org.junit.runners.BlockJUnit4ClassRunner.runChild(BlockJUnit4ClassRunner.java:57)
     [java] 	at org.junit.runners.ParentRunner$3.run(ParentRunner.java:290)
     [java] 	at java.util.concurrent.Executors$RunnableAdapter.call(Executors.java:511)
     [java] 	at java.util.concurrent.FutureTask.run(FutureTask.java:266)
     [java] 	at java.util.concurrent.ThreadPoolExecutor.runWorker(ThreadPoolExecutor.java:1149)
     [java] 	at java.util.concurrent.ThreadPoolExecutor$Worker.run(ThreadPoolExecutor.java:624)
     [java] 	at java.lang.Thread.run(Thread.java:748)
     [java] 
     [java] FAILURES!!!
     [java] Tests run: 3329,  Failures: 1
     [java] 
     [java] ..Creating summariser <summary>
     [java] Created the tree successfully using /tmp/testPlan8140784458487667075.jmx
     [java] Starting the test @ Mon May 27 10:00:47 UTC 2019 (1558951247186)
     [java] Waiting for possible Shutdown/StopTestNow/HeapDump/ThreadDump message on port
4445
     [java] .summary =      0 in 00:00:00 = ******/s Avg:     0 Min: 9223372036854775807 Max:
-9223372036854775808 Err:     0 (0.00%)
     [java] Tidying up ...    @ Mon May 27 10:00:47 UTC 2019 (1558951247850)
     [java] Error in NonGUIDriver java.lang.IllegalArgumentException: Problem loading XML
from:'/tmp/testPlan8792975658388573098.jmx'. 
     [java] Cause:
     [java] CannotResolveClassException: kg.apc.jmeter.samplers.DummySampler
     [java] 
     [java]  Detail:com.thoughtworks.xstream.converters.ConversionException: 
     [java] ---- Debugging information ----
     [java] cause-exception     : com.thoughtworks.xstream.converters.ConversionException
     [java] cause-message       : 
     [java] first-jmeter-class  : org.apache.jmeter.save.converters.HashTreeConverter.unmarshal(HashTreeConverter.java:67)
     [java] class               : org.apache.jmeter.save.ScriptWrapper
     [java] required-type       : org.apache.jmeter.save.ScriptWrapper
     [java] converter-type      : org.apache.jmeter.save.ScriptWrapperConverter
     [java] path                : /jmeterTestPlan/hashTree/hashTree/hashTree/kg.apc.jmeter.samplers.DummySampler
     [java] line number         : 16
     [java] version             : not available
     [java] -------------------------------
     [java] ... end of run
     [java] .............................................................The JVM should have
exited but did not.
     [java] The following non-daemon threads are still running (DestroyJavaVM is OK):
     [java] Thread[AWT-Shutdown,5,system], stackTrace:java.lang.Object#wait
     [java] sun.awt.AWTAutoShutdown#run at line:314
     [java] java.lang.Thread#run at line:748
     [java] 
     [java] Thread[AWT-EventQueue-0,6,main], stackTrace:sun.misc.Unsafe#park
     [java] java.util.concurrent.locks.LockSupport#park at line:175
     [java] java.util.concurrent.locks.AbstractQueuedSynchronizer$ConditionObject#await at
line:2039
     [java] java.awt.EventQueue#getNextEvent at line:554
     [java] java.awt.EventDispatchThread#pumpOneEventForFilters at line:187
     [java] java.awt.EventDispatchThread#pumpEventsForFilter at line:116
     [java] java.awt.EventDispatchThread#pumpEventsForHierarchy at line:105
     [java] java.awt.EventDispatchThread#pumpEvents at line:101
     [java] java.awt.EventDispatchThread#pumpEvents at line:93
     [java] java.awt.EventDispatchThread#run at line:82
     [java] 
     [java] Thread[ThreadGroup-1,5,main], stackTrace:java.net.SocketInputStream#socketRead0
     [java] java.net.SocketInputStream#socketRead at line:116
     [java] java.net.SocketInputStream#read at line:171
     [java] java.net.SocketInputStream#read at line:141
     [java] sun.security.ssl.InputRecord#readFully at line:465
     [java] sun.security.ssl.InputRecord#read at line:503
     [java] sun.security.ssl.SSLSocketImpl#readRecord at line:975
     [java] sun.security.ssl.SSLSocketImpl#readDataRecord at line:933
     [java] sun.security.ssl.AppInputStream#read at line:105
     [java] org.apache.http.impl.io.SessionInputBufferImpl#streamRead at line:137
     [java] org.apache.http.impl.io.SessionInputBufferImpl#fillBuffer at line:153
     [java] org.apache.http.impl.io.SessionInputBufferImpl#readLine at line:280
     [java] org.apache.http.impl.conn.DefaultHttpResponseParser#parseHead at line:138
     [java] org.apache.http.impl.conn.DefaultHttpResponseParser#parseHead at line:56
     [java] org.apache.http.impl.io.AbstractMessageParser#parse at line:259
     [java] org.apache.http.impl.DefaultBHttpClientConnection#receiveResponseHeader at line:163
     [java] org.apache.http.impl.conn.CPoolProxy#receiveResponseHeader at line:157
     [java] org.apache.http.protocol.HttpRequestExecutor#doReceiveResponse at line:273
     [java] org.apache.http.protocol.HttpRequestExecutor#execute at line:125
     [java] org.apache.http.impl.execchain.MainClientExec#execute at line:272
     [java] org.apache.http.impl.execchain.ProtocolExec#execute at line:186
     [java] org.apache.http.impl.execchain.RetryExec#execute at line:89
     [java] org.apache.http.impl.execchain.RedirectExec#execute at line:110
     [java] org.apache.http.impl.client.InternalHttpClient#doExecute at line:185
     [java] org.apache.http.impl.client.CloseableHttpClient#execute at line:83
     [java] org.apache.jmeter.protocol.http.sampler.HTTPHC4Impl#executeRequest at line:876
     [java] org.apache.jmeter.protocol.http.sampler.HTTPHC4Impl#sample at line:582
     [java] org.apache.jmeter.protocol.http.sampler.HTTPSamplerProxy#sample at line:67
     [java] org.apache.jmeter.protocol.http.sampler.HTTPSamplerBase#downloadPageResources
at line:1366
     [java] org.apache.jmeter.protocol.http.sampler.HTTPSamplerBase#resultProcessing at line:1693
     [java] org.apache.jmeter.protocol.http.sampler.HTTPAbstractImpl#resultProcessing at line:556
     [java] org.apache.jmeter.protocol.http.sampler.HTTPHC4Impl#sample at line:669
     [java] org.apache.jmeter.protocol.http.sampler.HTTPSamplerProxy#sample at line:67
     [java] org.apache.jmeter.protocol.http.sampler.HTTPSamplerBase#sample at line:1231
     [java] org.apache.jmeter.protocol.http.sampler.SamplingNamingTest#doSample at line:87
     [java] org.apache.jmeter.protocol.http.sampler.SamplingNamingTest#testBug63364 at line:54
     [java] sun.reflect.NativeMethodAccessorImpl#invoke0
     [java] sun.reflect.NativeMethodAccessorImpl#invoke at line:62
     [java] sun.reflect.DelegatingMethodAccessorImpl#invoke at line:43
     [java] java.lang.reflect.Method#invoke at line:498
     [java] org.junit.runners.model.FrameworkMethod$1#runReflectiveCall at line:50
     [java] org.junit.internal.runners.model.ReflectiveCallable#run at line:12
     [java] org.junit.runners.model.FrameworkMethod#invokeExplosively at line:47
     [java] org.junit.internal.runners.statements.InvokeMethod#evaluate at line:17
     [java] org.junit.runners.ParentRunner#runLeaf at line:325
     [java] org.junit.runners.BlockJUnit4ClassRunner#runChild at line:78
     [java] org.junit.runners.BlockJUnit4ClassRunner#runChild at line:57
     [java] org.junit.runners.ParentRunner$3#run at line:290
     [java] org.junit.runners.ParentRunner$1#schedule at line:71
     [java] org.junit.runners.ParentRunner#runChildren at line:288
     [java] org.junit.runners.ParentRunner#access$000 at line:58
     [java] org.junit.runners.ParentRunner$2#evaluate at line:268
     [java] org.junit.runners.ParentRunner#run at line:363
     [java] org.junit.runners.Suite#runChild at line:128
     [java] org.junit.runners.Suite#runChild at line:27
     [java] org.junit.runners.ParentRunner$3#run at line:290
     [java] org.junit.runners.ParentRunner$1#schedule at line:71
     [java] org.junit.runners.ParentRunner#runChildren at line:288
     [java] org.junit.runners.ParentRunner#access$000 at line:58
     [java] org.junit.runners.ParentRunner$2#evaluate at line:268
     [java] org.junit.runners.ParentRunner#run at line:363
     [java] org.junit.runners.Suite#runChild at line:128
     [java] org.junit.runners.Suite#runChild at line:27
     [java] org.junit.runners.ParentRunner$3#run at line:290
     [java] org.junit.runners.ParentRunner$1#schedule at line:71
     [java] org.junit.runners.ParentRunner#runChildren at line:288
     [java] org.junit.runners.ParentRunner#access$000 at line:58
     [java] org.junit.runners.ParentRunner$2#evaluate at line:268
     [java] org.junit.runners.ParentRunner#run at line:363
     [java] org.junit.runner.JUnitCore#run at line:137
     [java] org.junit.runner.JUnitCore#run at line:115
     [java] org.apache.jorphan.test.AllTests#main at line:220
     [java] 
     [java] .........................
     [java] Time: 12.472
     [java] 
     [java] OK (89 tests)
     [java] 

BUILD FAILED
<https://builds.apache.org/job/JMeter-trunk/ws/trunk/build.xml>:3192: Java returned:
1

Total time: 3 minutes 29 seconds
Build step 'Invoke Ant' marked build as failure
[locks-and-latches] Releasing all the locks
[locks-and-latches] All the locks released
Archiving artifacts
Recording test results
ERROR: Step ?Publish JUnit test result report? failed: Test reports were found but none of
them are new. Did leafNodes run? 
For example, <https://builds.apache.org/job/JMeter-trunk/ws/trunk/reports/TEST-org.apache.commons.cli.avalon.ClutilTestCase.xml>
is 16 hr old


Mime
View raw message