jmeter-dev mailing list archives

Site index · List index
Message view « Date » · « Thread »
Top « Date » · « Thread »
From Apache Jenkins Server <jenk...@builds.apache.org>
Subject Build failed in Jenkins: JMeter Windows #1425
Date Fri, 02 Aug 2019 20:58:54 GMT
See <https://builds.apache.org/job/JMeter%20Windows/1425/display/redirect>

------------------------------------------
[...truncated 57.58 KB...]
> Task :src:protocol:jms:spotbugsMain SKIPPED
> Task :src:protocol:native:checkstyleMain
> Task :src:protocol:native:spotbugsMain SKIPPED
> Task :src:protocol:mongodb:checkstyleMain
> Task :src:protocol:mongodb:spotbugsMain SKIPPED
> Task :src:protocol:tcp:checkstyleMain
> Task :src:protocol:tcp:spotbugsMain SKIPPED
> Task :src:protocol:ldap:checkstyleMain
> Task :src:protocol:ldap:spotbugsMain SKIPPED
> Task :src:protocol:mail:checkstyleMain
> Task :src:protocol:mail:spotbugsMain SKIPPED
> Task :src:core:compileTestGroovy
> Task :src:core:testClasses
> Task :src:core:testJar
> Task :src:protocol:java:compileTestJava
> Task :src:protocol:java:testClasses
> Task :src:protocol:ldap:compileTestJava
> Task :src:protocol:ldap:testClasses
> Task :src:protocol:junit:compileTestJava
> Task :src:protocol:junit:testClasses
> Task :src:protocol:jdbc:compileTestJava
> Task :src:protocol:ftp:compileTestJava
> Task :src:protocol:ftp:testClasses
> Task :src:protocol:java:testJar
> Task :src:protocol:jms:compileTestJava
> Task :src:protocol:jms:testClasses
> Task :src:protocol:ftp:testJar
> Task :src:protocol:junit:testJar
> Task :src:protocol:ldap:testJar

> Task :src:components:compileJava
Note: Some input files use or override a deprecated API.
Note: Recompile with -Xlint:deprecation for details.
Note: Some input files use unchecked or unsafe operations.
Note: Recompile with -Xlint:unchecked for details.

> Task :src:protocol:jms:testJar
> Task :src:protocol:ftp:checkstyleTest
> Task :src:protocol:ftp:spotbugsTest SKIPPED
> Task :src:protocol:jdbc:compileTestGroovy
> Task :src:protocol:jdbc:testClasses
> Task :src:protocol:mail:compileTestJava
> Task :src:protocol:mail:testClasses
> Task :src:protocol:native:compileTestJava
> Task :src:protocol:native:testClasses
> Task :src:protocol:mongodb:compileTestJava
> Task :src:protocol:mongodb:testClasses
> Task :src:protocol:tcp:compileTestJava
> Task :src:protocol:tcp:testClasses
> Task :src:protocol:native:testJar
> Task :src:protocol:mongodb:testJar
> Task :src:protocol:mail:testJar
> Task :src:protocol:tcp:testJar
> Task :src:protocol:jdbc:testJar
> Task :src:protocol:junit-sample:compileTestJava NO-SOURCE
> Task :src:protocol:junit-sample:testClasses UP-TO-DATE
> Task :src:protocol:junit-sample:checkstyleTest NO-SOURCE
> Task :src:protocol:junit-sample:spotbugsTest SKIPPED
> Task :src:protocol:junit-sample:test NO-SOURCE
> Task :src:protocol:junit-sample:check
> Task :src:protocol:java:checkstyleTest
> Task :src:protocol:java:spotbugsTest SKIPPED
> Task :src:protocol:jdbc:checkstyleTest
> Task :src:protocol:jdbc:spotbugsTest SKIPPED
> Task :src:protocol:jms:checkstyleTest
> Task :src:protocol:jms:spotbugsTest SKIPPED
> Task :src:protocol:junit:checkstyleTest
> Task :src:protocol:junit:spotbugsTest SKIPPED
> Task :src:protocol:ldap:checkstyleTest
> Task :src:protocol:ldap:spotbugsTest SKIPPED
> Task :src:core:checkstyleMain
> Task :src:core:checkstyleTest
> Task :src:core:spotbugsMain SKIPPED
> Task :src:core:spotbugsTest SKIPPED
> Task :src:protocol:junit:test
> Task :src:protocol:junit:check
> Task :src:protocol:java:test
> Task :src:protocol:java:check
> Task :src:protocol:ftp:test
> Task :src:protocol:ftp:check
> Task :src:protocol:native:checkstyleTest
> Task :src:protocol:native:spotbugsTest SKIPPED
> Task :src:protocol:mongodb:checkstyleTest
> Task :src:protocol:mongodb:spotbugsTest SKIPPED
> Task :src:protocol:mail:checkstyleTest
> Task :src:protocol:mail:spotbugsTest SKIPPED
> Task :src:components:compileGroovy NO-SOURCE
> Task :src:components:classes
> Task :src:protocol:ldap:test
> Task :src:protocol:native:test
> Task :src:protocol:jms:test
> Task :src:protocol:mongodb:test
> Task :src:protocol:jdbc:test
> Task :src:protocol:jdbc:check
> Task :src:protocol:jms:check
> Task :src:protocol:ldap:check
> Task :src:protocol:mongodb:check
> Task :src:protocol:native:check
> Task :src:protocol:tcp:checkstyleTest
> Task :src:protocol:tcp:spotbugsTest SKIPPED
> Task :src:protocol:mail:test
> Task :src:protocol:mail:check

> Task :src:core:test

org.apache.jmeter.JMeterTest > testSuccessWhenJmxExists FAILED
    org.apache.jorphan.util.JMeterError: JMeter requires the checksum of saveservice properties
file to continue
        at org.apache.jmeter.save.SaveService.initProps(SaveService.java:223)
        at org.apache.jmeter.save.SaveService.<clinit>(SaveService.java:165)
        at org.apache.jmeter.JMeter.runNonGui(JMeter.java:1005)
        at org.apache.jmeter.JMeterTest.testSuccessWhenJmxExists(JMeterTest.java:70)

        Caused by:
        java.nio.file.NoSuchFileException: saveservice.properties
            at sun.nio.fs.WindowsException.translateToIOException(WindowsException.java:79)
            at sun.nio.fs.WindowsException.rethrowAsIOException(WindowsException.java:97)
            at sun.nio.fs.WindowsException.rethrowAsIOException(WindowsException.java:102)
            at sun.nio.fs.WindowsFileSystemProvider.newByteChannel(WindowsFileSystemProvider.java:230)
            at java.nio.file.Files.newByteChannel(Files.java:361)
            at java.nio.file.Files.newByteChannel(Files.java:407)
            at java.nio.file.spi.FileSystemProvider.newInputStream(FileSystemProvider.java:384)
            at java.nio.file.Files.newInputStream(Files.java:152)
            at java.nio.file.Files.newBufferedReader(Files.java:2784)
            at org.apache.jmeter.save.SaveService.getChecksumForPropertiesFile(SaveService.java:209)
            at org.apache.jmeter.save.SaveService.initProps(SaveService.java:220)
            ... 3 more

org.apache.jmeter.JMeterTest > testFailureWithMissingPlugin FAILED
    java.lang.NoClassDefFoundError: Could not initialize class org.apache.jmeter.save.SaveService
        at org.apache.jmeter.JMeter.runNonGui(JMeter.java:1005)
        at org.apache.jmeter.JMeterTest.testFailureWithMissingPlugin(JMeterTest.java:112)

org.apache.jmeter.report.core.CsvSampleReaderTest > testReadSample FAILED
    java.lang.NoClassDefFoundError: Could not initialize class org.apache.jmeter.save.SaveService
        at org.apache.jmeter.report.core.AbstractSampleWriter.<clinit>(AbstractSampleWriter.java:52)
        at org.apache.jmeter.report.core.CsvSampleReaderTest.setUp(CsvSampleReaderTest.java:42)

org.apache.jmeter.report.core.CsvSampleReaderTest > testClose FAILED
    java.lang.NoClassDefFoundError: Could not initialize class org.apache.jmeter.report.core.CsvSampleWriter
        at org.apache.jmeter.report.core.CsvSampleReaderTest.setUp(CsvSampleReaderTest.java:42)

org.apache.jmeter.report.core.CsvSampleReaderTest > testPeek FAILED
    java.lang.NoClassDefFoundError: Could not initialize class org.apache.jmeter.report.core.CsvSampleWriter
        at org.apache.jmeter.report.core.CsvSampleReaderTest.setUp(CsvSampleReaderTest.java:42)

org.apache.jmeter.report.core.CsvSampleReaderTest > testConstructorWithInvalidFile FAILED
    java.lang.NoClassDefFoundError: Could not initialize class org.apache.jmeter.report.core.CsvSampleWriter
        at org.apache.jmeter.report.core.CsvSampleReaderTest.setUp(CsvSampleReaderTest.java:42)

org.apache.jmeter.report.core.CsvSampleReaderTest > testGetMetadata FAILED
    java.lang.NoClassDefFoundError: Could not initialize class org.apache.jmeter.report.core.CsvSampleWriter
        at org.apache.jmeter.report.core.CsvSampleReaderTest.setUp(CsvSampleReaderTest.java:42)

org.apache.jmeter.report.core.CsvSampleReaderTest > testHasNextAndReadSample FAILED
    java.lang.NoClassDefFoundError: Could not initialize class org.apache.jmeter.report.core.CsvSampleWriter
        at org.apache.jmeter.report.core.CsvSampleReaderTest.setUp(CsvSampleReaderTest.java:42)

org.apache.jmeter.report.core.TestCsvSampleWriter > testWriteWithoutWriter FAILED
    java.lang.RuntimeException: Could not read JMeter properties file:null/jmeter.properties
        at org.apache.jmeter.util.JMeterUtils.loadJMeterProperties(JMeterUtils.java:211)
        at org.apache.jmeter.report.core.TestCsvSampleWriter.setUp(TestCsvSampleWriter.java:39)

org.apache.jmeter.report.core.TestCsvSampleWriter > testCsvSampleWriterConstructorWithWriter
FAILED
    java.lang.RuntimeException: Could not read JMeter properties file:null/jmeter.properties
        at org.apache.jmeter.util.JMeterUtils.loadJMeterProperties(JMeterUtils.java:211)
        at org.apache.jmeter.report.core.TestCsvSampleWriter.setUp(TestCsvSampleWriter.java:39)

org.apache.jmeter.report.core.TestCsvSampleWriter > testWrite FAILED
    java.lang.RuntimeException: Could not read JMeter properties file:null/jmeter.properties
        at org.apache.jmeter.util.JMeterUtils.loadJMeterProperties(JMeterUtils.java:211)
        at org.apache.jmeter.report.core.TestCsvSampleWriter.setUp(TestCsvSampleWriter.java:39)

org.apache.jmeter.report.core.TestCsvSampleWriter > testCsvSampleWriterConstructorWithNull
FAILED
    java.lang.RuntimeException: Could not read JMeter properties file:null/jmeter.properties
        at org.apache.jmeter.util.JMeterUtils.loadJMeterProperties(JMeterUtils.java:211)
        at org.apache.jmeter.report.core.TestCsvSampleWriter.setUp(TestCsvSampleWriter.java:39)

org.apache.jmeter.report.core.TestCsvSampleWriter > testWriteWithoutSample FAILED
    java.lang.RuntimeException: Could not read JMeter properties file:null/jmeter.properties
        at org.apache.jmeter.util.JMeterUtils.loadJMeterProperties(JMeterUtils.java:211)
        at org.apache.jmeter.report.core.TestCsvSampleWriter.setUp(TestCsvSampleWriter.java:39)

> Task :src:components:checkstyleMain
> Task :src:generator:compileJava
> Task :src:generator:classes
> Task :src:generator:jar
> Task :src:generator:checkstyleMain
> Task :src:generator:compileTestJava NO-SOURCE
> Task :src:generator:testClasses UP-TO-DATE
> Task :src:generator:checkstyleTest NO-SOURCE
> Task :src:examples:compileJava
> Task :src:examples:classes
> Task :src:examples:checkstyleMain
> Task :src:examples:compileTestJava NO-SOURCE
> Task :src:examples:testClasses UP-TO-DATE
> Task :src:examples:checkstyleTest NO-SOURCE
> Task :src:protocol:tcp:test
> Task :src:protocol:tcp:check

> Task :src:functions:compileJava
Note: F:\jenkins\jenkins-slave\workspace\JMeter Windows\src\functions\src\main\java\org\apache\jmeter\functions\StringFromFile.java
uses or overrides a deprecated API.
Note: Recompile with -Xlint:deprecation for details.

> Task :src:components:compileTestJava
> Task :src:functions:compileGroovy NO-SOURCE
> Task :src:functions:classes
> Task :src:functions:jar
> Task :src:functions:checkstyleMain
> Task :src:components:compileTestGroovy
> Task :src:components:testClasses
> Task :src:components:checkstyleTest
> Task :src:components:spotbugsMain SKIPPED
> Task :src:components:spotbugsTest SKIPPED

> Task :src:core:test

251 tests completed, 13 failed

> Task :src:core:test FAILED

> Task :src:protocol:http:compileJava
Note: Some input files use or override a deprecated API.
Note: Recompile with -Xlint:deprecation for details.
Note: F:\jenkins\jenkins-slave\workspace\JMeter Windows\src\protocol\http\src\main\java\org\apache\jmeter\protocol\http\sampler\HTTPHC4Impl.java
uses unchecked or unsafe operations.
Note: Recompile with -Xlint:unchecked for details.

> Task :src:components:test
Checksum computation time: 1634, files processed: 162, bytes processed: 104162574

FAILURE: Build failed with an exception.

* What went wrong:
Execution failed for task ':src:core:test'.
> There were failing tests. See the report at: file:///F:/jenkins/jenkins-slave/workspace/JMeter%20Windows/src/core/build/reports/tests/test/index.html

* Try:
Run with --stacktrace option to get the stack trace. Run with --info or --debug option to
get more log output. Run with --scan to get full insights.

* Get more help at https://help.gradle.org

Deprecated Gradle features were used in this build, making it incompatible with Gradle 6.0.
Use '--warning-mode all' to show the individual deprecation warnings.
See https://docs.gradle.org/5.5.1/userguide/command_line_interface.html#sec:command_line_warnings

BUILD FAILED in 7m 14s
132 actionable tasks: 132 executed
Could not open/create prefs root node Software\JavaSoft\Prefs at root 0x80000002. Windows
RegCreateKeyEx(...) returned error code 5.
Build step 'Invoke Gradle script' changed build result to FAILURE
Build step 'Invoke Gradle script' marked build as failure

Mime
View raw message