jmeter-dev mailing list archives

Site index · List index
Message view « Date » · « Thread »
Top « Date » · « Thread »
From Apache Jenkins Server <jenk...@builds.apache.org>
Subject Build failed in Jenkins: JMeter-trunk #7292
Date Sun, 04 Aug 2019 16:00:59 GMT
See <https://builds.apache.org/job/JMeter-trunk/7292/display/redirect?page=changes>

Changes:

[felix.schumacher] Describe usage of gradle properties for proxy settings

------------------------------------------
[...truncated 101.08 KB...]
  org.bouncycastle.util.Selector
  org.bouncycastle.cert.X509CertificateHolder
  org.bouncycastle.cms.SignerInformationVerifier
  org.bouncycastle.mail.smime.SMIMESignedParser
  org.bouncycastle.operator.bc.BcDigestCalculatorProvider
  org.bouncycastle.cms.CMSException
  org.bouncycastle.mail.smime.SMIMEException
  org.bouncycastle.cms.SignerInformationStore
  org.bouncycastle.cms.SignerInformation
  org.bouncycastle.util.Store
  org.bouncycastle.cms.jcajce.JcaSimpleSignerInfoVerifierBuilder
  org.bouncycastle.asn1.x500.X500Name
  org.bouncycastle.cert.jcajce.JcaX509CertificateHolder
  org.bouncycastle.asn1.x500.RDN
  org.bouncycastle.asn1.x500.AttributeTypeAndValue
  org.bouncycastle.asn1.x500.style.IETFUtils
  org.bouncycastle.asn1.x509.GeneralNames
  org.bouncycastle.asn1.x509.GeneralName
  org.bouncycastle.jce.provider.BouncyCastleProvider
  org.bouncycastle.operator.OperatorCreationException
SpotBugs rule violations were found. See the report at: file://<https://builds.apache.org/job/JMeter-trunk/ws/src/components/build/reports/spotbugs/main.xml>

> Task :src:core:spotbugsMain
SpotBugs rule violations were found. See the report at: file://<https://builds.apache.org/job/JMeter-trunk/ws/src/core/build/reports/spotbugs/main.xml>

> Task :src:components:spotbugsTest
SpotBugs rule violations were found. See the report at: file://<https://builds.apache.org/job/JMeter-trunk/ws/src/components/build/reports/spotbugs/test.xml>

> Task :src:components:test

org.apache.jmeter.assertions.SizeAssertionTest STANDARD_OUT
    Setting JMeterHome: <https://builds.apache.org/job/JMeter-trunk/ws/src/components/../../.>
    Initializing Properties: ../.././bin/jmeter.properties
    JMeterVersion=5.2.0-SNAPSHOT 7556991
    java.version=1.8.0_191
    java.vm.name=Java HotSpot(TM) 64-Bit Server VM
    java.vendor=Oracle Corporation
    java.home=/usr/local/asfpackages/java/jdk1.8.0_191/jre
    file.encoding=ISO-8859-1
    default encoding=ISO-8859-1
    user.home=/home/jenkins
    user.dir=<https://builds.apache.org/job/JMeter-trunk/ws/src/components>
    user.language=en
    user.region=null
    user.country=US
    user.variant=
    Locale=en_US
    java.class.version=52.0
    java.awt.headless=true
    os.name=Linux
    os.version=4.4.0-143-generic
    os.arch=amd64

> Task :src:components:check
> Task :src:components:jar UP-TO-DATE
> Task :src:components:testJar UP-TO-DATE
> Task :src:dist-check:spotbugsMain NO-SOURCE
> Task :src:components:assemble UP-TO-DATE

> Task :src:core:spotbugsTest
SpotBugs rule violations were found. See the report at: file://<https://builds.apache.org/job/JMeter-trunk/ws/src/core/build/reports/spotbugs/test.xml>

> Task :src:licenses:gatherBinaryLicenses
> Task :src:licenses:renderLicenseForBinary UP-TO-DATE

> Task :src:core:test

org.apache.jmeter.samplers.TestSampleResult > testSubResultsFalsePause STANDARD_OUT
    Setting JMeterHome: <https://builds.apache.org/job/JMeter-trunk/ws/src/core/../../.>
    Initializing Properties: ../.././bin/jmeter.properties
    JMeterVersion=5.2.0-SNAPSHOT 7556991
    java.version=1.8.0_191
    java.vm.name=Java HotSpot(TM) 64-Bit Server VM
    java.vendor=Oracle Corporation
    java.home=/usr/local/asfpackages/java/jdk1.8.0_191/jre
    file.encoding=ISO-8859-1
    default encoding=ISO-8859-1
    user.home=/home/jenkins
    user.dir=<https://builds.apache.org/job/JMeter-trunk/ws/src/core>
    user.language=en
    user.region=null
    user.country=US
    user.variant=
    Locale=en_US
    java.class.version=52.0
    java.awt.headless=true
    os.name=Linux
    os.version=4.4.0-143-generic
    os.arch=amd64

org.apache.jmeter.samplers.TestSampleResult > testSubResultsFalsePause FAILED
    java.lang.AssertionError: TestElapsed: 455 -  ParentElapsed: 401 => 54 not in [0,16];
nanotime=false
        at org.junit.Assert.fail(Assert.java:88)
        at org.apache.jmeter.samplers.TestSampleResult.testSubResults(TestSampleResult.java:292)
        at org.apache.jmeter.samplers.TestSampleResult.testSubResults(TestSampleResult.java:198)
        at org.apache.jmeter.samplers.TestSampleResult.testSubResultsFalsePause(TestSampleResult.java:181)

> Task :src:dist:spotbugsMain NO-SOURCE
> Task :src:dist:populateLibs
> Task :src:dist:copyBinLibs UP-TO-DATE
> Task :src:generator:spotbugsMain
> Task :src:generator:spotbugsTest NO-SOURCE
> Task :src:generator:test NO-SOURCE
> Task :src:generator:check

> Task :src:core:test

org.apache.jmeter.resources.PackageTest > checkI18n STANDARD_OUT
    Ignoring missing junit_failure_default_code=0001 in org/apache/jmeter/resources/messages_fr.properties
    Ignoring missing aggregate_report_90=90% in org/apache/jmeter/resources/messages_fr.properties
    Ignoring missing junit_error_default_code=9999 in org/apache/jmeter/resources/messages_fr.properties
    Ignoring missing junit_success_default_code=1000 in org/apache/jmeter/resources/messages_fr.properties

> Task :src:examples:spotbugsMain
> Task :src:examples:spotbugsTest NO-SOURCE
> Task :src:examples:test NO-SOURCE
> Task :src:examples:check
> Task :src:dist:copyLibs
> Task :src:dist:createDist
> Task :src:dist-check:copyExtraTestLibs UP-TO-DATE
> Task :src:dist:renderLicenseForBinaryCopySpec

> Task :src:core:test

org.apache.jmeter.JMeterTest > testSuccessWhenJmxExists STANDARD_OUT
    Creating summariser <summary>
    Created the tree successfully using /tmp/testPlan5369099490324456683.jmx
    Starting the test @ Sun Aug 04 16:00:07 UTC 2019 (1564934407446)

org.apache.jmeter.JMeterTest STANDARD_OUT
    Waiting for possible Shutdown/StopTestNow/HeapDump/ThreadDump message on port 4445

org.apache.jmeter.JMeterTest > testFailureWithMissingPlugin STANDARD_OUT
    Error in NonGUIDriver java.lang.IllegalArgumentException: Problem loading XML from:'/tmp/testPlan4134689811255810561.jmx'.

    Cause:
    CannotResolveClassException: kg.apc.jmeter.samplers.DummySampler

     Detail:com.thoughtworks.xstream.converters.ConversionException: 
    ---- Debugging information ----
    cause-exception     : com.thoughtworks.xstream.converters.ConversionException
    cause-message       : 
    first-jmeter-class  : org.apache.jmeter.save.converters.HashTreeConverter.unmarshal(HashTreeConverter.java:67)
    class               : org.apache.jmeter.save.ScriptWrapper
    required-type       : org.apache.jmeter.save.ScriptWrapper
    converter-type      : org.apache.jmeter.save.ScriptWrapperConverter
    path                : /jmeterTestPlan/hashTree/hashTree/hashTree/kg.apc.jmeter.samplers.DummySampler
    line number         : 16
    version             : not available
    -------------------------------

org.apache.jmeter.testbeans.gui.TestFieldStringEditor > testSetGetAsText STANDARD_OUT
    JMeterUtils.getJMeterVe rsion() = 5.2.0-SNAPSHOT 7556991
    summary =      0 in 00:00:00 = ******/s Avg:     0 Min: 9223372036854775807 Max: -9223372036854775808
Err:     0 (0.00%)
    Tidying up ...    @ Sun Aug 04 16:00:07 UTC 2019 (1564934407764)
    ... end of run
    JMeterUtils.getJMeterVe rsion() = 5.2.0-SNAPSHOT 7556991
    JMeterUtils.getJMeterVe rsion() = 5.2.0-SNAPSHOT 7556991

org.apache.jmeter.engine.LocalHostTest > testLocalHost STANDARD_ERROR
    java.rmi.server.hostname=null
    asf929.gq1.ygridcore.net/67.195.81.179
    isSiteLocalAddress:false
    isAnyLocalAddress:false
    isLinkLocalAddress:false
    isLoopbackAddress:false
    isMulticastAddress:false
    localhost/127.0.0.1
    isSiteLocalAddress:false
    isAnyLocalAddress:false
    isLinkLocalAddress:false
    isLoopbackAddress:true
    isMulticastAddress:false
    ====================
    asf929.gq1.ygridcore.net/67.195.81.179
    isSiteLocalAddress:false
    isAnyLocalAddress:false
    isLinkLocalAddress:false
    isLoopbackAddress:false
    isMulticastAddress:false

org.apache.jmeter.engine.LocalHostTest > testInterfaces STANDARD_ERROR
    Interfaces: {name:docker0 (docker0) => [/fe80:0:0:0:42:93ff:fe78:f66d%docker0/64 [null],
/172.17.0.1/16 [/0.0.0.0]], name:enp5s0f0 (enp5s0f0) => [/fe80:0:0:0:28c:faff:fe5b:40f4%enp5s0f0/64
[null], /67.195.81.179/26 [/67.195.81.191]], name:lo (lo) => [/0:0:0:0:0:0:0:1%lo/128 [null],
/127.0.0.1/8 [null]]}
    Choose 172.17.0.1 to talk to external services
    java.rmi.server.hostname=null

> Task :src:functions:spotbugsMain
SpotBugs rule violations were found. See the report at: file://<https://builds.apache.org/job/JMeter-trunk/ws/src/functions/build/reports/spotbugs/main.xml>

> Task :src:functions:compileTestJava UP-TO-DATE
> Task :src:functions:compileTestGroovy
> Task :src:functions:testClasses
> Task :src:functions:testJar UP-TO-DATE

> Task :src:dist-check:batchBUG_62847
Creating summariser <summary>
Created the tree successfully using <https://builds.apache.org/job/JMeter-trunk/ws/bin/testfiles/BUG_62847.jmx>
Starting the test @ Sun Aug 04 16:00:09 UTC 2019 (1564934409706)
Waiting for possible Shutdown/StopTestNow/HeapDump/ThreadDump message on port 4446

> Task :src:functions:checkstyleTest

> Task :src:core:test

250 tests completed, 1 failed

> Task :src:core:test FAILED

> Task :src:dist-check:batchBUG_62847
summary =      6 in 00:00:01 =   10.0/s Avg:     1 Min:     0 Max:     6 Err:     0 (0.00%)
Tidying up ...    @ Sun Aug 04 16:00:10 UTC 2019 (1564934410555)
... end of run
No errors present in the logfile <https://builds.apache.org/job/JMeter-trunk/ws/bin/BUG_62847.log>
(the file is empty)

> Task :src:dist:distTar
> Task :src:protocol:http:spotbugsMain

> Task :src:functions:spotbugsTest
SpotBugs rule violations were found. See the report at: file://<https://builds.apache.org/job/JMeter-trunk/ws/src/functions/build/reports/spotbugs/test.xml>

> Task :src:protocol:http:spotbugsMain
SpotBugs rule violations were found. See the report at: file://<https://builds.apache.org/job/JMeter-trunk/ws/src/protocol/http/build/reports/spotbugs/main.xml>

FAILURE: Build failed with an exception.

* What went wrong:
Execution failed for task ':src:core:test'.
> There were failing tests. See the report at: file://<https://builds.apache.org/job/JMeter-trunk/ws/src/core/build/reports/tests/test/index.html>

* Try:
Run with --stacktrace option to get the stack trace. Run with --info or --debug option to
get more log output. Run with --scan to get full insights.

* Get more help at https://help.gradle.org

Deprecated Gradle features were used in this build, making it incompatible with Gradle 6.0.
Use '--warning-mode all' to show the individual deprecation warnings.
See https://docs.gradle.org/5.5.1/userguide/command_line_interface.html#sec:command_line_warnings

BUILD FAILED in 3m 9s
201 actionable tasks: 94 executed, 107 up-to-date
Build step 'Invoke Gradle script' changed build result to FAILURE
Build step 'Invoke Gradle script' marked build as failure
WARN: Found multiple 'report-task.txt' in the workspace. Taking the first one.
<https://builds.apache.org/job/JMeter-trunk/ws/.sonar/report-task.txt>
<https://builds.apache.org/job/JMeter-trunk/ws/build/sonar/report-task.txt>
[locks-and-latches] Releasing all the locks
[locks-and-latches] All the locks released
Archiving artifacts
[Fast Archiver] Compressed 152.37 MB of artifacts by 48.7% relative to #7291
Recording test results

Mime
View raw message