jmeter-dev mailing list archives

Site index · List index
Message view « Date » · « Thread »
Top « Date » · « Thread »
From Franz Schwab <>
Subject gw build fails on my local linux machine
Date Mon, 05 Aug 2019 10:28:10 GMT

do you have the same problem running "gw build"?
It is locally on my Ubuntu on WSL (windows subsystem for linux):

> Task :src:dist:javadocAggregate FAILED

FAILURE: Build failed with an exception.

* What went wrong:
Execution failed for task ':src:dist:javadocAggregate'.
> Javadoc generation failed. Generated Javadoc options file (useful for troubleshooting):

* Try:
Run with --stacktrace option to get the stack trace. Run with --info or --debug option to
get more log output. Run with --scan to get full insights.

* Get more help at

Deprecated Gradle features were used in this build, making it incompatible with Gradle 6.0.
Use '--warning-mode all' to show the individual deprecation warnings.

BUILD FAILED in 1m 22s
67 actionable tasks: 67 executed

Best regards,

View raw message