jmeter-dev mailing list archives

Site index · List index
Message view « Date » · « Thread »
Top « Date » · « Thread »
From Apache Jenkins Server <jenk...@builds.apache.org>
Subject Build failed in Jenkins: JMeter Windows #1567
Date Tue, 05 Nov 2019 12:35:12 GMT
See <https://builds.apache.org/job/JMeter%20Windows/1567/display/redirect>

Changes:


------------------------------------------
[...truncated 166.07 KB...]
> Task :src:licenses:binLicenseDir UP-TO-DATE
> Task :src:licenses:jar UP-TO-DATE
> Task :src:licenses:assemble UP-TO-DATE
> Task :src:dist:javadocAggregate UP-TO-DATE
> Task :src:dist:distTar UP-TO-DATE
> Task :src:dist:distTarSha512 UP-TO-DATE

> Task :src:dist-check:batchBUG_62847
Nov 05, 2019 4:33:29 AM java.util.prefs.WindowsPreferences <init>
WARNING: Could not open/create prefs root node Software\JavaSoft\Prefs at root 0x80000002.
Windows RegCreateKeyEx(...) returned error code 5.
Creating summariser <summary>
Created the tree successfully using F:\jenkins\jenkins-slave\workspace\JMeter Windows\bin\testfiles\BUG_62847.jmx
Starting standalone test @ Tue Nov 05 04:33:29 PST 2019 (1572957209693)
Waiting for possible Shutdown/StopTestNow/HeapDump/ThreadDump message on port 4445
summary +      1 in 00:00:00 =    3.8/s Avg:     1 Min:     1 Max:     1 Err:     0 (0.00%)
Active: 1 Started: 1 Finished: 0
summary +      5 in 00:00:00 =   41.7/s Avg:     0 Min:     0 Max:     0 Err:     0 (0.00%)
Active: 0 Started: 3 Finished: 3
summary =      6 in 00:00:00 =   15.7/s Avg:     0 Min:     0 Max:     1 Err:     0 (0.00%)
Tidying up ...    @ Tue Nov 05 04:33:30 PST 2019 (1572957210281)
... end of run
No errors present in the logfile F:\jenkins\jenkins-slave\workspace\JMeter Windows\bin\BUG_62847.log
(the file is empty)

> Task :src:dist:distTarSource UP-TO-DATE
> Task :src:dist:distTarSourceSha512 UP-TO-DATE
> Task :src:dist:distZip UP-TO-DATE
> Task :src:dist:distZipSha512 UP-TO-DATE
> Task :src:dist:distZipSource UP-TO-DATE
> Task :src:dist:distZipSourceSha512 UP-TO-DATE
> Task :src:dist:processSiteXslt UP-TO-DATE
> Task :src:dist:previewSite UP-TO-DATE

> Task :src:dist-check:batchBatchTestLocal
Nov 05, 2019 4:33:32 AM java.util.prefs.WindowsPreferences <init>
WARNING: Could not open/create prefs root node Software\JavaSoft\Prefs at root 0x80000002.
Windows RegCreateKeyEx(...) returned error code 5.
Creating summariser <summary>
Created the tree successfully using F:\jenkins\jenkins-slave\workspace\JMeter Windows\bin\testfiles\BatchTestLocal.jmx
Starting standalone test @ Tue Nov 05 04:33:32 PST 2019 (1572957212990)
Waiting for possible Shutdown/StopTestNow/HeapDump/ThreadDump message on port 4445

> Task :src:dist:signDistTar SKIPPED
> Task :src:dist:signDistTarSource SKIPPED
> Task :src:dist:signDistZip SKIPPED
> Task :src:dist:signDistZipSource SKIPPED
> Task :src:dist:assemble UP-TO-DATE

> Task :src:dist-check:batchBatchTestLocal
summary +      1 in 00:00:00 =   24.4/s Avg:     1 Min:     1 Max:     1 Err:     0 (0.00%)
Active: 1 Started: 1 Finished: 0
summary +    131 in 00:00:06 =   23.1/s Avg:     4 Min:     0 Max:    87 Err:    16 (12.21%)
Active: 0 Started: 1 Finished: 1
summary =    132 in 00:00:06 =   23.1/s Avg:     4 Min:     0 Max:    87 Err:    16 (12.12%)
Tidying up ...    @ Tue Nov 05 04:33:39 PST 2019 (1572957219096)
... end of run
No errors present in the logfile F:\jenkins\jenkins-slave\workspace\JMeter Windows\bin\BatchTestLocal.log
(the file is empty)

> Task :src:dist-check:batchBug50898
Nov 05, 2019 4:33:41 AM java.util.prefs.WindowsPreferences <init>
WARNING: Could not open/create prefs root node Software\JavaSoft\Prefs at root 0x80000002.
Windows RegCreateKeyEx(...) returned error code 5.
Creating summariser <summary>
Created the tree successfully using F:\jenkins\jenkins-slave\workspace\JMeter Windows\bin\testfiles\Bug50898.jmx
Starting standalone test @ Tue Nov 05 04:33:41 PST 2019 (1572957221312)
Waiting for possible Shutdown/StopTestNow/HeapDump/ThreadDump message on port 4445
summary =      2 in 00:00:00 =   16.5/s Avg:     6 Min:     6 Max:     6 Err:     0 (0.00%)
Tidying up ...    @ Tue Nov 05 04:33:42 PST 2019 (1572957222004)
... end of run
No errors present in the logfile F:\jenkins\jenkins-slave\workspace\JMeter Windows\bin\Bug50898.log
(the file is empty)

> Task :src:dist-check:batchBug52968
Nov 05, 2019 4:33:43 AM java.util.prefs.WindowsPreferences <init>
WARNING: Could not open/create prefs root node Software\JavaSoft\Prefs at root 0x80000002.
Windows RegCreateKeyEx(...) returned error code 5.
Creating summariser <summary>
Created the tree successfully using F:\jenkins\jenkins-slave\workspace\JMeter Windows\bin\testfiles\Bug52968.jmx
Starting standalone test @ Tue Nov 05 04:33:43 PST 2019 (1572957223972)
Waiting for possible Shutdown/StopTestNow/HeapDump/ThreadDump message on port 4445
summary =     30 in 00:00:01 =   56.2/s Avg:     5 Min:     4 Max:     7 Err:     9 (30.00%)
Tidying up ...    @ Tue Nov 05 04:33:45 PST 2019 (1572957225036)
... end of run
No errors present in the logfile F:\jenkins\jenkins-slave\workspace\JMeter Windows\bin\Bug52968.log
(the file is empty)

> Task :src:dist-check:batchBug54685
Nov 05, 2019 4:33:46 AM java.util.prefs.WindowsPreferences <init>
WARNING: Could not open/create prefs root node Software\JavaSoft\Prefs at root 0x80000002.
Windows RegCreateKeyEx(...) returned error code 5.
Creating summariser <summary>
Created the tree successfully using F:\jenkins\jenkins-slave\workspace\JMeter Windows\bin\testfiles\Bug54685.jmx
Starting standalone test @ Tue Nov 05 04:33:46 PST 2019 (1572957226953)
Waiting for possible Shutdown/StopTestNow/HeapDump/ThreadDump message on port 4445
summary =      1 in 00:00:00 =    9.6/s Avg:     6 Min:     6 Max:     6 Err:     0 (0.00%)
Tidying up ...    @ Tue Nov 05 04:33:47 PST 2019 (1572957227565)
... end of run
No errors present in the logfile F:\jenkins\jenkins-slave\workspace\JMeter Windows\bin\Bug54685.log
(the file is empty)

> Task :src:dist-check:batchBug55375
Nov 05, 2019 4:33:49 AM java.util.prefs.WindowsPreferences <init>
WARNING: Could not open/create prefs root node Software\JavaSoft\Prefs at root 0x80000002.
Windows RegCreateKeyEx(...) returned error code 5.
Creating summariser <summary>
Created the tree successfully using F:\jenkins\jenkins-slave\workspace\JMeter Windows\bin\testfiles\Bug55375.jmx
Starting standalone test @ Tue Nov 05 04:33:49 PST 2019 (1572957229389)
Waiting for possible Shutdown/StopTestNow/HeapDump/ThreadDump message on port 4445
summary =      1 in 00:00:00 =    9.6/s Avg:     6 Min:     6 Max:     6 Err:     0 (0.00%)
Tidying up ...    @ Tue Nov 05 04:33:49 PST 2019 (1572957229981)
... end of run
No errors present in the logfile F:\jenkins\jenkins-slave\workspace\JMeter Windows\bin\Bug55375.log
(the file is empty)

> Task :src:dist-check:batchBug56243
Nov 05, 2019 4:33:51 AM java.util.prefs.WindowsPreferences <init>
WARNING: Could not open/create prefs root node Software\JavaSoft\Prefs at root 0x80000002.
Windows RegCreateKeyEx(...) returned error code 5.
Creating summariser <summary>
Created the tree successfully using F:\jenkins\jenkins-slave\workspace\JMeter Windows\bin\testfiles\Bug56243.jmx
Starting standalone test @ Tue Nov 05 04:33:51 PST 2019 (1572957231936)
Waiting for possible Shutdown/StopTestNow/HeapDump/ThreadDump message on port 4445
summary =      9 in 00:00:00 =   62.9/s Avg:     0 Min:     0 Max:     7 Err:     0 (0.00%)
Tidying up ...    @ Tue Nov 05 04:33:52 PST 2019 (1572957232607)
... end of run
No errors present in the logfile F:\jenkins\jenkins-slave\workspace\JMeter Windows\bin\Bug56243.log
(the file is empty)

> Task :src:dist-check:batchBug56811
Nov 05, 2019 4:33:54 AM java.util.prefs.WindowsPreferences <init>
WARNING: Could not open/create prefs root node Software\JavaSoft\Prefs at root 0x80000002.
Windows RegCreateKeyEx(...) returned error code 5.
Creating summariser <summary>
Created the tree successfully using F:\jenkins\jenkins-slave\workspace\JMeter Windows\bin\testfiles\Bug56811.jmx
Starting standalone test @ Tue Nov 05 04:33:54 PST 2019 (1572957234565)
Waiting for possible Shutdown/StopTestNow/HeapDump/ThreadDump message on port 4445
summary =      9 in 00:00:00 =   20.8/s Avg:     3 Min:     0 Max:     6 Err:     3 (33.33%)
Tidying up ...    @ Tue Nov 05 04:33:55 PST 2019 (1572957235473)
... end of run
No errors present in the logfile F:\jenkins\jenkins-slave\workspace\JMeter Windows\bin\Bug56811.log
(the file is empty)

> Task :src:dist-check:batchBug62239
Nov 05, 2019 4:33:57 AM java.util.prefs.WindowsPreferences <init>
WARNING: Could not open/create prefs root node Software\JavaSoft\Prefs at root 0x80000002.
Windows RegCreateKeyEx(...) returned error code 5.
Creating summariser <summary>
Created the tree successfully using F:\jenkins\jenkins-slave\workspace\JMeter Windows\bin\testfiles\Bug62239.jmx
Starting standalone test @ Tue Nov 05 04:33:57 PST 2019 (1572957237460)
Waiting for possible Shutdown/StopTestNow/HeapDump/ThreadDump message on port 4445
summary =    108 in 00:00:00 =  346.2/s Avg:     0 Min:     0 Max:     2 Err:     0 (0.00%)
Tidying up ...    @ Tue Nov 05 04:33:57 PST 2019 (1572957237942)
... end of run
No errors present in the logfile F:\jenkins\jenkins-slave\workspace\JMeter Windows\bin\Bug62239.log
(the file is empty)

> Task :src:dist-check:batchFTP_TESTS
Nov 05, 2019 4:33:59 AM java.util.prefs.WindowsPreferences <init>
WARNING: Could not open/create prefs root node Software\JavaSoft\Prefs at root 0x80000002.
Windows RegCreateKeyEx(...) returned error code 5.
Creating summariser <summary>
Created the tree successfully using F:\jenkins\jenkins-slave\workspace\JMeter Windows\bin\testfiles\FTP_TESTS.jmx
Starting standalone test @ Tue Nov 05 04:33:59 PST 2019 (1572957239826)
Waiting for possible Shutdown/StopTestNow/HeapDump/ThreadDump message on port 4445
summary +      1 in 00:00:01 =    1.3/s Avg:   751 Min:   751 Max:   751 Err:     0 (0.00%)
Active: 1 Started: 1 Finished: 0
summary +      5 in 00:00:01 =    3.7/s Avg:    41 Min:    22 Max:    88 Err:     0 (0.00%)
Active: 0 Started: 1 Finished: 1
summary =      6 in 00:00:02 =    2.8/s Avg:   159 Min:    22 Max:   751 Err:     0 (0.00%)
Tidying up ...    @ Tue Nov 05 04:34:02 PST 2019 (1572957242804)
... end of run
No errors present in the logfile F:\jenkins\jenkins-slave\workspace\JMeter Windows\bin\FTP_TESTS.log
(the file is empty)

> Task :src:dist-check:batchHTMLParserTestFile_2
Nov 05, 2019 4:34:04 AM java.util.prefs.WindowsPreferences <init>
WARNING: Could not open/create prefs root node Software\JavaSoft\Prefs at root 0x80000002.
Windows RegCreateKeyEx(...) returned error code 5.
Creating summariser <summary>
Created the tree successfully using F:\jenkins\jenkins-slave\workspace\JMeter Windows\bin\testfiles\HTMLParserTestFile_2.jmx
Starting standalone test @ Tue Nov 05 04:34:04 PST 2019 (1572957244493)
Waiting for possible Shutdown/StopTestNow/HeapDump/ThreadDump message on port 4445
summary +      1 in 00:00:00 =    4.6/s Avg:   133 Min:   133 Max:   133 Err:     0 (0.00%)
Active: 1 Started: 1 Finished: 0
summary =      1 in 00:00:00 =    4.3/s Avg:   133 Min:   133 Max:   133 Err:     0 (0.00%)
Tidying up ...    @ Tue Nov 05 04:34:05 PST 2019 (1572957245289)
... end of run
No errors present in the logfile F:\jenkins\jenkins-slave\workspace\JMeter Windows\bin\HTMLParserTestFile_2.log
(the file is empty)

> Task :src:dist-check:batchHttp4ImplDigestAuth
Nov 05, 2019 4:34:07 AM java.util.prefs.WindowsPreferences <init>
WARNING: Could not open/create prefs root node Software\JavaSoft\Prefs at root 0x80000002.
Windows RegCreateKeyEx(...) returned error code 5.
Creating summariser <summary>
Created the tree successfully using F:\jenkins\jenkins-slave\workspace\JMeter Windows\bin\testfiles\Http4ImplDigestAuth.jmx
Starting standalone test @ Tue Nov 05 04:34:07 PST 2019 (1572957247092)
Waiting for possible Shutdown/StopTestNow/HeapDump/ThreadDump message on port 4445
summary =      2 in 00:00:03 =    0.6/s Avg:  1222 Min:   264 Max:  2180 Err:     0 (0.00%)
Tidying up ...    @ Tue Nov 05 04:34:10 PST 2019 (1572957250776)
... end of run
No errors present in the logfile F:\jenkins\jenkins-slave\workspace\JMeter Windows\bin\Http4ImplDigestAuth.log
(the file is empty)

> Task :src:dist-check:batchHttp4ImplPreemptiveBasicAuth
Nov 05, 2019 4:34:12 AM java.util.prefs.WindowsPreferences <init>
WARNING: Could not open/create prefs root node Software\JavaSoft\Prefs at root 0x80000002.
Windows RegCreateKeyEx(...) returned error code 5.
Creating summariser <summary>
Created the tree successfully using F:\jenkins\jenkins-slave\workspace\JMeter Windows\bin\testfiles\Http4ImplPreemptiveBasicAuth.jmx
Starting standalone test @ Tue Nov 05 04:34:12 PST 2019 (1572957252632)
Waiting for possible Shutdown/StopTestNow/HeapDump/ThreadDump message on port 4445
summary +      9 in 00:00:17 =    0.5/s Avg:  1602 Min:    26 Max:  9467 Err:     0 (0.00%)
Active: 1 Started: 5 Finished: 4
summary +      3 in 00:00:04 =    0.7/s Avg:  1278 Min:    28 Max:  3453 Err:     0 (0.00%)
Active: 0 Started: 6 Finished: 6
summary =     12 in 00:00:21 =    0.6/s Avg:  1521 Min:    26 Max:  9467 Err:     0 (0.00%)
Tidying up ...    @ Tue Nov 05 04:34:34 PST 2019 (1572957274772)
... end of run
No errors present in the logfile F:\jenkins\jenkins-slave\workspace\JMeter Windows\bin\Http4ImplPreemptiveBasicAuth.log
(the file is empty)

> Task :src:dist-check:batchHttp4ImplPreemptiveBasicAuthJava
Nov 05, 2019 4:34:36 AM java.util.prefs.WindowsPreferences <init>
WARNING: Could not open/create prefs root node Software\JavaSoft\Prefs at root 0x80000002.
Windows RegCreateKeyEx(...) returned error code 5.
Creating summariser <summary>
Created the tree successfully using F:\jenkins\jenkins-slave\workspace\JMeter Windows\bin\testfiles\Http4ImplPreemptiveBasicAuth.jmx
Starting standalone test @ Tue Nov 05 04:34:36 PST 2019 (1572957276685)
Waiting for possible Shutdown/StopTestNow/HeapDump/ThreadDump message on port 4445
summary +      3 in 00:00:23 =    0.1/s Avg:  7119 Min:    27 Max: 21234 Err:     1 (33.33%)
Active: 1 Started: 2 Finished: 1
summary +      9 in 00:00:11 =    0.8/s Avg:  1053 Min:    26 Max:  9229 Err:     0 (0.00%)
Active: 0 Started: 6 Finished: 6
summary =     12 in 00:00:34 =    0.4/s Avg:  2570 Min:    26 Max: 21234 Err:     1 (8.33%)
Tidying up ...    @ Tue Nov 05 04:35:11 PST 2019 (1572957311504)
... end of run
ERROR: unexpected output for Http4ImplPreemptiveBasicAuth.csv:
  - expected 866 bytes, F:\jenkins\jenkins-slave\workspace\JMeter Windows\bin\testfiles\Http4ImplPreemptiveBasicAuth.csv
  + actual 967 bytes, F:\jenkins\jenkins-slave\workspace\JMeter Windows\bin\Http4ImplPreemptiveBasicAuth.csv
@@ -1,7 +1,7 @@
 label,responseCode,responseMessage,threadName,dataType,success
 HTTP-Request-WithNoMatchingAuth,200,OK,Thread Group 1-1,text,true
 HTTP-Request-WithNoMatchingAuth,200,OK,Thread Group 1-1,text,true
-HTTPS-Request-WithNoMatchingAuth,200,OK,Thread Group 2-1,text,true
+HTTPS-Request-WithNoMatchingAuth,Non HTTP response code: java.net.ConnectException,Non HTTP
response message: Connection timed out: connect,Thread Group 2-1,text,false
 HTTPS-Request-WithNoMatchingAuth,200,OK,Thread Group 2-1,text,true
 HTTP-Request-NoAuthManager,200,OK,Thread Group 3-1,text,true
 HTTP-Request-NoAuthManager,200,OK,Thread Group 3-1,text,true
ERROR: unexpected output for Http4ImplPreemptiveBasicAuth.xml:
  - expected 3253 bytes, F:\jenkins\jenkins-slave\workspace\JMeter Windows\bin\testfiles\Http4ImplPreemptiveBasicAuth.xml
  + actual 3266 bytes, F:\jenkins\jenkins-slave\workspace\JMeter Windows\bin\Http4ImplPreemptiveBasicAuth.xml
@@ -14,7 +14,7 @@
     <error>false</error>
   </assertionResult>
 </httpSample>
-<httpSample s="true" lb="HTTPS-Request-WithNoMatchingAuth" rc="200" rm="OK" tn="Thread
Group 2-1" dt="text">
+<httpSample s="false" lb="HTTPS-Request-WithNoMatchingAuth" rc="Non HTTP response code:
java.net.ConnectException" rm="Non HTTP response message: Connection timed out: connect" tn="Thread
Group 2-1" dt="text">
   <assertionResult>
     <name>JSA_CheckAuthorization</name>
     <failure>false</failure>
No errors present in the logfile F:\jenkins\jenkins-slave\workspace\JMeter Windows\bin\Http4ImplPreemptiveBasicAuth.log
(the file is empty)

> Task :src:dist-check:batchHttp4ImplPreemptiveBasicAuthJava FAILED
checksum-dependency elapsed time: 6537ms, configurations processed: 266 (add -PchecksumTimingsPrint
to print detailed timings)

FAILURE: Build failed with an exception.

* What went wrong:
Execution failed for task ':src:dist-check:batchHttp4ImplPreemptiveBasicAuthJava'.
> Failures detected while testing F:\jenkins\jenkins-slave\workspace\JMeter Windows\bin\testfiles\Http4ImplPreemptiveBasicAuth.jmx:
[unexpected output Http4ImplPreemptiveBasicAuth.csv, unexpected output Http4ImplPreemptiveBasicAuth.xml]

* Try:
Run with --stacktrace option to get the stack trace. Run with --info or --debug option to
get more log output. Run with --scan to get full insights.

* Get more help at https://help.gradle.org

Deprecated Gradle features were used in this build, making it incompatible with Gradle 6.0.
Use '--warning-mode all' to show the individual deprecation warnings.
See https://docs.gradle.org/5.6.2/userguide/command_line_interface.html#sec:command_line_warnings

BUILD FAILED in 2m 14s
282 actionable tasks: 90 executed, 192 up-to-date
Build step 'Invoke Gradle script' changed build result to FAILURE
Build step 'Invoke Gradle script' marked build as failure

Mime
View raw message