jmeter-dev mailing list archives

Site index · List index
Message view « Date » · « Thread »
Top « Date » · « Thread »
From Apache Jenkins Server <jenk...@builds.apache.org>
Subject Build failed in Jenkins: JMeter Ubuntu #954
Date Sat, 28 Dec 2019 17:40:32 GMT
See <https://builds.apache.org/job/JMeter%20Ubuntu/954/display/redirect?page=changes>

Changes:

[sitnikov.vladimir] Replace Spotless with Autostyle

[sitnikov.vladimir] Ensure copyright header is the first comment in the properties files

[sitnikov.vladimir] Run autostyleApply

[sitnikov.vladimir] Fix copyright header for RenderInBrowser.java


------------------------------------------
[...truncated 27.45 KB...]
> Task :src:functions:autostyleJavaCheck
> Task :src:testkit-wiremock:compileJava

> Task :src:jorphan:compileJava
Note: Some input files use or override a deprecated API.
Note: Recompile with -Xlint:deprecation for details.

> Task :src:components:autostyleJavaCheck
> Task :src:config:autostyleKotlinGradleCheck
> Task :src:release:autostyleKotlinGradleCheck
> Task :src:bom:autostyleKotlinGradleCheck
> Task :src:protocol:autostyleKotlinGradleCheck
> Task :src:autostyleKotlinGradleCheck
> Task :src:licenses:autostyleKotlinGradleCheck
> Task :src:dist:autostyleKotlinGradleCheck
checksum-dependency elapsed time: 53261ms, configurations processed: 54
    SHA-512 computation time: 1817ms (goes in parallel, it might exceed wall-clock time),
files processed: 15, processed: 4MiB, skipped: 431MiB
    PGP signature resolution time: 16942ms (wall-clock), resolution requests: 29, signatures
resolved: 112
    PGP key resolution time: 9380ms (wall-clock), resolution requests: 29, download time:
1468ms (goes in parallel, it might exceed wall-clock time), keys downloaded: 2
        PGP signature verification time: 11343ms (goes in parallel, it might exceed wall-clock
time), files processed: 309, processed: 427MiB, skipped: 4MiB

FAILURE: Build failed with an exception.

* What went wrong:
Execution failed for task ':autostyleConfigsCheck'.
> The following files have format violations:
    bin/SlowCharsFeature_HttpClient4-errors.xml
      @@ -1,4 +1,21 @@
       <?xml version="1.0" encoding="UTF-8"?>
      +<!--
      +  ~ Licensed to the Apache Software Foundation (ASF) under one or more
      +  ~ contributor license agreements.  See the NOTICE file distributed with
      +  ~ this work for additional information regarding copyright ownership.
      +  ~ The ASF licenses this file to you under the Apache License, Version 2.0
      +  ~ (the "License"); you may not use this file except in compliance with
      +  ~ the License.  You may obtain a copy of the License at
      +  ~
      +  ~ http://www.apache.org/licenses/LICENSE-2.0
      +  ~
      +  ~ Unless required by applicable law or agreed to in writing, software
      +  ~ distributed under the License is distributed on an "AS IS" BASIS,
      +  ~ WITHOUT WARRANTIES OR CONDITIONS OF ANY KIND, either express or implied.
      +  ~ See the License for the specific language governing permissions and
      +  ~ limitations under the License.
      +  -->
      +
       <testResults version="1.2">
       
       
    bin/SlowCharsFeature_Java-errors.xml
      @@ -1,4 +1,21 @@
       <?xml version="1.0" encoding="UTF-8"?>
      +<!--
      +  ~ Licensed to the Apache Software Foundation (ASF) under one or more
      +  ~ contributor license agreements.  See the NOTICE file distributed with
      +  ~ this work for additional information regarding copyright ownership.
      +  ~ The ASF licenses this file to you under the Apache License, Version 2.0
      +  ~ (the "License"); you may not use this file except in compliance with
      +  ~ the License.  You may obtain a copy of the License at
      +  ~
      +  ~ http://www.apache.org/licenses/LICENSE-2.0
      +  ~
      +  ~ Unless required by applicable law or agreed to in writing, software
      +  ~ distributed under the License is distributed on an "AS IS" BASIS,
      +  ~ WITHOUT WARRANTIES OR CONDITIONS OF ANY KIND, either express or implied.
      +  ~ See the License for the specific language governing permissions and
      +  ~ limitations under the License.
      +  -->
      +
       <testResults version="1.2">
       
       
    bin/TestRedirectionPolicies-errors.xml
      @@ -1,4 +1,21 @@
       <?xml version="1.0" encoding="UTF-8"?>
      +<!--
    ... (19 more lines that didn't fit)
  Run './gradlew autostyleApply' to fix the violations.

* Try:
Run with --info or --debug option to get more log output. Run with --scan to get full insights.

* Exception is:
org.gradle.api.tasks.TaskExecutionException: Execution failed for task ':autostyleConfigsCheck'.
	at org.gradle.api.internal.tasks.execution.ExecuteActionsTaskExecuter.lambda$executeIfValid$1(ExecuteActionsTaskExecuter.java:187)
	at org.gradle.internal.Try$Failure.ifSuccessfulOrElse(Try.java:263)
	at org.gradle.api.internal.tasks.execution.ExecuteActionsTaskExecuter.executeIfValid(ExecuteActionsTaskExecuter.java:185)
	at org.gradle.api.internal.tasks.execution.ExecuteActionsTaskExecuter.execute(ExecuteActionsTaskExecuter.java:166)
	at org.gradle.api.internal.tasks.execution.CleanupStaleOutputsExecuter.execute(CleanupStaleOutputsExecuter.java:109)
	at org.gradle.api.internal.tasks.execution.FinalizePropertiesTaskExecuter.execute(FinalizePropertiesTaskExecuter.java:46)
	at org.gradle.api.internal.tasks.execution.ResolveTaskExecutionModeExecuter.execute(ResolveTaskExecutionModeExecuter.java:62)
	at org.gradle.api.internal.tasks.execution.SkipTaskWithNoActionsExecuter.execute(SkipTaskWithNoActionsExecuter.java:57)
	at org.gradle.api.internal.tasks.execution.SkipOnlyIfTaskExecuter.execute(SkipOnlyIfTaskExecuter.java:56)
	at org.gradle.api.internal.tasks.execution.CatchExceptionTaskExecuter.execute(CatchExceptionTaskExecuter.java:36)
	at org.gradle.api.internal.tasks.execution.EventFiringTaskExecuter$1.executeTask(EventFiringTaskExecuter.java:77)
	at org.gradle.api.internal.tasks.execution.EventFiringTaskExecuter$1.call(EventFiringTaskExecuter.java:55)
	at org.gradle.api.internal.tasks.execution.EventFiringTaskExecuter$1.call(EventFiringTaskExecuter.java:52)
	at org.gradle.internal.operations.DefaultBuildOperationExecutor$CallableBuildOperationWorker.execute(DefaultBuildOperationExecutor.java:416)
	at org.gradle.internal.operations.DefaultBuildOperationExecutor$CallableBuildOperationWorker.execute(DefaultBuildOperationExecutor.java:406)
	at org.gradle.internal.operations.DefaultBuildOperationExecutor$1.execute(DefaultBuildOperationExecutor.java:165)
	at org.gradle.internal.operations.DefaultBuildOperationExecutor.execute(DefaultBuildOperationExecutor.java:250)
	at org.gradle.internal.operations.DefaultBuildOperationExecutor.execute(DefaultBuildOperationExecutor.java:158)
	at org.gradle.internal.operations.DefaultBuildOperationExecutor.call(DefaultBuildOperationExecutor.java:102)
	at org.gradle.internal.operations.DelegatingBuildOperationExecutor.call(DelegatingBuildOperationExecutor.java:36)
	at org.gradle.api.internal.tasks.execution.EventFiringTaskExecuter.execute(EventFiringTaskExecuter.java:52)
	at org.gradle.execution.plan.LocalTaskNodeExecutor.execute(LocalTaskNodeExecutor.java:41)
	at org.gradle.execution.taskgraph.DefaultTaskExecutionGraph$InvokeNodeExecutorsAction.execute(DefaultTaskExecutionGraph.java:374)
	at org.gradle.execution.taskgraph.DefaultTaskExecutionGraph$InvokeNodeExecutorsAction.execute(DefaultTaskExecutionGraph.java:361)
	at org.gradle.execution.taskgraph.DefaultTaskExecutionGraph$BuildOperationAwareExecutionAction.execute(DefaultTaskExecutionGraph.java:354)
	at org.gradle.execution.taskgraph.DefaultTaskExecutionGraph$BuildOperationAwareExecutionAction.execute(DefaultTaskExecutionGraph.java:340)
	at org.gradle.execution.plan.DefaultPlanExecutor$ExecutorWorker.lambda$run$0(DefaultPlanExecutor.java:127)
	at org.gradle.execution.plan.DefaultPlanExecutor$ExecutorWorker.execute(DefaultPlanExecutor.java:191)
	at org.gradle.execution.plan.DefaultPlanExecutor$ExecutorWorker.executeNextNode(DefaultPlanExecutor.java:182)
	at org.gradle.execution.plan.DefaultPlanExecutor$ExecutorWorker.run(DefaultPlanExecutor.java:124)
	at org.gradle.internal.concurrent.ExecutorPolicy$CatchAndRecordFailures.onExecute(ExecutorPolicy.java:64)
	at org.gradle.internal.concurrent.ManagedExecutorImpl$1.run(ManagedExecutorImpl.java:48)
	at org.gradle.internal.concurrent.ThreadFactoryImpl$ManagedThreadRunnable.run(ThreadFactoryImpl.java:56)
Caused by: org.gradle.api.GradleException: The following files have format violations:
  bin/SlowCharsFeature_HttpClient4-errors.xml
    @@ -1,4 +1,21 @@
     <?xml version="1.0" encoding="UTF-8"?>
    +<!--
    +  ~ Licensed to the Apache Software Foundation (ASF) under one or more
    +  ~ contributor license agreements.  See the NOTICE file distributed with
    +  ~ this work for additional information regarding copyright ownership.
    +  ~ The ASF licenses this file to you under the Apache License, Version 2.0
    +  ~ (the "License"); you may not use this file except in compliance with
    +  ~ the License.  You may obtain a copy of the License at
    +  ~
    +  ~ http://www.apache.org/licenses/LICENSE-2.0
    +  ~
    +  ~ Unless required by applicable law or agreed to in writing, software
    +  ~ distributed under the License is distributed on an "AS IS" BASIS,
    +  ~ WITHOUT WARRANTIES OR CONDITIONS OF ANY KIND, either express or implied.
    +  ~ See the License for the specific language governing permissions and
    +  ~ limitations under the License.
    +  -->
    +
     <testResults version="1.2">
     
     
  bin/SlowCharsFeature_Java-errors.xml
    @@ -1,4 +1,21 @@
     <?xml version="1.0" encoding="UTF-8"?>
    +<!--
    +  ~ Licensed to the Apache Software Foundation (ASF) under one or more
    +  ~ contributor license agreements.  See the NOTICE file distributed with
    +  ~ this work for additional information regarding copyright ownership.
    +  ~ The ASF licenses this file to you under the Apache License, Version 2.0
    +  ~ (the "License"); you may not use this file except in compliance with
    +  ~ the License.  You may obtain a copy of the License at
    +  ~
    +  ~ http://www.apache.org/licenses/LICENSE-2.0
    +  ~
    +  ~ Unless required by applicable law or agreed to in writing, software
    +  ~ distributed under the License is distributed on an "AS IS" BASIS,
    +  ~ WITHOUT WARRANTIES OR CONDITIONS OF ANY KIND, either express or implied.
    +  ~ See the License for the specific language governing permissions and
    +  ~ limitations under the License.
    +  -->
    +
     <testResults version="1.2">
     
     
  bin/TestRedirectionPolicies-errors.xml
    @@ -1,4 +1,21 @@
     <?xml version="1.0" encoding="UTF-8"?>
    +<!--
  ... (19 more lines that didn't fit)
Run './gradlew autostyleApply' to fix the violations.
	at com.github.autostyle.gradle.AutostyleTask.formatViolationsFor(AutostyleTask.kt:113)
	at com.github.autostyle.gradle.AutostyleCheckTask.check(AutostyleCheckTask.kt:59)
	at com.github.autostyle.gradle.AutostyleCheckTask.performAction(AutostyleCheckTask.kt:40)
	at org.gradle.internal.reflect.JavaMethod.invoke(JavaMethod.java:104)
	at org.gradle.api.internal.project.taskfactory.IncrementalInputsTaskAction.doExecute(IncrementalInputsTaskAction.java:32)
	at org.gradle.api.internal.project.taskfactory.StandardTaskAction.execute(StandardTaskAction.java:42)
	at org.gradle.api.internal.project.taskfactory.AbstractIncrementalTaskAction.execute(AbstractIncrementalTaskAction.java:25)
	at org.gradle.api.internal.project.taskfactory.StandardTaskAction.execute(StandardTaskAction.java:28)
	at org.gradle.api.internal.tasks.execution.ExecuteActionsTaskExecuter$3.run(ExecuteActionsTaskExecuter.java:539)
	at org.gradle.internal.operations.DefaultBuildOperationExecutor$RunnableBuildOperationWorker.execute(DefaultBuildOperationExecutor.java:402)
	at org.gradle.internal.operations.DefaultBuildOperationExecutor$RunnableBuildOperationWorker.execute(DefaultBuildOperationExecutor.java:394)
	at org.gradle.internal.operations.DefaultBuildOperationExecutor$1.execute(DefaultBuildOperationExecutor.java:165)
	at org.gradle.internal.operations.DefaultBuildOperationExecutor.execute(DefaultBuildOperationExecutor.java:250)
	at org.gradle.internal.operations.DefaultBuildOperationExecutor.execute(DefaultBuildOperationExecutor.java:158)
	at org.gradle.internal.operations.DefaultBuildOperationExecutor.run(DefaultBuildOperationExecutor.java:92)
	at org.gradle.internal.operations.DelegatingBuildOperationExecutor.run(DelegatingBuildOperationExecutor.java:31)
	at org.gradle.api.internal.tasks.execution.ExecuteActionsTaskExecuter.executeAction(ExecuteActionsTaskExecuter.java:524)
	at org.gradle.api.internal.tasks.execution.ExecuteActionsTaskExecuter.executeActions(ExecuteActionsTaskExecuter.java:507)
	at org.gradle.api.internal.tasks.execution.ExecuteActionsTaskExecuter.access$300(ExecuteActionsTaskExecuter.java:109)
	at org.gradle.api.internal.tasks.execution.ExecuteActionsTaskExecuter$TaskExecution.executeWithPreviousOutputFiles(ExecuteActionsTaskExecuter.java:258)
	at org.gradle.api.internal.tasks.execution.ExecuteActionsTaskExecuter$TaskExecution.execute(ExecuteActionsTaskExecuter.java:247)
	at org.gradle.internal.execution.steps.ExecuteStep.lambda$execute$0(ExecuteStep.java:32)
	at org.gradle.internal.execution.steps.ExecuteStep.execute(ExecuteStep.java:32)
	at org.gradle.internal.execution.steps.ExecuteStep.execute(ExecuteStep.java:26)
	at org.gradle.internal.execution.steps.CleanupOutputsStep.execute(CleanupOutputsStep.java:63)
	at org.gradle.internal.execution.steps.CleanupOutputsStep.execute(CleanupOutputsStep.java:35)
	at org.gradle.internal.execution.steps.ResolveInputChangesStep.execute(ResolveInputChangesStep.java:49)
	at org.gradle.internal.execution.steps.ResolveInputChangesStep.execute(ResolveInputChangesStep.java:34)
	at org.gradle.internal.execution.steps.CancelExecutionStep.execute(CancelExecutionStep.java:43)
	at org.gradle.internal.execution.steps.TimeoutStep.executeWithoutTimeout(TimeoutStep.java:73)
	at org.gradle.internal.execution.steps.TimeoutStep.execute(TimeoutStep.java:54)
	at org.gradle.internal.execution.steps.CatchExceptionStep.execute(CatchExceptionStep.java:34)
	at org.gradle.internal.execution.steps.CreateOutputsStep.execute(CreateOutputsStep.java:44)
	at org.gradle.internal.execution.steps.SnapshotOutputsStep.execute(SnapshotOutputsStep.java:54)
	at org.gradle.internal.execution.steps.SnapshotOutputsStep.execute(SnapshotOutputsStep.java:38)
	at org.gradle.internal.execution.steps.CacheStep.executeWithoutCache(CacheStep.java:153)
	at org.gradle.internal.execution.steps.CacheStep.execute(CacheStep.java:67)
	at org.gradle.internal.execution.steps.CacheStep.execute(CacheStep.java:41)
	at org.gradle.internal.execution.steps.BroadcastChangingOutputsStep.execute(BroadcastChangingOutputsStep.java:49)
	at org.gradle.internal.execution.steps.StoreExecutionStateStep.execute(StoreExecutionStateStep.java:44)
	at org.gradle.internal.execution.steps.StoreExecutionStateStep.execute(StoreExecutionStateStep.java:33)
	at org.gradle.internal.execution.steps.RecordOutputsStep.execute(RecordOutputsStep.java:38)
	at org.gradle.internal.execution.steps.RecordOutputsStep.execute(RecordOutputsStep.java:24)
	at org.gradle.internal.execution.steps.SkipUpToDateStep.executeBecause(SkipUpToDateStep.java:92)
	at org.gradle.internal.execution.steps.SkipUpToDateStep.lambda$execute$0(SkipUpToDateStep.java:85)
	at org.gradle.internal.execution.steps.SkipUpToDateStep.execute(SkipUpToDateStep.java:55)
	at org.gradle.internal.execution.steps.SkipUpToDateStep.execute(SkipUpToDateStep.java:39)
	at org.gradle.internal.execution.steps.ResolveChangesStep.execute(ResolveChangesStep.java:76)
	at org.gradle.internal.execution.steps.ResolveChangesStep.execute(ResolveChangesStep.java:37)
	at org.gradle.internal.execution.steps.legacy.MarkSnapshottingInputsFinishedStep.execute(MarkSnapshottingInputsFinishedStep.java:36)
	at org.gradle.internal.execution.steps.legacy.MarkSnapshottingInputsFinishedStep.execute(MarkSnapshottingInputsFinishedStep.java:26)
	at org.gradle.internal.execution.steps.ResolveCachingStateStep.execute(ResolveCachingStateStep.java:94)
	at org.gradle.internal.execution.steps.ResolveCachingStateStep.execute(ResolveCachingStateStep.java:49)
	at org.gradle.internal.execution.steps.CaptureStateBeforeExecutionStep.execute(CaptureStateBeforeExecutionStep.java:79)
	at org.gradle.internal.execution.steps.CaptureStateBeforeExecutionStep.execute(CaptureStateBeforeExecutionStep.java:53)
	at org.gradle.internal.execution.steps.ValidateStep.execute(ValidateStep.java:74)
	at org.gradle.internal.execution.steps.SkipEmptyWorkStep.lambda$execute$2(SkipEmptyWorkStep.java:78)
	at org.gradle.internal.execution.steps.SkipEmptyWorkStep.execute(SkipEmptyWorkStep.java:78)
	at org.gradle.internal.execution.steps.SkipEmptyWorkStep.execute(SkipEmptyWorkStep.java:34)
	at org.gradle.internal.execution.steps.legacy.MarkSnapshottingInputsStartedStep.execute(MarkSnapshottingInputsStartedStep.java:39)
	at org.gradle.internal.execution.steps.LoadExecutionStateStep.execute(LoadExecutionStateStep.java:40)
	at org.gradle.internal.execution.steps.LoadExecutionStateStep.execute(LoadExecutionStateStep.java:28)
	at org.gradle.internal.execution.impl.DefaultWorkExecutor.execute(DefaultWorkExecutor.java:33)
	at org.gradle.api.internal.tasks.execution.ExecuteActionsTaskExecuter.executeIfValid(ExecuteActionsTaskExecuter.java:174)
	... 30 more


* Get more help at https://help.gradle.org

Deprecated Gradle features were used in this build, making it incompatible with Gradle 7.0.
Use '--warning-mode all' to show the individual deprecation warnings.
See https://docs.gradle.org/6.0.1/userguide/command_line_interface.html#sec:command_line_warnings

BUILD FAILED in 1m 59s
42 actionable tasks: 39 executed, 3 up-to-date
Build step 'Invoke Gradle script' changed build result to FAILURE
Build step 'Invoke Gradle script' marked build as failure
[locks-and-latches] Releasing all the locks
[locks-and-latches] All the locks released

Mime
View raw message