jmeter-dev mailing list archives

Site index · List index
Message view « Date » · « Thread »
Top « Date » · « Thread »
From Apache Jenkins Server <jenk...@builds.apache.org>
Subject Build failed in Jenkins: JMeter Ubuntu #961
Date Fri, 24 Jan 2020 03:58:43 GMT
See <https://builds.apache.org/job/JMeter%20Ubuntu/961/display/redirect?page=changes>

Changes:

[sitnikov.vladimir] Add Gradle Wrapper validation


------------------------------------------
[...truncated 199.56 KB...]

> Task :src:dist-check:batchTestKeepAlive
Creating summariser <summary>
Created the tree successfully using <https://builds.apache.org/job/JMeter%20Ubuntu/ws/bin/testfiles/TestKeepAlive.jmx>
Starting standalone test @ Fri Jan 24 03:57:32 UTC 2020 (1579838252546)
Waiting for possible Shutdown/StopTestNow/HeapDump/ThreadDump message on port 4445
summary +      1 in 00:00:00 =    2.3/s Avg:   400 Min:   400 Max:   400 Err:     0 (0.00%)
Active: 1 Started: 1 Finished: 0
summary +      6 in 00:00:32 =    0.2/s Avg:   238 Min:   165 Max:   411 Err:     0 (0.00%)
Active: 1 Started: 1 Finished: 0
summary =      7 in 00:00:32 =    0.2/s Avg:   261 Min:   165 Max:   411 Err:     0 (0.00%)
summary +      1 in 00:00:30 =    0.0/s Avg:   157 Min:   157 Max:   157 Err:     0 (0.00%)
Active: 1 Started: 1 Finished: 0
summary =      8 in 00:01:02 =    0.1/s Avg:   248 Min:   157 Max:   411 Err:     0 (0.00%)
summary =      8 in 00:01:02 =    0.1/s Avg:   248 Min:   157 Max:   411 Err:     0 (0.00%)
Tidying up ...    @ Fri Jan 24 03:58:35 UTC 2020 (1579838315652)
... end of run
No errors present in the logfile <https://builds.apache.org/job/JMeter%20Ubuntu/ws/bin/TestKeepAlive.log>
(the file is empty)

> Task :src:dist-check:batchTestRedirectionPolicies
Creating summariser <summary>
Created the tree successfully using <https://builds.apache.org/job/JMeter%20Ubuntu/ws/bin/testfiles/TestRedirectionPolicies.jmx>
Starting standalone test @ Fri Jan 24 03:58:37 UTC 2020 (1579838317522)
Waiting for possible Shutdown/StopTestNow/HeapDump/ThreadDump message on port 4445
summary =      6 in 00:00:02 =    3.7/s Avg:   150 Min:    68 Max:   281 Err:     4 (66.67%)
Tidying up ...    @ Fri Jan 24 03:58:39 UTC 2020 (1579838319854)
... end of run
ERROR: unexpected output for TestRedirectionPolicies.csv:
  - expected 260 bytes, <https://builds.apache.org/job/JMeter%20Ubuntu/ws/bin/testfiles/TestRedirectionPolicies.csv>
  + actual 264 bytes, <https://builds.apache.org/job/JMeter%20Ubuntu/ws/bin/TestRedirectionPolicies.csv>
@@ -1,6 +1,6 @@
-HR_AutoRedirect,200,OK,TG1 1-1,text,true
+HR_AutoRedirect,200,OK,TG1 1-1,text,false
 HR_NoAutoRedirect,302,FOUND,TG1 1-1,text,true
-HR_FollowRedirect,200,OK,TG1 1-1,text,true
+HR_FollowRedirect,200,OK,TG1 1-1,text,false
 HR_NoAutoRedirect,302,FOUND,TG2 2-1,text,true
-HR_FollowRedirect,200,OK,TG2 2-1,text,true
-HR_AutoRedirect,200,OK,TG2 2-1,text,true
+HR_FollowRedirect,200,OK,TG2 2-1,text,false
+HR_AutoRedirect,200,OK,TG2 2-1,text,false
ERROR: unexpected output for TestRedirectionPolicies.xml:
  - expected 2853 bytes, <https://builds.apache.org/job/JMeter%20Ubuntu/ws/bin/testfiles/TestRedirectionPolicies.xml>
  + actual 3293 bytes, <https://builds.apache.org/job/JMeter%20Ubuntu/ws/bin/TestRedirectionPolicies.xml>
@@ -1,6 +1,6 @@
 <?xml version="1.0" encoding="UTF-8"?>
 <testResults version="1.2">
-<httpSample s="true" lb="HR_AutoRedirect" rc="200" rm="OK" dt="text">
+<httpSample s="false" lb="HR_AutoRedirect" rc="200" rm="OK" dt="text">
   <assertionResult>
     <name>RA_200</name>
     <failure>false</failure>
@@ -13,8 +13,9 @@
   </assertionResult>
   <assertionResult>
     <name>RA_Redirected</name>
-    <failure>false</failure>
+    <failure>true</failure>
     <error>false</error>
+    <failureMessage>Test failed: variable(url) expected to contain /https://httpbin.org/get/</failureMessage>
   </assertionResult>
 </httpSample>
 <httpSample s="true" lb="HR_NoAutoRedirect" rc="302" rm="FOUND" dt="text">
@@ -29,7 +30,7 @@
     <error>false</error>
   </assertionResult>
 </httpSample>
-<httpSample s="true" lb="HR_FollowRedirect" rc="200" rm="OK" dt="text">
+<httpSample s="false" lb="HR_FollowRedirect" rc="200" rm="OK" dt="text">
   <assertionResult>
     <name>RA_200</name>
     <failure>false</failure>
@@ -42,8 +43,9 @@
   </assertionResult>
   <assertionResult>
     <name>RA_Redirected</name>
-    <failure>false</failure>
+    <failure>true</failure>
     <error>false</error>
+    <failureMessage>Test failed: variable(url) expected to contain /https://httpbin.org/get/</failureMessage>
   </assertionResult>
   <httpSample s="true" lb="HR_FollowRedirect-0" rc="302" rm="FOUND" dt="text"/>
   <httpSample s="true" lb="HR_FollowRedirect-1" rc="200" rm="OK" dt="text"/>
@@ -60,7 +62,7 @@
     <error>false</error>
   </assertionResult>
 </httpSample>
-<httpSample s="true" lb="HR_FollowRedirect" rc="200" rm="OK" dt="text">
+<httpSample s="false" lb="HR_FollowRedirect" rc="200" rm="OK" dt="text">
   <assertionResult>
     <name>RA_200</name>
     <failure>false</failure>
@@ -73,13 +75,14 @@
   </assertionResult>
   <assertionResult>
     <name>RA_Redirected</name>
-    <failure>false</failure>
+    <failure>true</failure>
     <error>false</error>
+    <failureMessage>Test failed: variable(url) expected to contain /https://httpbin.org/get/</failureMessage>
   </assertionResult>
   <httpSample s="true" lb="HR_FollowRedirect-0" rc="302" rm="FOUND" dt="text"/>
   <httpSample s="true" lb="HR_FollowRedirect-1" rc="200" rm="OK" dt="text"/>
 </httpSample>
-<httpSample s="true" lb="HR_AutoRedirect" rc="200" rm="OK" dt="text">
+<httpSample s="false" lb="HR_AutoRedirect" rc="200" rm="OK" dt="text">
   <assertionResult>
     <name>RA_200</name>
     <failure>false</failure>
@@ -92,8 +95,9 @@
   </assertionResult>
   <assertionResult>
     <name>RA_Redirected</name>
-    <failure>false</failure>
+    <failure>true</failure>
     <error>false</error>
+    <failureMessage>Test failed: variable(url) expected to contain /https://httpbin.org/get/</failureMessage>
   </assertionResult>
 </httpSample>
 
No errors present in the logfile <https://builds.apache.org/job/JMeter%20Ubuntu/ws/bin/TestRedirectionPolicies.log>
(the file is empty)

> Task :src:dist-check:batchTestRedirectionPolicies FAILED
checksum-dependency elapsed time: 161796ms, configurations processed: 236
    SHA-512 computation time: 81ms (goes in parallel, it might exceed wall-clock time), files
processed: 25, processed: 6MiB, skipped: 2678MiB
    PGP signature resolution time: 36988ms (wall-clock), resolution requests: 138, signatures
resolved: 209
    PGP key resolution time: 28601ms (wall-clock), resolution requests: 138, download time:
38834ms (goes in parallel, it might exceed wall-clock time), keys downloaded: 93
        PGP signature verification time: 9917ms (goes in parallel, it might exceed wall-clock
time), files processed: 499, processed: 614MiB, skipped: 2044MiB

FAILURE: Build failed with an exception.

* What went wrong:
Execution failed for task ':src:dist-check:batchTestRedirectionPolicies'.
> Failures detected while testing <https://builds.apache.org/job/JMeter%20Ubuntu/ws/bin/testfiles/TestRedirectionPolicies.jmx>:
[unexpected output TestRedirectionPolicies.csv, unexpected output TestRedirectionPolicies.xml]

* Try:
Run with --info or --debug option to get more log output. Run with --scan to get full insights.

* Exception is:
org.gradle.api.tasks.TaskExecutionException: Execution failed for task ':src:dist-check:batchTestRedirectionPolicies'.
	at org.gradle.api.internal.tasks.execution.ExecuteActionsTaskExecuter.lambda$executeIfValid$1(ExecuteActionsTaskExecuter.java:205)
	at org.gradle.internal.Try$Failure.ifSuccessfulOrElse(Try.java:263)
	at org.gradle.api.internal.tasks.execution.ExecuteActionsTaskExecuter.executeIfValid(ExecuteActionsTaskExecuter.java:203)
	at org.gradle.api.internal.tasks.execution.ExecuteActionsTaskExecuter.execute(ExecuteActionsTaskExecuter.java:184)
	at org.gradle.api.internal.tasks.execution.CleanupStaleOutputsExecuter.execute(CleanupStaleOutputsExecuter.java:109)
	at org.gradle.api.internal.tasks.execution.FinalizePropertiesTaskExecuter.execute(FinalizePropertiesTaskExecuter.java:46)
	at org.gradle.api.internal.tasks.execution.ResolveTaskExecutionModeExecuter.execute(ResolveTaskExecutionModeExecuter.java:62)
	at org.gradle.api.internal.tasks.execution.SkipTaskWithNoActionsExecuter.execute(SkipTaskWithNoActionsExecuter.java:57)
	at org.gradle.api.internal.tasks.execution.SkipOnlyIfTaskExecuter.execute(SkipOnlyIfTaskExecuter.java:56)
	at org.gradle.api.internal.tasks.execution.CatchExceptionTaskExecuter.execute(CatchExceptionTaskExecuter.java:36)
	at org.gradle.api.internal.tasks.execution.EventFiringTaskExecuter$1.executeTask(EventFiringTaskExecuter.java:77)
	at org.gradle.api.internal.tasks.execution.EventFiringTaskExecuter$1.call(EventFiringTaskExecuter.java:55)
	at org.gradle.api.internal.tasks.execution.EventFiringTaskExecuter$1.call(EventFiringTaskExecuter.java:52)
	at org.gradle.internal.operations.DefaultBuildOperationExecutor$CallableBuildOperationWorker.execute(DefaultBuildOperationExecutor.java:416)
	at org.gradle.internal.operations.DefaultBuildOperationExecutor$CallableBuildOperationWorker.execute(DefaultBuildOperationExecutor.java:406)
	at org.gradle.internal.operations.DefaultBuildOperationExecutor$1.execute(DefaultBuildOperationExecutor.java:165)
	at org.gradle.internal.operations.DefaultBuildOperationExecutor.execute(DefaultBuildOperationExecutor.java:250)
	at org.gradle.internal.operations.DefaultBuildOperationExecutor.execute(DefaultBuildOperationExecutor.java:158)
	at org.gradle.internal.operations.DefaultBuildOperationExecutor.call(DefaultBuildOperationExecutor.java:102)
	at org.gradle.internal.operations.DelegatingBuildOperationExecutor.call(DelegatingBuildOperationExecutor.java:36)
	at org.gradle.api.internal.tasks.execution.EventFiringTaskExecuter.execute(EventFiringTaskExecuter.java:52)
	at org.gradle.execution.plan.LocalTaskNodeExecutor.execute(LocalTaskNodeExecutor.java:41)
	at org.gradle.execution.taskgraph.DefaultTaskExecutionGraph$InvokeNodeExecutorsAction.execute(DefaultTaskExecutionGraph.java:372)
	at org.gradle.execution.taskgraph.DefaultTaskExecutionGraph$InvokeNodeExecutorsAction.execute(DefaultTaskExecutionGraph.java:359)
	at org.gradle.execution.taskgraph.DefaultTaskExecutionGraph$BuildOperationAwareExecutionAction.execute(DefaultTaskExecutionGraph.java:352)
	at org.gradle.execution.taskgraph.DefaultTaskExecutionGraph$BuildOperationAwareExecutionAction.execute(DefaultTaskExecutionGraph.java:338)
	at org.gradle.execution.plan.DefaultPlanExecutor$ExecutorWorker.lambda$run$0(DefaultPlanExecutor.java:127)
	at org.gradle.execution.plan.DefaultPlanExecutor$ExecutorWorker.execute(DefaultPlanExecutor.java:191)
	at org.gradle.execution.plan.DefaultPlanExecutor$ExecutorWorker.executeNextNode(DefaultPlanExecutor.java:182)
	at org.gradle.execution.plan.DefaultPlanExecutor$ExecutorWorker.run(DefaultPlanExecutor.java:124)
	at org.gradle.internal.concurrent.ExecutorPolicy$CatchAndRecordFailures.onExecute(ExecutorPolicy.java:64)
	at org.gradle.internal.concurrent.ManagedExecutorImpl$1.run(ManagedExecutorImpl.java:48)
	at org.gradle.internal.concurrent.ThreadFactoryImpl$ManagedThreadRunnable.run(ThreadFactoryImpl.java:56)
Caused by: org.gradle.api.GradleException: Failures detected while testing <https://builds.apache.org/job/JMeter%20Ubuntu/ws/bin/testfiles/TestRedirectionPolicies.jmx>:
[unexpected output TestRedirectionPolicies.csv, unexpected output TestRedirectionPolicies.xml]
	at org.apache.jmeter.buildtools.batchtest.BatchTest.exec(BatchTest.kt:184)
	at org.gradle.internal.reflect.JavaMethod.invoke(JavaMethod.java:104)
	at org.gradle.api.internal.project.taskfactory.StandardTaskAction.doExecute(StandardTaskAction.java:49)
	at org.gradle.api.internal.project.taskfactory.StandardTaskAction.execute(StandardTaskAction.java:42)
	at org.gradle.api.internal.project.taskfactory.StandardTaskAction.execute(StandardTaskAction.java:28)
	at org.gradle.api.internal.AbstractTask$TaskActionWrapper.execute(AbstractTask.java:727)
	at org.gradle.api.internal.AbstractTask$TaskActionWrapper.execute(AbstractTask.java:694)
	at org.gradle.api.internal.tasks.execution.ExecuteActionsTaskExecuter$3.run(ExecuteActionsTaskExecuter.java:568)
	at org.gradle.internal.operations.DefaultBuildOperationExecutor$RunnableBuildOperationWorker.execute(DefaultBuildOperationExecutor.java:402)
	at org.gradle.internal.operations.DefaultBuildOperationExecutor$RunnableBuildOperationWorker.execute(DefaultBuildOperationExecutor.java:394)
	at org.gradle.internal.operations.DefaultBuildOperationExecutor$1.execute(DefaultBuildOperationExecutor.java:165)
	at org.gradle.internal.operations.DefaultBuildOperationExecutor.execute(DefaultBuildOperationExecutor.java:250)
	at org.gradle.internal.operations.DefaultBuildOperationExecutor.execute(DefaultBuildOperationExecutor.java:158)
	at org.gradle.internal.operations.DefaultBuildOperationExecutor.run(DefaultBuildOperationExecutor.java:92)
	at org.gradle.internal.operations.DelegatingBuildOperationExecutor.run(DelegatingBuildOperationExecutor.java:31)
	at org.gradle.api.internal.tasks.execution.ExecuteActionsTaskExecuter.executeAction(ExecuteActionsTaskExecuter.java:553)
	at org.gradle.api.internal.tasks.execution.ExecuteActionsTaskExecuter.executeActions(ExecuteActionsTaskExecuter.java:536)
	at org.gradle.api.internal.tasks.execution.ExecuteActionsTaskExecuter.access$300(ExecuteActionsTaskExecuter.java:109)
	at org.gradle.api.internal.tasks.execution.ExecuteActionsTaskExecuter$TaskExecution.executeWithPreviousOutputFiles(ExecuteActionsTaskExecuter.java:276)
	at org.gradle.api.internal.tasks.execution.ExecuteActionsTaskExecuter$TaskExecution.execute(ExecuteActionsTaskExecuter.java:265)
	at org.gradle.internal.execution.steps.ExecuteStep.lambda$execute$1(ExecuteStep.java:33)
	at org.gradle.internal.execution.steps.ExecuteStep.execute(ExecuteStep.java:33)
	at org.gradle.internal.execution.steps.ExecuteStep.execute(ExecuteStep.java:26)
	at org.gradle.internal.execution.steps.CleanupOutputsStep.execute(CleanupOutputsStep.java:63)
	at org.gradle.internal.execution.steps.CleanupOutputsStep.execute(CleanupOutputsStep.java:35)
	at org.gradle.internal.execution.steps.ResolveInputChangesStep.execute(ResolveInputChangesStep.java:49)
	at org.gradle.internal.execution.steps.ResolveInputChangesStep.execute(ResolveInputChangesStep.java:34)
	at org.gradle.internal.execution.steps.CancelExecutionStep.execute(CancelExecutionStep.java:43)
	at org.gradle.internal.execution.steps.TimeoutStep.executeWithoutTimeout(TimeoutStep.java:73)
	at org.gradle.internal.execution.steps.TimeoutStep.execute(TimeoutStep.java:54)
	at org.gradle.internal.execution.steps.CatchExceptionStep.execute(CatchExceptionStep.java:34)
	at org.gradle.internal.execution.steps.CreateOutputsStep.execute(CreateOutputsStep.java:44)
	at org.gradle.internal.execution.steps.SnapshotOutputsStep.execute(SnapshotOutputsStep.java:54)
	at org.gradle.internal.execution.steps.SnapshotOutputsStep.execute(SnapshotOutputsStep.java:38)
	at org.gradle.internal.execution.steps.BroadcastChangingOutputsStep.execute(BroadcastChangingOutputsStep.java:49)
	at org.gradle.internal.execution.steps.CacheStep.executeWithoutCache(CacheStep.java:153)
	at org.gradle.internal.execution.steps.CacheStep.execute(CacheStep.java:67)
	at org.gradle.internal.execution.steps.CacheStep.execute(CacheStep.java:41)
	at org.gradle.internal.execution.steps.StoreExecutionStateStep.execute(StoreExecutionStateStep.java:44)
	at org.gradle.internal.execution.steps.StoreExecutionStateStep.execute(StoreExecutionStateStep.java:33)
	at org.gradle.internal.execution.steps.RecordOutputsStep.execute(RecordOutputsStep.java:38)
	at org.gradle.internal.execution.steps.RecordOutputsStep.execute(RecordOutputsStep.java:24)
	at org.gradle.internal.execution.steps.SkipUpToDateStep.executeBecause(SkipUpToDateStep.java:92)
	at org.gradle.internal.execution.steps.SkipUpToDateStep.lambda$execute$0(SkipUpToDateStep.java:85)
	at org.gradle.internal.execution.steps.SkipUpToDateStep.execute(SkipUpToDateStep.java:55)
	at org.gradle.internal.execution.steps.SkipUpToDateStep.execute(SkipUpToDateStep.java:39)
	at org.gradle.internal.execution.steps.ResolveChangesStep.execute(ResolveChangesStep.java:76)
	at org.gradle.internal.execution.steps.ResolveChangesStep.execute(ResolveChangesStep.java:37)
	at org.gradle.internal.execution.steps.legacy.MarkSnapshottingInputsFinishedStep.execute(MarkSnapshottingInputsFinishedStep.java:36)
	at org.gradle.internal.execution.steps.legacy.MarkSnapshottingInputsFinishedStep.execute(MarkSnapshottingInputsFinishedStep.java:26)
	at org.gradle.internal.execution.steps.ResolveCachingStateStep.execute(ResolveCachingStateStep.java:94)
	at org.gradle.internal.execution.steps.ResolveCachingStateStep.execute(ResolveCachingStateStep.java:49)
	at org.gradle.internal.execution.steps.CaptureStateBeforeExecutionStep.execute(CaptureStateBeforeExecutionStep.java:79)
	at org.gradle.internal.execution.steps.CaptureStateBeforeExecutionStep.execute(CaptureStateBeforeExecutionStep.java:53)
	at org.gradle.internal.execution.steps.ValidateStep.execute(ValidateStep.java:74)
	at org.gradle.internal.execution.steps.SkipEmptyWorkStep.lambda$execute$2(SkipEmptyWorkStep.java:78)
	at org.gradle.internal.execution.steps.SkipEmptyWorkStep.execute(SkipEmptyWorkStep.java:78)
	at org.gradle.internal.execution.steps.SkipEmptyWorkStep.execute(SkipEmptyWorkStep.java:34)
	at org.gradle.internal.execution.steps.legacy.MarkSnapshottingInputsStartedStep.execute(MarkSnapshottingInputsStartedStep.java:39)
	at org.gradle.internal.execution.steps.LoadExecutionStateStep.execute(LoadExecutionStateStep.java:40)
	at org.gradle.internal.execution.steps.LoadExecutionStateStep.execute(LoadExecutionStateStep.java:28)
	at org.gradle.internal.execution.impl.DefaultWorkExecutor.execute(DefaultWorkExecutor.java:33)
	at org.gradle.api.internal.tasks.execution.ExecuteActionsTaskExecuter.executeIfValid(ExecuteActionsTaskExecuter.java:192)
	... 30 more


* Get more help at https://help.gradle.org

Deprecated Gradle features were used in this build, making it incompatible with Gradle 7.0.
Use '--warning-mode all' to show the individual deprecation warnings.
See https://docs.gradle.org/6.1/userguide/command_line_interface.html#sec:command_line_warnings

BUILD FAILED in 9m 0s
263 actionable tasks: 263 executed
Build step 'Invoke Gradle script' changed build result to FAILURE
Build step 'Invoke Gradle script' marked build as failure
[locks-and-latches] Releasing all the locks
[locks-and-latches] All the locks released

Mime
View raw message