jmeter-dev mailing list archives

Site index · List index
Message view « Date » · « Thread »
Top « Date » · « Thread »
From Apache Jenkins Server <jenk...@builds.apache.org>
Subject Build failed in Jenkins: JMeter Windows #1601
Date Tue, 07 Jan 2020 15:20:58 GMT
See <https://builds.apache.org/job/JMeter%20Windows/1601/display/redirect?page=changes>

Changes:

[sitnikov.vladimir] Add Travis CI job to test JMeter with IBM s390x (#550)


------------------------------------------
[...truncated 185.46 KB...]
    user.dir=F:\jenkins\jenkins-slave\workspace\JMeter Windows\src\protocol\http
    user.language=en
    user.region=null
    user.country=US
    user.variant=
    Locale=en_US
    java.class.version=52.0
    java.awt.headless=null
    os.name=Windows Server 2016
    os.version=10.0
    os.arch=amd64

> Task :src:dist-check:checkstyleTest
> Task :src:dist-check:spotbugsTest SKIPPED

> Task :src:dist-check:batchBug50898
Jan 07, 2020 7:19:11 AM java.util.prefs.WindowsPreferences <init>
WARNING: Could not open/create prefs root node Software\JavaSoft\Prefs at root 0x80000002.
Windows RegCreateKeyEx(...) returned error code 5.
Creating summariser <summary>
Created the tree successfully using F:\jenkins\jenkins-slave\workspace\JMeter Windows\bin\testfiles\Bug50898.jmx
Starting standalone test @ Tue Jan 07 07:19:11 PST 2020 (1578410351923)
Waiting for possible Shutdown/StopTestNow/HeapDump/ThreadDump message on port 4445
summary =      2 in 00:00:00 =    6.2/s Avg:    12 Min:     7 Max:    17 Err:     0 (0.00%)
Tidying up ...    @ Tue Jan 07 07:19:12 PST 2020 (1578410352998)
... end of run
No errors present in the logfile F:\jenkins\jenkins-slave\workspace\JMeter Windows\bin\Bug50898.log
(the file is empty)

> Task :src:functions:test

org.apache.jmeter.functions.XPathConcurrencyTest > concurrentRequestsToSameXPath(ReferenceEquality)[2]
[[2] SAME_OBJECTS]: SKIPPED

org.apache.jmeter.functions.XPathConcurrencyTest > concurrentRequestsToSameXPath(ReferenceEquality)[3]
[[3] DIFFERENT_OBJECTS]: SKIPPED

org.apache.jmeter.functions.XPathConcurrencyTest > concurrentRequestsToSameXPath(ReferenceEquality)[4]
[[4] DIFFERENT_OBJECTS]: SKIPPED

org.apache.jmeter.functions.XPathConcurrencyTest > concurrentRequestsToSameXPath(ReferenceEquality)[5]
[[5] SAME_OBJECTS]: SKIPPED

org.apache.jmeter.functions.XPathConcurrencyTest > concurrentRequestsToSameXPath(ReferenceEquality)[6]
[[6] DIFFERENT_OBJECTS]: SKIPPED

> Task :src:functions:check

> Task :src:dist-check:batchBug52968
Jan 07, 2020 7:19:14 AM java.util.prefs.WindowsPreferences <init>
WARNING: Could not open/create prefs root node Software\JavaSoft\Prefs at root 0x80000002.
Windows RegCreateKeyEx(...) returned error code 5.
Creating summariser <summary>
Created the tree successfully using F:\jenkins\jenkins-slave\workspace\JMeter Windows\bin\testfiles\Bug52968.jmx
Starting standalone test @ Tue Jan 07 07:19:14 PST 2020 (1578410354911)
Waiting for possible Shutdown/StopTestNow/HeapDump/ThreadDump message on port 4445
summary =     30 in 00:00:01 =   56.3/s Avg:     5 Min:     4 Max:    13 Err:     9 (30.00%)
Tidying up ...    @ Tue Jan 07 07:19:16 PST 2020 (1578410356174)
... end of run
No errors present in the logfile F:\jenkins\jenkins-slave\workspace\JMeter Windows\bin\Bug52968.log
(the file is empty)

> Task :src:dist-check:batchBug54685
Jan 07, 2020 7:19:18 AM java.util.prefs.WindowsPreferences <init>
WARNING: Could not open/create prefs root node Software\JavaSoft\Prefs at root 0x80000002.
Windows RegCreateKeyEx(...) returned error code 5.
Creating summariser <summary>
Created the tree successfully using F:\jenkins\jenkins-slave\workspace\JMeter Windows\bin\testfiles\Bug54685.jmx
Starting standalone test @ Tue Jan 07 07:19:18 PST 2020 (1578410358419)
Waiting for possible Shutdown/StopTestNow/HeapDump/ThreadDump message on port 4445
summary =      1 in 00:00:00 =    7.5/s Avg:     4 Min:     4 Max:     4 Err:     0 (0.00%)
Tidying up ...    @ Tue Jan 07 07:19:19 PST 2020 (1578410359069)
... end of run
No errors present in the logfile F:\jenkins\jenkins-slave\workspace\JMeter Windows\bin\Bug54685.log
(the file is empty)

> Task :src:protocol:http:test

org.apache.jmeter.protocol.http.control.DnsManagerTest > badDnsInCustomResolverShouldFailHttpSampler(String,
WireMockServer)[2] [[2] Java]: SKIPPED

> Task :src:dist-check:batchBug55375
Jan 07, 2020 7:19:21 AM java.util.prefs.WindowsPreferences <init>
WARNING: Could not open/create prefs root node Software\JavaSoft\Prefs at root 0x80000002.
Windows RegCreateKeyEx(...) returned error code 5.
Creating summariser <summary>
Created the tree successfully using F:\jenkins\jenkins-slave\workspace\JMeter Windows\bin\testfiles\Bug55375.jmx
Starting standalone test @ Tue Jan 07 07:19:21 PST 2020 (1578410361110)
Waiting for possible Shutdown/StopTestNow/HeapDump/ThreadDump message on port 4445
summary =      1 in 00:00:00 =   10.8/s Avg:     5 Min:     5 Max:     5 Err:     0 (0.00%)
Tidying up ...    @ Tue Jan 07 07:19:21 PST 2020 (1578410361758)
... end of run
No errors present in the logfile F:\jenkins\jenkins-slave\workspace\JMeter Windows\bin\Bug55375.log
(the file is empty)

> Task :src:dist-check:batchBug56243
Jan 07, 2020 7:19:23 AM java.util.prefs.WindowsPreferences <init>
WARNING: Could not open/create prefs root node Software\JavaSoft\Prefs at root 0x80000002.
Windows RegCreateKeyEx(...) returned error code 5.
Creating summariser <summary>
Created the tree successfully using F:\jenkins\jenkins-slave\workspace\JMeter Windows\bin\testfiles\Bug56243.jmx
Starting standalone test @ Tue Jan 07 07:19:23 PST 2020 (1578410363741)
Waiting for possible Shutdown/StopTestNow/HeapDump/ThreadDump message on port 4445
summary =      9 in 00:00:00 =   37.8/s Avg:     0 Min:     0 Max:     5 Err:     0 (0.00%)
Tidying up ...    @ Tue Jan 07 07:19:24 PST 2020 (1578410364642)
... end of run
No errors present in the logfile F:\jenkins\jenkins-slave\workspace\JMeter Windows\bin\Bug56243.log
(the file is empty)

> Task :src:protocol:http:test

org.apache.jmeter.protocol.http.sampler.SamplingNamingTest > testBug63364[Run 0: implementation:HttpClient4]:
SKIPPED

org.apache.jmeter.protocol.http.sampler.SamplingNamingTest > testBug63364[Run 1: implementation:Java]:
SKIPPED

> Task :src:dist-check:batchBug56811
Jan 07, 2020 7:19:27 AM java.util.prefs.WindowsPreferences <init>
WARNING: Could not open/create prefs root node Software\JavaSoft\Prefs at root 0x80000002.
Windows RegCreateKeyEx(...) returned error code 5.
Creating summariser <summary>
Created the tree successfully using F:\jenkins\jenkins-slave\workspace\JMeter Windows\bin\testfiles\Bug56811.jmx
Starting standalone test @ Tue Jan 07 07:19:27 PST 2020 (1578410367142)
Waiting for possible Shutdown/StopTestNow/HeapDump/ThreadDump message on port 4445
summary =      9 in 00:00:00 =   19.2/s Avg:     4 Min:     0 Max:     7 Err:     3 (33.33%)
Tidying up ...    @ Tue Jan 07 07:19:28 PST 2020 (1578410368111)
... end of run
No errors present in the logfile F:\jenkins\jenkins-slave\workspace\JMeter Windows\bin\Bug56811.log
(the file is empty)

> Task :src:protocol:http:check

> Task :src:dist-check:batchBug62239
Jan 07, 2020 7:19:30 AM java.util.prefs.WindowsPreferences <init>
WARNING: Could not open/create prefs root node Software\JavaSoft\Prefs at root 0x80000002.
Windows RegCreateKeyEx(...) returned error code 5.
Creating summariser <summary>
Created the tree successfully using F:\jenkins\jenkins-slave\workspace\JMeter Windows\bin\testfiles\Bug62239.jmx
Starting standalone test @ Tue Jan 07 07:19:30 PST 2020 (1578410370672)
Waiting for possible Shutdown/StopTestNow/HeapDump/ThreadDump message on port 4445
summary +      1 in 00:00:00 =    8.8/s Avg:     1 Min:     1 Max:     1 Err:     0 (0.00%)
Active: 1 Started: 1 Finished: 0
summary +    107 in 00:00:00 =  433.2/s Avg:     0 Min:     0 Max:     1 Err:     0 (0.00%)
Active: 0 Started: 6 Finished: 6
summary =    108 in 00:00:00 =  300.0/s Avg:     0 Min:     0 Max:     1 Err:     0 (0.00%)
Tidying up ...    @ Tue Jan 07 07:19:31 PST 2020 (1578410371244)
... end of run
No errors present in the logfile F:\jenkins\jenkins-slave\workspace\JMeter Windows\bin\Bug62239.log
(the file is empty)

> Task :src:dist-check:batchFTP_TESTS
Jan 07, 2020 7:19:33 AM java.util.prefs.WindowsPreferences <init>
WARNING: Could not open/create prefs root node Software\JavaSoft\Prefs at root 0x80000002.
Windows RegCreateKeyEx(...) returned error code 5.
Creating summariser <summary>
Created the tree successfully using F:\jenkins\jenkins-slave\workspace\JMeter Windows\bin\testfiles\FTP_TESTS.jmx
Starting standalone test @ Tue Jan 07 07:19:33 PST 2020 (1578410373328)
Waiting for possible Shutdown/StopTestNow/HeapDump/ThreadDump message on port 4445
summary +      1 in 00:00:01 =    1.2/s Avg:   824 Min:   824 Max:   824 Err:     0 (0.00%)
Active: 1 Started: 1 Finished: 0
summary +      5 in 00:00:02 =    3.3/s Avg:    37 Min:    18 Max:    79 Err:     0 (0.00%)
Active: 0 Started: 1 Finished: 1
summary =      6 in 00:00:02 =    2.5/s Avg:   168 Min:    18 Max:   824 Err:     0 (0.00%)
Tidying up ...    @ Tue Jan 07 07:19:36 PST 2020 (1578410376561)
... end of run
No errors present in the logfile F:\jenkins\jenkins-slave\workspace\JMeter Windows\bin\FTP_TESTS.log
(the file is empty)

> Task :src:dist-check:batchHTMLParserTestFile_2
Jan 07, 2020 7:19:38 AM java.util.prefs.WindowsPreferences <init>
WARNING: Could not open/create prefs root node Software\JavaSoft\Prefs at root 0x80000002.
Windows RegCreateKeyEx(...) returned error code 5.
Creating summariser <summary>
Created the tree successfully using F:\jenkins\jenkins-slave\workspace\JMeter Windows\bin\testfiles\HTMLParserTestFile_2.jmx
Starting standalone test @ Tue Jan 07 07:19:38 PST 2020 (1578410378449)
Waiting for possible Shutdown/StopTestNow/HeapDump/ThreadDump message on port 4445
summary =      1 in 00:00:00 =    3.6/s Avg:   150 Min:   150 Max:   150 Err:     0 (0.00%)
Tidying up ...    @ Tue Jan 07 07:19:39 PST 2020 (1578410379311)
... end of run
No errors present in the logfile F:\jenkins\jenkins-slave\workspace\JMeter Windows\bin\HTMLParserTestFile_2.log
(the file is empty)

> Task :src:dist-check:batchHttp4ImplDigestAuth
Jan 07, 2020 7:19:41 AM java.util.prefs.WindowsPreferences <init>
WARNING: Could not open/create prefs root node Software\JavaSoft\Prefs at root 0x80000002.
Windows RegCreateKeyEx(...) returned error code 5.
Creating summariser <summary>
Created the tree successfully using F:\jenkins\jenkins-slave\workspace\JMeter Windows\bin\testfiles\Http4ImplDigestAuth.jmx
Starting standalone test @ Tue Jan 07 07:19:41 PST 2020 (1578410381450)
Waiting for possible Shutdown/StopTestNow/HeapDump/ThreadDump message on port 4445
summary =      2 in 00:00:02 =    0.9/s Avg:   817 Min:   266 Max:  1369 Err:     0 (0.00%)
Tidying up ...    @ Tue Jan 07 07:19:44 PST 2020 (1578410384334)
... end of run
No errors present in the logfile F:\jenkins\jenkins-slave\workspace\JMeter Windows\bin\Http4ImplDigestAuth.log
(the file is empty)

> Task :src:dist-check:batchHttp4ImplPreemptiveBasicAuth
Jan 07, 2020 7:19:46 AM java.util.prefs.WindowsPreferences <init>
WARNING: Could not open/create prefs root node Software\JavaSoft\Prefs at root 0x80000002.
Windows RegCreateKeyEx(...) returned error code 5.
Creating summariser <summary>
Created the tree successfully using F:\jenkins\jenkins-slave\workspace\JMeter Windows\bin\testfiles\Http4ImplPreemptiveBasicAuth.jmx
Starting standalone test @ Tue Jan 07 07:19:46 PST 2020 (1578410386470)
Waiting for possible Shutdown/StopTestNow/HeapDump/ThreadDump message on port 4445
summary =     12 in 00:00:06 =    2.1/s Avg:   186 Min:    26 Max:   991 Err:     0 (0.00%)
Tidying up ...    @ Tue Jan 07 07:19:52 PST 2020 (1578410392954)
... end of run
No errors present in the logfile F:\jenkins\jenkins-slave\workspace\JMeter Windows\bin\Http4ImplPreemptiveBasicAuth.log
(the file is empty)

> Task :src:dist-check:batchHttp4ImplPreemptiveBasicAuthJava
Jan 07, 2020 7:19:54 AM java.util.prefs.WindowsPreferences <init>
WARNING: Could not open/create prefs root node Software\JavaSoft\Prefs at root 0x80000002.
Windows RegCreateKeyEx(...) returned error code 5.
Creating summariser <summary>
Created the tree successfully using F:\jenkins\jenkins-slave\workspace\JMeter Windows\bin\testfiles\Http4ImplPreemptiveBasicAuth.jmx
Starting standalone test @ Tue Jan 07 07:19:54 PST 2020 (1578410394913)
Waiting for possible Shutdown/StopTestNow/HeapDump/ThreadDump message on port 4445
summary =     12 in 00:00:47 =    0.3/s Avg:  3674 Min:    25 Max: 21223 Err:     2 (16.67%)
Tidying up ...    @ Tue Jan 07 07:20:42 PST 2020 (1578410442999)
... end of run
ERROR: unexpected output for Http4ImplPreemptiveBasicAuth.csv:
  - expected 866 bytes, F:\jenkins\jenkins-slave\workspace\JMeter Windows\bin\testfiles\Http4ImplPreemptiveBasicAuth.csv
  + actual 1068 bytes, F:\jenkins\jenkins-slave\workspace\JMeter Windows\bin\Http4ImplPreemptiveBasicAuth.csv
@@ -1,8 +1,8 @@
 label,responseCode,responseMessage,threadName,dataType,success
 HTTP-Request-WithNoMatchingAuth,200,OK,Thread Group 1-1,text,true
 HTTP-Request-WithNoMatchingAuth,200,OK,Thread Group 1-1,text,true
-HTTPS-Request-WithNoMatchingAuth,200,OK,Thread Group 2-1,text,true
-HTTPS-Request-WithNoMatchingAuth,200,OK,Thread Group 2-1,text,true
+HTTPS-Request-WithNoMatchingAuth,Non HTTP response code: java.net.ConnectException,Non HTTP
response message: Connection timed out: connect,Thread Group 2-1,text,false
+HTTPS-Request-WithNoMatchingAuth,Non HTTP response code: java.net.ConnectException,Non HTTP
response message: Connection timed out: connect,Thread Group 2-1,text,false
 HTTP-Request-NoAuthManager,200,OK,Thread Group 3-1,text,true
 HTTP-Request-NoAuthManager,200,OK,Thread Group 3-1,text,true
 HTTPS-Request-NoAuthManager,200,OK,Thread Group 4-1,text,true
ERROR: unexpected output for Http4ImplPreemptiveBasicAuth.xml:
  - expected 3253 bytes, F:\jenkins\jenkins-slave\workspace\JMeter Windows\bin\testfiles\Http4ImplPreemptiveBasicAuth.xml
  + actual 3367 bytes, F:\jenkins\jenkins-slave\workspace\JMeter Windows\bin\Http4ImplPreemptiveBasicAuth.xml
@@ -14,14 +14,14 @@
     <error>false</error>
   </assertionResult>
 </httpSample>
-<httpSample s="true" lb="HTTPS-Request-WithNoMatchingAuth" rc="200" rm="OK" tn="Thread
Group 2-1" dt="text">
+<httpSample s="false" lb="HTTPS-Request-WithNoMatchingAuth" rc="Non HTTP response code:
java.net.ConnectException" rm="Non HTTP response message: Connection timed out: connect" tn="Thread
Group 2-1" dt="text">
   <assertionResult>
     <name>JSA_CheckAuthorization</name>
     <failure>false</failure>
     <error>false</error>
   </assertionResult>
 </httpSample>
-<httpSample s="true" lb="HTTPS-Request-WithNoMatchingAuth" rc="200" rm="OK" tn="Thread
Group 2-1" dt="text">
+<httpSample s="false" lb="HTTPS-Request-WithNoMatchingAuth" rc="Non HTTP response code:
java.net.ConnectException" rm="Non HTTP response message: Connection timed out: connect" tn="Thread
Group 2-1" dt="text">
   <assertionResult>
     <name>JSA_CheckAuthorization</name>
     <failure>false</failure>
No errors present in the logfile F:\jenkins\jenkins-slave\workspace\JMeter Windows\bin\Http4ImplPreemptiveBasicAuth.log
(the file is empty)

> Task :src:dist-check:batchHttp4ImplPreemptiveBasicAuthJava FAILED

> Task :src:dist:javadocAggregate
9 warnings
checksum-dependency elapsed time: 14967ms, configurations processed: 239 (add -PchecksumTimingsPrint
to print detailed timings)

FAILURE: Build failed with an exception.

* What went wrong:
Execution failed for task ':src:dist-check:batchHttp4ImplPreemptiveBasicAuthJava'.
> Failures detected while testing F:\jenkins\jenkins-slave\workspace\JMeter Windows\bin\testfiles\Http4ImplPreemptiveBasicAuth.jmx:
[unexpected output Http4ImplPreemptiveBasicAuth.csv, unexpected output Http4ImplPreemptiveBasicAuth.xml]

* Try:
Run with --stacktrace option to get the stack trace. Run with --info or --debug option to
get more log output. Run with --scan to get full insights.

* Get more help at https://help.gradle.org

Deprecated Gradle features were used in this build, making it incompatible with Gradle 7.0.
Use '--warning-mode all' to show the individual deprecation warnings.
See https://docs.gradle.org/6.0.1/userguide/command_line_interface.html#sec:command_line_warnings

BUILD FAILED in 4m 20s
267 actionable tasks: 146 executed, 121 up-to-date
Could not open/create prefs root node Software\JavaSoft\Prefs at root 0x80000002. Windows
RegCreateKeyEx(...) returned error code 5.
Build step 'Invoke Gradle script' changed build result to FAILURE
Build step 'Invoke Gradle script' marked build as failure

Mime
View raw message