jmeter-dev mailing list archives

Site index · List index
Message view « Date » · « Thread »
Top « Date » · « Thread »
From Apache Jenkins Server <jenk...@builds.apache.org>
Subject Build failed in Jenkins: JMeter-trunk #7615
Date Sun, 16 Feb 2020 13:41:12 GMT
See <https://builds.apache.org/job/JMeter-trunk/7615/display/redirect?page=changes>

Changes:

[pmouawad] Correcting client.rmi.localport port allocation description in remote


------------------------------------------
[...truncated 1.89 KB...]
[JMeter-trunk] $ <https://builds.apache.org/job/JMeter-trunk/ws/gradlew> "-Dorg.gradle.jvmargs=-Xmx512m
-XX:MaxMetaspaceSize=512m" -PignoreSpotBugsFailures=true -Pspotbugs=true -PCI=true -Pcoverage=true
--profile cleanTest check assemble sonarqube
To honour the JVM settings for this build a new JVM will be forked. Please consider using
the daemon: https://docs.gradle.org/6.1/userguide/gradle_daemon.html.
Daemon will be stopped at the end of the build stopping after processing
> Task :buildSrc:compileKotlin NO-SOURCE
> Task :buildSrc:compileJava NO-SOURCE
> Task :buildSrc:compileGroovy NO-SOURCE
> Task :buildSrc:pluginDescriptors UP-TO-DATE
> Task :buildSrc:processResources NO-SOURCE
> Task :buildSrc:classes UP-TO-DATE
> Task :buildSrc:inspectClassesForKotlinIC UP-TO-DATE
> Task :buildSrc:jar UP-TO-DATE
> Task :buildSrc:assemble UP-TO-DATE
> Task :buildSrc:autostyleKotlinCheck NO-SOURCE
> Task :buildSrc:batchtest:compileKotlin UP-TO-DATE
> Task :buildSrc:batchtest:compileJava NO-SOURCE
> Task :buildSrc:batchtest:pluginDescriptors UP-TO-DATE
> Task :buildSrc:batchtest:processResources UP-TO-DATE
> Task :buildSrc:batchtest:classes UP-TO-DATE
> Task :buildSrc:batchtest:inspectClassesForKotlinIC UP-TO-DATE
> Task :buildSrc:batchtest:jar UP-TO-DATE
> Task :buildSrc:batchtest:assemble UP-TO-DATE
> Task :buildSrc:autostyleKotlinGradleCheck
> Task :buildSrc:autostyleCheck
> Task :buildSrc:compileTestKotlin NO-SOURCE
> Task :buildSrc:pluginUnderTestMetadata UP-TO-DATE
> Task :buildSrc:compileTestJava NO-SOURCE
> Task :buildSrc:batchtest:autostyleKotlinCheck
> Task :buildSrc:compileTestGroovy NO-SOURCE
> Task :buildSrc:processTestResources NO-SOURCE
> Task :buildSrc:testClasses UP-TO-DATE
> Task :buildSrc:test NO-SOURCE
> Task :buildSrc:validatePlugins UP-TO-DATE
> Task :buildSrc:check
> Task :buildSrc:build
> Task :buildSrc:batchtest:autostyleKotlinGradleCheck
> Task :buildSrc:batchtest:autostyleCheck
> Task :buildSrc:batchtest:compileTestKotlin NO-SOURCE
> Task :buildSrc:batchtest:pluginUnderTestMetadata UP-TO-DATE
> Task :buildSrc:batchtest:compileTestJava NO-SOURCE
> Task :buildSrc:batchtest:processTestResources NO-SOURCE
> Task :buildSrc:batchtest:testClasses UP-TO-DATE
> Task :buildSrc:batchtest:test NO-SOURCE
> Task :buildSrc:batchtest:validatePlugins UP-TO-DATE
> Task :buildSrc:batchtest:check
> Task :buildSrc:batchtest:build
checksum-dependency elapsed time: 2884ms, configurations processed: 21 (add -PchecksumTimingsPrint
to print detailed timings)

See the profiling report at: file://<https://builds.apache.org/job/JMeter-trunk/ws/buildSrc/build/reports/profile/profile-2020-02-16-13-40-48.html>
A fine-grained performance profile is available: use the --scan option.

> Configure project :
Building JMeter 5.3-SNAPSHOT

> Task :cleanTest UP-TO-DATE
> Task :src:config:cleanTest UP-TO-DATE
> Task :src:bshclient:cleanTest UP-TO-DATE
> Task :src:dist:cleanTest UP-TO-DATE
> Task :src:dist-check:cleanTest UP-TO-DATE
> Task :src:examples:cleanTest UP-TO-DATE
> Task :src:generator:cleanTest UP-TO-DATE
> Task :src:launcher:cleanTest UP-TO-DATE
> Task :src:licenses:cleanTest UP-TO-DATE
> Task :src:components:cleanTest
> Task :src:jorphan:cleanTest
> Task :src:core:cleanTest
> Task :src:functions:cleanTest
> Task :src:protocol:cleanTest UP-TO-DATE
> Task :src:testkit:cleanTest UP-TO-DATE
> Task :src:release:cleanTest UP-TO-DATE
> Task :src:testkit-wiremock:cleanTest UP-TO-DATE
> Task :src:protocol:bolt:cleanTest
> Task :src:protocol:ftp:cleanTest
> Task :src:protocol:java:cleanTest
> Task :src:protocol:jdbc:cleanTest
> Task :src:protocol:jms:cleanTest
> Task :src:protocol:junit-sample:cleanTest UP-TO-DATE
> Task :src:protocol:http:cleanTest
> Task :src:protocol:junit:cleanTest
> Task :src:protocol:ldap:cleanTest
> Task :src:protocol:mail:cleanTest
> Task :src:protocol:mongodb:cleanTest
> Task :src:protocol:native:cleanTest
> Task :src:bom:autostyleConfigsCheck NO-SOURCE
> Task :src:protocol:tcp:cleanTest
> Task :src:bshclient:autostyleConfigsCheck NO-SOURCE
> Task :src:config:autostyleConfigsCheck NO-SOURCE
> Task :src:dist:autostyleConfigsCheck NO-SOURCE
> Task :src:dist:autostyleJavaCheck NO-SOURCE
> Task :src:config:autostyleJavaCheck NO-SOURCE
> Task :src:protocol:ftp:processResources NO-SOURCE
> Task :src:protocol:junit:processResources NO-SOURCE
> Task :src:protocol:jms:processResources NO-SOURCE
> Task :src:functions:processResources UP-TO-DATE
> Task :src:protocol:ftp:processTestResources NO-SOURCE
> Task :src:protocol:ldap:processResources NO-SOURCE
> Task :src:protocol:native:processResources NO-SOURCE
> Task :src:protocol:junit:processTestResources NO-SOURCE
> Task :src:protocol:jms:processTestResources NO-SOURCE
> Task :src:protocol:ldap:processTestResources NO-SOURCE
> Task :src:protocol:native:processTestResources NO-SOURCE
> Task :src:generator:processResources NO-SOURCE
> Task :src:protocol:tcp:processResources NO-SOURCE
> Task :src:protocol:mail:processResources UP-TO-DATE
> Task :src:protocol:junit-sample:processResources NO-SOURCE
> Task :src:protocol:bolt:processResources UP-TO-DATE
> Task :src:generator:autostyleConfigsCheck NO-SOURCE
> Task :src:dist-check:autostyleConfigsCheck NO-SOURCE
> Task :src:protocol:tcp:processTestResources NO-SOURCE
> Task :src:protocol:bolt:processTestResources NO-SOURCE
> Task :src:protocol:mail:processTestResources NO-SOURCE
> Task :src:protocol:java:processResources UP-TO-DATE
> Task :src:functions:processTestResources UP-TO-DATE
> Task :src:protocol:http:processResources UP-TO-DATE
> Task :src:protocol:mongodb:processResources UP-TO-DATE
> Task :src:licenses:autostyleConfigsCheck NO-SOURCE
> Task :src:protocol:autostyleConfigsCheck NO-SOURCE
> Task :src:release:autostyleConfigsCheck NO-SOURCE
> Task :src:release:autostyleJavaCheck NO-SOURCE
> Task :src:protocol:java:processTestResources NO-SOURCE
> Task :src:testkit:compileJava UP-TO-DATE
> Task :src:launcher:compileJava UP-TO-DATE
> Task :src:licenses:autostyleJavaCheck NO-SOURCE
> Task :src:protocol:autostyleJavaCheck NO-SOURCE
> Task :src:protocol:mongodb:processTestResources NO-SOURCE
> Task :src:protocol:ftp:autostyleConfigsCheck NO-SOURCE
> Task :src:testkit:processResources NO-SOURCE
> Task :src:testkit:classes UP-TO-DATE
> Task :src:protocol:jdbc:processResources UP-TO-DATE
> Task :src:launcher:processResources UP-TO-DATE
> Task :src:launcher:classes UP-TO-DATE
> Task :src:protocol:jdbc:processTestResources NO-SOURCE
> Task :src:testkit:jar UP-TO-DATE
> Task :src:launcher:jar UP-TO-DATE
> Task :src:launcher:autostyleConfigsCheck NO-SOURCE
> Task :src:testkit:compileTestFixturesJava NO-SOURCE
> Task :src:testkit:processTestFixturesResources NO-SOURCE
> Task :src:testkit:testFixturesClasses UP-TO-DATE
> Task :src:testkit:testFixturesJar UP-TO-DATE
> Task :src:core:versionClass
> Task :src:testkit:autostyleConfigsCheck NO-SOURCE
> Task :src:protocol:http:processTestResources UP-TO-DATE
> Task :src:jorphan:compileJava UP-TO-DATE
> Task :src:jorphan:compileGroovy NO-SOURCE
> Task :src:autostyleConfigsCheck
> Task :src:protocol:bolt:autostyleConfigsCheck
> Task :src:examples:autostyleConfigsCheck
> Task :src:functions:autostyleConfigsCheck
> Task :src:jorphan:processResources UP-TO-DATE
> Task :src:jorphan:classes UP-TO-DATE
> Task :src:protocol:java:autostyleConfigsCheck
> Task :src:jorphan:jar UP-TO-DATE
> Task :src:protocol:bolt:autostyleGroovyCheck
> Task :src:protocol:http:autostyleConfigsCheck
> Task :src:protocol:jdbc:autostyleConfigsCheck
> Task :src:dist-check:autostyleGroovyCheck
> Task :src:functions:autostyleGroovyCheck
> Task :src:protocol:http:autostyleGroovyCheck
> Task :src:protocol:jdbc:autostyleGroovyCheck
> Task :src:testkit-wiremock:compileJava UP-TO-DATE
> Task :src:testkit-wiremock:processResources NO-SOURCE
> Task :src:testkit-wiremock:classes UP-TO-DATE
> Task :src:testkit-wiremock:jar UP-TO-DATE
> Task :src:testkit-wiremock:compileTestFixturesJava NO-SOURCE
> Task :src:testkit-wiremock:processTestFixturesResources NO-SOURCE
> Task :src:testkit-wiremock:testFixturesClasses UP-TO-DATE
> Task :src:testkit-wiremock:testFixturesJar UP-TO-DATE
> Task :src:testkit-wiremock:autostyleConfigsCheck NO-SOURCE
> Task :src:components:autostyleConfigsCheck
> Task :src:core:processResources UP-TO-DATE
> Task :src:jorphan:compileTestJava UP-TO-DATE
> Task :src:jorphan:compileTestGroovy UP-TO-DATE
> Task :src:jorphan:processTestResources NO-SOURCE
> Task :src:jorphan:testClasses UP-TO-DATE
> Task :src:jorphan:testJar UP-TO-DATE
> Task :src:jorphan:autostyleConfigsCheck NO-SOURCE
> Task :src:components:autostyleGroovyCheck
> Task :src:jorphan:autostyleGroovyCheck
> Task :autostyleConfigsCheck FAILED
> Task :src:testkit-wiremock:autostyleJavaCheck
> Task :src:bshclient:autostyleJavaCheck
> Task :src:generator:autostyleJavaCheck
> Task :src:testkit:autostyleJavaCheck
> Task :src:protocol:bolt:autostyleJavaCheck
> Task :src:launcher:autostyleJavaCheck
> Task :src:examples:autostyleJavaCheck
> Task :src:protocol:ftp:autostyleJavaCheck
> Task :src:dist-check:autostyleJavaCheck
> Task :src:protocol:jdbc:autostyleJavaCheck
> Task :src:protocol:java:autostyleJavaCheck
> Task :src:functions:autostyleJavaCheck
> Task :src:jorphan:autostyleJavaCheck
> Task :src:protocol:http:autostyleJavaCheck
> Task :src:config:autostyleKotlinGradleCheck
> Task :src:release:autostyleKotlinGradleCheck
> Task :src:core:compileJava
> Task :src:bom:autostyleKotlinGradleCheck
> Task :src:protocol:autostyleKotlinGradleCheck
> Task :src:autostyleKotlinGradleCheck
> Task :src:licenses:autostyleKotlinGradleCheck
> Task :src:dist:autostyleKotlinGradleCheck
> Task :src:components:autostyleJavaCheck
checksum-dependency elapsed time: 6945ms, configurations processed: 69 (add -PchecksumTimingsPrint
to print detailed timings)

Build jmeter FAILURE reason:                                
    Execution failed for task ':autostyleConfigsCheck':
        See 'What went wrong' below


FAILURE: Build failed with an exception.

* What went wrong:
Execution failed for task ':autostyleConfigsCheck'.
> The following files have format violations:
    xdocs/usermanual/properties_reference.xml
      @@ -333,9 +333,9 @@
       </property>
       <property name="client.rmi.localport">
           Parameter that controls the RMI port used by the <code>RemoteSampleListenerImpl</code>
(The Controller)<br/>
      -����Default�value�is�<code>0</code>,�which�means�port�is�randomly�assigned.�\n
      -����If�this�is�non-zero,�it�will�be�used�as�the�base�for�local�port�numbers�for�the�client�engine.�\n
      -����At�the�moment�JMeter�will�open�up�to�three�ports�beginning�with�the�port�defined�in�this�property.�\n
      +����Default�value�is�<code>0</code>,�which�means�port�is�randomly�assigned.\n
      +����If�this�is�non-zero,�it�will�be�used�as�the�base�for�local�port�numbers�for�the�client�engine.\n
      +����At�the�moment�JMeter�will�open�up�to�three�ports�beginning�with�the�port�defined�in�this�property.\n
           <note>You may need to open corresponding ports in the firewall on the Controller
machine.</note>
           Defaults to: <code>0</code>
       </property>
  Run './gradlew autostyleApply' to fix the violations.

* Try:
Run with --stacktrace option to get the stack trace. Run with --info or --debug option to
get more log output. Run with --scan to get full insights.

* Get more help at https://help.gradle.org

Deprecated Gradle features were used in this build, making it incompatible with Gradle 7.0.
Use '--warning-mode all' to show the individual deprecation warnings.
See https://docs.gradle.org/6.1/userguide/command_line_interface.html#sec:command_line_warnings

BUILD FAILED in 29s
95 actionable tasks: 56 executed, 39 up-to-date

See the profiling report at: file://<https://builds.apache.org/job/JMeter-trunk/ws/build/reports/profile/profile-2020-02-16-13-40-45.html>
A fine-grained performance profile is available: use the --scan option.
Build step 'Invoke Gradle script' changed build result to FAILURE
Build step 'Invoke Gradle script' marked build as failure
Xvfb stopping
Archiving artifacts
Recording test results
ERROR: Step ?Publish JUnit test result report? failed: No test report files were found. Configuration
error?

Mime
View raw message