jmeter-dev mailing list archives

Site index · List index
Message view « Date » · « Thread »
Top « Date » · « Thread »
From Apache Jenkins Server <jenk...@builds.apache.org>
Subject Build failed in Jenkins: JMeter-trunk #7607
Date Wed, 12 Feb 2020 17:17:54 GMT
See <https://builds.apache.org/job/JMeter-trunk/7607/display/redirect?page=changes>

Changes:

[felix.schumacher] Use order property for renderes to select default renderer


------------------------------------------
[...truncated 112.74 KB...]
> Task :src:protocol:junit:compileJava UP-TO-DATE
> Task :src:protocol:junit:classes UP-TO-DATE
> Task :src:protocol:mongodb:compileJava UP-TO-DATE
> Task :src:protocol:mail:compileJava UP-TO-DATE
> Task :src:protocol:mongodb:classes UP-TO-DATE
> Task :src:protocol:mail:classes UP-TO-DATE
> Task :src:protocol:junit:jar UP-TO-DATE
> Task :src:protocol:mongodb:jar UP-TO-DATE
> Task :src:protocol:mail:jar UP-TO-DATE
> Task :src:protocol:ftp:checkstyleMain
> Task :src:protocol:mail:checkstyleMain
> Task :src:protocol:junit-sample:checkstyleMain
> Task :src:protocol:ftp:assemble UP-TO-DATE
> Task :src:protocol:mail:assemble UP-TO-DATE
> Task :src:protocol:junit-sample:assemble UP-TO-DATE
> Task :src:protocol:native:checkstyleMain
> Task :src:protocol:native:assemble UP-TO-DATE
> Task :src:protocol:java:checkstyleMain
> Task :src:protocol:java:assemble UP-TO-DATE
> Task :src:protocol:jms:checkstyleMain
> Task :src:protocol:tcp:checkstyleMain
> Task :src:protocol:junit:checkstyleMain
> Task :src:protocol:mongodb:checkstyleMain
> Task :src:protocol:ldap:checkstyleMain
> Task :src:protocol:jms:assemble UP-TO-DATE
> Task :src:protocol:mongodb:assemble UP-TO-DATE
> Task :src:protocol:ldap:assemble UP-TO-DATE
> Task :src:protocol:tcp:assemble UP-TO-DATE
> Task :src:protocol:junit:assemble UP-TO-DATE

> Task :src:jorphan:test
          3.1sec, org.apache.jorphan.exec.TestKeyToolUtils > testIPBasedCert()
         12.8sec,    3 completed,   0 failed,   0 skipped, org.apache.jorphan.exec.TestKeyToolUtils
WARNING   0.0sec,   10 completed,   0 failed,   2 skipped, org.apache.jorphan.math.TestStatCalculator
          0.1sec,    8 completed,   0 failed,   0 skipped, org.apache.jorphan.util.TestConverter
          0.1sec,   50 completed,   0 failed,   0 skipped, org.apache.jorphan.util.TestJorphanUtils
          0.1sec,    5 completed,   0 failed,   0 skipped, org.apache.jorphan.collections.PackageTest
          0.0sec,    4 completed,   0 failed,   0 skipped, org.apache.jorphan.reflect.TestClassTools
          0.4sec,   37 completed,   0 failed,   0 skipped, org.apache.commons.cli.avalon.ClutilTestCase
          0.8sec,    5 completed,   0 failed,   0 skipped, org.apache.jorphan.gui.MinMaxLongRendererTest
          0.9sec,   16 completed,   0 failed,   0 skipped, org.apache.jorphan.io.TextFileSpec

> Task :src:core:jar
> Task :src:core:compileTestJava UP-TO-DATE
> Task :src:protocol:jdbc:compileJava UP-TO-DATE
> Task :src:protocol:bolt:compileJava UP-TO-DATE
> Task :src:protocol:jdbc:compileGroovy NO-SOURCE
> Task :src:protocol:jdbc:classes UP-TO-DATE
> Task :src:protocol:bolt:compileGroovy NO-SOURCE
> Task :src:protocol:bolt:classes UP-TO-DATE
> Task :src:protocol:jdbc:jar UP-TO-DATE

> Task :src:jorphan:test
          0.3sec,   32 completed,   0 failed,   0 skipped, org.apache.jorphan.util.ConverterSpec
WARNING  20.7sec,  202 completed,   0 failed,   2 skipped, Gradle
Test Run :src:jorphan:test

> Task :src:jorphan:check
> Task :src:jorphan:assemble UP-TO-DATE
> Task :src:protocol:bolt:jar UP-TO-DATE
> Task :src:protocol:bolt:checkstyleMain
> Task :src:protocol:jdbc:checkstyleMain
> Task :src:dist:distTarSource
> Task :src:dist:distTarSourceSha512
> Task :src:core:compileTestGroovy
> Task :src:core:testClasses
> Task :src:core:testJar UP-TO-DATE
> Task :src:core:autostyleKotlinGradleCheck
> Task :src:core:autostyleMarkdownCheck NO-SOURCE
> Task :src:core:autostyleCheck
> Task :src:core:checkstyleMain
> Task :src:core:checkstyleTest
> Task :src:dist:distZipSource
> Task :src:dist:distZipSourceSha512
> Task :src:dist:processSiteXslt FAILED

> Task :src:components:compileJava
Note: Some input files use or override a deprecated API.
Note: Recompile with -Xlint:deprecation for details.
Note: Some input files use unchecked or unsafe operations.
Note: Recompile with -Xlint:unchecked for details.

> Task :src:protocol:junit-sample:spotbugsMain
SpotBugs rule violations were found. See the report at: file://<https://builds.apache.org/job/JMeter-trunk/ws/src/protocol/junit-sample/build/reports/spotbugs/main.xml>

> Task :src:protocol:ftp:spotbugsMain
> Task :src:protocol:java:spotbugsMain
> Task :src:protocol:jms:spotbugsMain
> Task :src:protocol:junit:spotbugsMain
> Task :src:protocol:ldap:spotbugsMain
> Task :src:protocol:mail:spotbugsMain
> Task :src:protocol:mongodb:spotbugsMain
> Task :src:protocol:native:spotbugsMain
> Task :src:protocol:tcp:spotbugsMain
> Task :src:protocol:bolt:spotbugsMain
> Task :src:protocol:jdbc:spotbugsMain

> Task :src:protocol:bolt:spotbugsMain
SpotBugs rule violations were found. See the report at: file://<https://builds.apache.org/job/JMeter-trunk/ws/src/protocol/bolt/build/reports/spotbugs/main.xml>

> Task :src:protocol:mongodb:spotbugsMain
SpotBugs rule violations were found. See the report at: file://<https://builds.apache.org/job/JMeter-trunk/ws/src/protocol/mongodb/build/reports/spotbugs/main.xml>

> Task :src:protocol:jdbc:spotbugsMain
SpotBugs rule violations were found. See the report at: file://<https://builds.apache.org/job/JMeter-trunk/ws/src/protocol/jdbc/build/reports/spotbugs/main.xml>

> Task :src:protocol:native:spotbugsMain
SpotBugs rule violations were found. See the report at: file://<https://builds.apache.org/job/JMeter-trunk/ws/src/protocol/native/build/reports/spotbugs/main.xml>

> Task :src:protocol:ftp:spotbugsMain
SpotBugs rule violations were found. See the report at: file://<https://builds.apache.org/job/JMeter-trunk/ws/src/protocol/ftp/build/reports/spotbugs/main.xml>

> Task :src:protocol:junit:spotbugsMain
SpotBugs rule violations were found. See the report at: file://<https://builds.apache.org/job/JMeter-trunk/ws/src/protocol/junit/build/reports/spotbugs/main.xml>

> Task :src:protocol:tcp:spotbugsMain
SpotBugs rule violations were found. See the report at: file://<https://builds.apache.org/job/JMeter-trunk/ws/src/protocol/tcp/build/reports/spotbugs/main.xml>

> Task :src:core:spotbugsMain

> Task :src:protocol:mail:spotbugsMain
SpotBugs rule violations were found. See the report at: file://<https://builds.apache.org/job/JMeter-trunk/ws/src/protocol/mail/build/reports/spotbugs/main.xml>

> Task :src:protocol:jms:spotbugsMain
SpotBugs rule violations were found. See the report at: file://<https://builds.apache.org/job/JMeter-trunk/ws/src/protocol/jms/build/reports/spotbugs/main.xml>

> Task :src:core:spotbugsMain
SpotBugs rule violations were found. See the report at: file://<https://builds.apache.org/job/JMeter-trunk/ws/src/core/build/reports/spotbugs/main.xml>
checksum-dependency elapsed time: 38623ms, configurations processed: 231
    SHA-512 computation time: 878ms (goes in parallel, it might exceed wall-clock time), files
processed: 45, processed: 7MiB, skipped: 2144MiB
    PGP signature resolution time: 9652ms (wall-clock), resolution requests: 135, signatures
resolved: 211
    PGP key resolution time: 18522ms (wall-clock), resolution requests: 135, download time:
0ms (goes in parallel, it might exceed wall-clock time), keys downloaded: 0
        PGP signature verification time: 19593ms (goes in parallel, it might exceed wall-clock
time), files processed: 489, processed: 580MiB, skipped: 1546MiB

Build jmeter FAILURE reason:                                
    Execution failed for task ':src:dist:processSiteXslt':
        : javax.xml.transform.TransformerException: javax.xml.transform.TransformerException:
com.sun.org.apache.xml.internal.utils.WrappedRuntimeException: The element type "big" must
be terminated by the matching end-tag "</big>".
            at org.apache.tools.ant.taskdefs.XSLTProcess.handleTransformationError(XSLTProcess.java:1435)
            at org.apache.tools.ant.taskdefs.XSLTProcess.process(XSLTProcess.java:845)
            at org.apache.tools.ant.taskdefs.XSLTProcess.execute(XSLTProcess.java:426)
            at org.apache.tools.ant.UnknownElement.execute(UnknownElement.java:292)
            at org.apache.tools.ant.dispatch.DispatchUtils.execute(DispatchUtils.java:99)
            at org.gradle.api.internal.project.ant.BasicAntBuilder.nodeCompleted(BasicAntBuilder.java:80)
            at org.gradle.api.internal.project.ant.BasicAntBuilder.doInvokeMethod(BasicAntBuilder.java:107)
            at org.gradle.kotlin.dsl.GroovyBuilderScopeForGroovyObject.invoke(GroovyInteroperability.kt:266)
            at org.gradle.kotlin.dsl.GroovyBuilderScope$DefaultImpls.invoke(GroovyInteroperability.kt:245)
            at org.gradle.kotlin.dsl.GroovyBuilderScopeForGroovyObject.invoke(GroovyInteroperability.kt:263)
            at Build_gradle.xslt(build.gradle.kts:334)
            at Build_gradle.xslt$default(build.gradle.kts:324)
            at Build_gradle$processSiteXslt$2$1.execute(build.gradle.kts:353)
            at Build_gradle$processSiteXslt$2$1.execute(build.gradle.kts:22)
            at org.gradle.api.internal.AbstractTask$TaskActionWrapper.execute(AbstractTask.java:727)
            at org.gradle.api.internal.AbstractTask$TaskActionWrapper.execute(AbstractTask.java:694)
            at org.gradle.api.internal.tasks.execution.ExecuteActionsTaskExecuter$3.run(ExecuteActionsTaskExecuter.java:568)
            at org.gradle.internal.operations.DefaultBuildOperationExecutor$RunnableBuildOperationWorker.execute(DefaultBuildOperationExecutor.java:402)
            at org.gradle.internal.operations.DefaultBuildOperationExecutor$RunnableBuildOperationWorker.execute(DefaultBuildOperationExecutor.java:394)
            at org.gradle.internal.operations.DefaultBuildOperationExecutor$1.execute(DefaultBuildOperationExecutor.java:165)
            at org.gradle.internal.operations.DefaultBuildOperationExecutor.execute(DefaultBuildOperationExecutor.java:250)
            at org.gradle.internal.operations.DefaultBuildOperationExecutor.execute(DefaultBuildOperationExecutor.java:158)
            at org.gradle.internal.operations.DefaultBuildOperationExecutor.run(DefaultBuildOperationExecutor.java:92)
            at org.gradle.internal.operations.DelegatingBuildOperationExecutor.run(DelegatingBuildOperationExecutor.java:31)
            at org.gradle.api.internal.tasks.execution.ExecuteActionsTaskExecuter.executeAction(ExecuteActionsTaskExecuter.java:553)
            at org.gradle.api.internal.tasks.execution.ExecuteActionsTaskExecuter.executeActions(ExecuteActionsTaskExecuter.java:536)
            at org.gradle.api.internal.tasks.execution.ExecuteActionsTaskExecuter.access$300(ExecuteActionsTaskExecuter.java:109)
            at org.gradle.api.internal.tasks.execution.ExecuteActionsTaskExecuter$TaskExecution.executeWithPreviousOutputFiles(ExecuteActionsTaskExecuter.java:276)
            at org.gradle.api.internal.tasks.execution.ExecuteActionsTaskExecuter$TaskExecution.execute(ExecuteActionsTaskExecuter.java:265)
            at org.gradle.internal.execution.steps.ExecuteStep.lambda$execute$1(ExecuteStep.java:33)
            at org.gradle.internal.execution.steps.ExecuteStep.execute(ExecuteStep.java:33)
            at org.gradle.internal.execution.steps.ExecuteStep.execute(ExecuteStep.java:26)
            at org.gradle.internal.execution.steps.CleanupOutputsStep.execute(CleanupOutputsStep.java:63)
            at org.gradle.internal.execution.steps.CleanupOutputsStep.execute(CleanupOutputsStep.java:35)
            at org.gradle.internal.execution.steps.ResolveInputChangesStep.execute(ResolveInputChangesStep.java:49)
            at org.gradle.internal.execution.steps.ResolveInputChangesStep.execute(ResolveInputChangesStep.java:34)
            at org.gradle.internal.execution.steps.CancelExecutionStep.execute(CancelExecutionStep.java:43)
            at org.gradle.internal.execution.steps.TimeoutStep.executeWithoutTimeout(TimeoutStep.java:73)
            at org.gradle.internal.execution.steps.TimeoutStep.execute(TimeoutStep.java:54)
            at org.gradle.internal.execution.steps.CatchExceptionStep.execute(CatchExceptionStep.java:34)
            at org.gradle.internal.execution.steps.CreateOutputsStep.execute(CreateOutputsStep.java:44)
            at org.gradle.internal.execution.steps.SnapshotOutputsStep.execute(SnapshotOutputsStep.java:54)
            at org.gradle.internal.execution.steps.SnapshotOutputsStep.execute(SnapshotOutputsStep.java:38)
            at org.gradle.internal.execution.steps.BroadcastChangingOutputsStep.execute(BroadcastChangingOutputsStep.java:49)
            at org.gradle.internal.execution.steps.CacheStep.executeWithoutCache(CacheStep.java:153)
            at org.gradle.internal.execution.steps.CacheStep.execute(CacheStep.java:67)
            at org.gradle.internal.execution.steps.CacheStep.execute(CacheStep.java:41)
            at org.gradle.internal.execution.steps.StoreExecutionStateStep.execute(StoreExecutionStateStep.java:44)
            at org.gradle.internal.execution.steps.StoreExecutionStateStep.execute(StoreExecutionStateStep.java:33)
            at org.gradle.internal.execution.steps.RecordOutputsStep.execute(RecordOutputsStep.java:38)
            at org.gradle.internal.execution.steps.RecordOutputsStep.execute(RecordOutputsStep.java:24)
            at org.gradle.internal.execution.steps.SkipUpToDateStep.executeBecause(SkipUpToDateStep.java:92)
            at org.gradle.internal.execution.steps.SkipUpToDateStep.lambda$execute$0(SkipUpToDateStep.java:85)
            at org.gradle.internal.execution.steps.SkipUpToDateStep.execute(SkipUpToDateStep.java:55)
            at org.gradle.internal.execution.steps.SkipUpToDateStep.execute(SkipUpToDateStep.java:39)
            at org.gradle.internal.execution.steps.ResolveChangesStep.execute(ResolveChangesStep.java:76)
            at org.gradle.internal.execution.steps.ResolveChangesStep.execute(ResolveChangesStep.java:37)
            at org.gradle.internal.execution.steps.legacy.MarkSnapshottingInputsFinishedStep.execute(MarkSnapshottingInputsFinishedStep.java:36)
            at org.gradle.internal.execution.steps.legacy.MarkSnapshottingInputsFinishedStep.execute(MarkSnapshottingInputsFinishedStep.java:26)
            at org.gradle.internal.execution.steps.ResolveCachingStateStep.execute(ResolveCachingStateStep.java:94)
            at org.gradle.internal.execution.steps.ResolveCachingStateStep.execute(ResolveCachingStateStep.java:49)
            at org.gradle.internal.execution.steps.CaptureStateBeforeExecutionStep.execute(CaptureStateBeforeExecutionStep.java:79)
            at org.gradle.internal.execution.steps.CaptureStateBeforeExecutionStep.execute(CaptureStateBeforeExecutionStep.java:53)
            at org.gradle.internal.execution.steps.ValidateStep.execute(ValidateStep.java:74)
            at org.gradle.internal.execution.steps.SkipEmptyWorkStep.lambda$execute$2(SkipEmptyWorkStep.java:78)
            at org.gradle.internal.execution.steps.SkipEmptyWorkStep.execute(SkipEmptyWorkStep.java:78)
            at org.gradle.internal.execution.steps.SkipEmptyWorkStep.execute(SkipEmptyWorkStep.java:34)
            at org.gradle.internal.execution.steps.legacy.MarkSnapshottingInputsStartedStep.execute(MarkSnapshottingInputsStartedStep.java:39)
            at org.gradle.internal.execution.steps.LoadExecutionStateStep.execute(LoadExecutionStateStep.java:40)
            at org.gradle.internal.execution.steps.LoadExecutionStateStep.execute(LoadExecutionStateStep.java:28)
            Caused by: javax.xml.transform.TransformerException: javax.xml.transform.TransformerException:
com.sun.org.apache.xml.internal.utils.WrappedRuntimeException: The element type "big" must
be terminated by the matching end-tag "</big>".
                at com.sun.org.apache.xalan.internal.xsltc.trax.TransformerImpl.transform(TransformerImpl.java:740)
                at com.sun.org.apache.xalan.internal.xsltc.trax.TransformerImpl.transform(TransformerImpl.java:343)
                at org.apache.tools.ant.taskdefs.optional.TraXLiaison.transform(TraXLiaison.java:201)
                at org.apache.tools.ant.taskdefs.XSLTProcess.process(XSLTProcess.java:836)
                ... 68 more
                Caused by: javax.xml.transform.TransformerException: com.sun.org.apache.xml.internal.utils.WrappedRuntimeException:
The element type "big" must be terminated by the matching end-tag "</big>".
                    at com.sun.org.apache.xalan.internal.xsltc.trax.TransformerImpl.getDOM(TransformerImpl.java:570)
                    at com.sun.org.apache.xalan.internal.xsltc.trax.TransformerImpl.transform(TransformerImpl.java:730)
                    ... 71 more
                    Caused by: com.sun.org.apache.xml.internal.utils.WrappedRuntimeException:
The element type "big" must be terminated by the matching end-tag "</big>".
                        at com.sun.org.apache.xalan.internal.xsltc.dom.XSLTCDTMManager.getDTM(XSLTCDTMManager.java:427)
                        at com.sun.org.apache.xalan.internal.xsltc.dom.XSLTCDTMManager.getDTM(XSLTCDTMManager.java:215)
                        at com.sun.org.apache.xalan.internal.xsltc.trax.TransformerImpl.getDOM(TransformerImpl.java:548)
                        ... 72 more


FAILURE: Build failed with an exception.

* What went wrong:
Execution failed for task ':src:dist:processSiteXslt'.
> javax.xml.transform.TransformerException: javax.xml.transform.TransformerException: com.sun.org.apache.xml.internal.utils.WrappedRuntimeException:
The element type "big" must be terminated by the matching end-tag "</big>".

* Try:
Run with --stacktrace option to get the stack trace. Run with --info or --debug option to
get more log output. Run with --scan to get full insights.

* Get more help at https://help.gradle.org

Deprecated Gradle features were used in this build, making it incompatible with Gradle 7.0.
Use '--warning-mode all' to show the individual deprecation warnings.
See https://docs.gradle.org/6.1/userguide/command_line_interface.html#sec:command_line_warnings

BUILD FAILED in 2m 27s
215 actionable tasks: 107 executed, 108 up-to-date

See the profiling report at: file://<https://builds.apache.org/job/JMeter-trunk/ws/build/reports/profile/profile-2020-02-12-17-15-18.html>
A fine-grained performance profile is available: use the --scan option.
Build step 'Invoke Gradle script' changed build result to FAILURE
Build step 'Invoke Gradle script' marked build as failure
Xvfb stopping
Archiving artifacts
[Fast Archiver] Compressed 32.91 MB of artifacts by 51.4% relative to #7601
Recording test results

Mime
View raw message