jmeter-dev mailing list archives

Site index · List index
Message view « Date » · « Thread »
Top « Date » · « Thread »
From Apache Jenkins Server <jenk...@builds.apache.org>
Subject Build failed in Jenkins: JMeter-trunk #7610
Date Thu, 13 Feb 2020 07:39:02 GMT
See <https://builds.apache.org/job/JMeter-trunk/7610/display/redirect?page=changes>

Changes:

[felix.schumacher] markup correction. I Should use xmllint before committing.


------------------------------------------
[...truncated 188.21 KB...]
    java.util.concurrent.ForkJoinTask#get at line:1001
    org.junit.platform.engine.support.hierarchical.HierarchicalTestEngine#execute at line:51
    org.junit.platform.launcher.core.DefaultLauncher#execute at line:220
    org.junit.platform.launcher.core.DefaultLauncher#lambda$execute$6 at line:188
    org.junit.platform.launcher.core.DefaultLauncher$$Lambda$165/552747597#accept
    org.junit.platform.launcher.core.DefaultLauncher#withInterceptedStreams at line:202
    org.junit.platform.launcher.core.DefaultLauncher#execute at line:181
    org.junit.platform.launcher.core.DefaultLauncher#execute at line:128
    org.gradle.api.internal.tasks.testing.junitplatform.JUnitPlatformTestClassProcessor$CollectAllTestClassesExecutor#processAllTestClasses
at line:99
    org.gradle.api.internal.tasks.testing.junitplatform.JUnitPlatformTestClassProcessor$CollectAllTestClassesExecutor#access$000
at line:79
    org.gradle.api.internal.tasks.testing.junitplatform.JUnitPlatformTestClassProcessor#stop
at line:75
    org.gradle.api.internal.tasks.testing.SuiteTestClassProcessor#stop at line:61
    sun.reflect.NativeMethodAccessorImpl#invoke0
    sun.reflect.NativeMethodAccessorImpl#invoke at line:62
    sun.reflect.DelegatingMethodAccessorImpl#invoke at line:43
    java.lang.reflect.Method#invoke at line:498
    org.gradle.internal.dispatch.ReflectionDispatch#dispatch at line:36
    org.gradle.internal.dispatch.ReflectionDispatch#dispatch at line:24
    org.gradle.internal.dispatch.ContextClassLoaderDispatch#dispatch at line:33
    org.gradle.internal.dispatch.ProxyDispatchAdapter$DispatchingInvocationHandler#invoke
at line:94
    com.sun.proxy.$Proxy2#stop
    org.gradle.api.internal.tasks.testing.worker.TestWorker#stop at line:132
    sun.reflect.NativeMethodAccessorImpl#invoke0
    sun.reflect.NativeMethodAccessorImpl#invoke at line:62
    sun.reflect.DelegatingMethodAccessorImpl#invoke at line:43
    java.lang.reflect.Method#invoke at line:498
    org.gradle.internal.dispatch.ReflectionDispatch#dispatch at line:36
    org.gradle.internal.dispatch.ReflectionDispatch#dispatch at line:24
    org.gradle.internal.remote.internal.hub.MessageHubBackedObjectConnection$DispatchWrapper#dispatch
at line:182
    org.gradle.internal.remote.internal.hub.MessageHubBackedObjectConnection$DispatchWrapper#dispatch
at line:164
    org.gradle.internal.remote.internal.hub.MessageHub$Handler#run at line:412
    org.gradle.internal.concurrent.ExecutorPolicy$CatchAndRecordFailures#onExecute at line:64
    org.gradle.internal.concurrent.ManagedExecutorImpl$1#run at line:48
    java.util.concurrent.ThreadPoolExecutor#runWorker at line:1149
    java.util.concurrent.ThreadPoolExecutor$Worker#run at line:624
    org.gradle.internal.concurrent.ThreadFactoryImpl$ManagedThreadRunnable#run at line:56
    java.lang.Thread#run at line:748

    Thread[main,5,main], stackTrace:sun.misc.Unsafe#park
    java.util.concurrent.locks.LockSupport#park at line:175
    java.util.concurrent.locks.AbstractQueuedSynchronizer#parkAndCheckInterrupt at line:836
    java.util.concurrent.locks.AbstractQueuedSynchronizer#doAcquireSharedInterruptibly at
line:997
    java.util.concurrent.locks.AbstractQueuedSynchronizer#acquireSharedInterruptibly at line:1304
    java.util.concurrent.CountDownLatch#await at line:231
    org.gradle.api.internal.tasks.testing.worker.TestWorker#execute at line:72
    org.gradle.api.internal.tasks.testing.worker.TestWorker#execute at line:46
    org.gradle.process.internal.worker.child.ActionExecutionWorker#execute at line:91
    org.gradle.process.internal.worker.child.ActionExecutionWorker#execute at line:34
    org.gradle.process.internal.worker.child.SystemApplicationClassLoaderWorker#call at line:137
    org.gradle.process.internal.worker.child.SystemApplicationClassLoaderWorker#call at line:69
    worker.org.gradle.process.internal.worker.GradleWorkerMain#run at line:68
    worker.org.gradle.process.internal.worker.GradleWorkerMain#main at line:73

    Thread[/127.0.0.1:58028 to /127.0.0.1:40671 workers Thread 3,5,main], stackTrace:sun.nio.ch.EPollArrayWrapper#epollWait
    sun.nio.ch.EPollArrayWrapper#poll at line:269
    sun.nio.ch.EPollSelectorImpl#doSelect at line:93
    sun.nio.ch.SelectorImpl#lockAndDoSelect at line:86
    sun.nio.ch.SelectorImpl#select at line:97
    sun.nio.ch.SelectorImpl#select at line:101
    org.gradle.internal.remote.internal.inet.SocketConnection$SocketInputStream#read at line:185
    com.esotericsoftware.kryo.io.Input#fill at line:146
    com.esotericsoftware.kryo.io.Input#require at line:178
    com.esotericsoftware.kryo.io.Input#readByte at line:295
    org.gradle.internal.serialize.kryo.KryoBackedDecoder#readByte at line:81
    org.gradle.internal.remote.internal.hub.InterHubMessageSerializer$MessageReader#read at
line:64
    org.gradle.internal.remote.internal.hub.InterHubMessageSerializer$MessageReader#read at
line:52
    org.gradle.internal.remote.internal.inet.SocketConnection#receive at line:81
    org.gradle.internal.remote.internal.hub.MessageHub$ConnectionReceive#run at line:268
    org.gradle.internal.concurrent.ExecutorPolicy$CatchAndRecordFailures#onExecute at line:64
    org.gradle.internal.concurrent.ManagedExecutorImpl$1#run at line:48
    java.util.concurrent.ThreadPoolExecutor#runWorker at line:1149
    java.util.concurrent.ThreadPoolExecutor$Worker#run at line:624
    org.gradle.internal.concurrent.ThreadFactoryImpl$ManagedThreadRunnable#run at line:56
    java.lang.Thread#run at line:748

    Thread[/127.0.0.1:58028 to /127.0.0.1:40671 workers Thread 2,5,main], stackTrace:sun.misc.Unsafe#park
    java.util.concurrent.locks.LockSupport#park at line:175
    java.util.concurrent.locks.AbstractQueuedSynchronizer$ConditionObject#await at line:2039
    org.gradle.internal.remote.internal.hub.queue.EndPointQueue#take at line:49
    org.gradle.internal.remote.internal.hub.MessageHub$ConnectionDispatch#run at line:320
    org.gradle.internal.concurrent.ExecutorPolicy$CatchAndRecordFailures#onExecute at line:64
    org.gradle.internal.concurrent.ManagedExecutorImpl$1#run at line:48
    java.util.concurrent.ThreadPoolExecutor#runWorker at line:1149
    java.util.concurrent.ThreadPoolExecutor$Worker#run at line:624
    org.gradle.internal.concurrent.ThreadFactoryImpl$ManagedThreadRunnable#run at line:56
    java.lang.Thread#run at line:748


PackageTest > checkI18n fr: messages STANDARD_OUT
    Ignoring missing junit_failure_default_code=0001 in org/apache/jmeter/resources/messages_fr.properties
    Ignoring missing aggregate_report_90=90% in org/apache/jmeter/resources/messages_fr.properties
    Ignoring missing junit_error_default_code=9999 in org/apache/jmeter/resources/messages_fr.properties
    Ignoring missing junit_success_default_code=1000 in org/apache/jmeter/resources/messages_fr.properties

> Task :src:dist-check:batchBUG_62847
> Task :src:dist-check:compileTestJava UP-TO-DATE
> Task :src:core:check
> Task :src:core:assemble
> Task :src:dist-check:compileTestGroovy
> Task :src:dist-check:testClasses
> Task :src:dist-check:checkstyleTest
> Task :src:generator:spotbugsMain
> Task :src:generator:spotbugsTest NO-SOURCE
> Task :src:generator:test NO-SOURCE
> Task :src:generator:check
> Task :src:examples:spotbugsMain
> Task :src:examples:spotbugsTest NO-SOURCE
> Task :src:examples:test NO-SOURCE
> Task :src:examples:check

> Task :src:functions:spotbugsMain
SpotBugs rule violations were found. See the report at: file://<https://builds.apache.org/job/JMeter-trunk/ws/src/functions/build/reports/spotbugs/main.xml>

> Task :src:dist:javadocAggregate

> Task :src:dist-check:spotbugsTest
SpotBugs rule violations were found. See the report at: file://<https://builds.apache.org/job/JMeter-trunk/ws/src/dist-check/build/reports/spotbugs/test.xml>

> Task :src:protocol:http:spotbugsMain

> Task :src:functions:spotbugsTest
SpotBugs rule violations were found. See the report at: file://<https://builds.apache.org/job/JMeter-trunk/ws/src/functions/build/reports/spotbugs/test.xml>

> Task :src:functions:test

Gradle Test Executor 51 STANDARD_OUT
    Setting JMeterHome: <https://builds.apache.org/job/JMeter-trunk/ws/src/functions/../../.>
    Initializing Properties: ../.././bin/jmeter.properties
    JMeterVersion=5.3-SNAPSHOT 557aafe
    java.version=1.8.0_191
    java.vm.name=Java HotSpot(TM) 64-Bit Server VM
    java.vendor=Oracle Corporation
    java.home=/usr/local/asfpackages/java/jdk1.8.0_191/jre
    file.encoding=ISO-8859-1
    default encoding=ISO-8859-1
    user.home=/home/jenkins
    user.dir=<https://builds.apache.org/job/JMeter-trunk/ws/src/functions>
    user.language=en
    user.region=null
    user.country=US
    user.variant=
    Locale=en_US
    java.class.version=52.0
    java.awt.headless=null
    os.name=Linux
    os.version=4.15.0-66-generic
    os.arch=amd64

> Task :src:protocol:http:spotbugsMain
SpotBugs rule violations were found. See the report at: file://<https://builds.apache.org/job/JMeter-trunk/ws/src/protocol/http/build/reports/spotbugs/main.xml>

> Task :src:dist-check:batchBatchTestLocal
> Task :src:dist-check:batchBug50898
> Task :src:functions:check
> Task :src:functions:assemble UP-TO-DATE
> Task :src:dist-check:batchBug52968
> Task :src:dist-check:batchBug54685
> Task :src:dist-check:batchBug55375
> Task :src:dist-check:batchBug56243

> Task :src:protocol:http:spotbugsTest
SpotBugs rule violations were found. See the report at: file://<https://builds.apache.org/job/JMeter-trunk/ws/src/protocol/http/build/reports/spotbugs/test.xml>

> Task :src:dist-check:batchBug56811

> Task :src:protocol:http:test

Gradle Test Executor 53 STANDARD_OUT
    Setting JMeterHome: <https://builds.apache.org/job/JMeter-trunk/ws/src/protocol/http/../../../.>
    Initializing Properties: ../../.././bin/jmeter.properties
    JMeterVersion=5.3-SNAPSHOT 557aafe
    java.version=1.8.0_191
    java.vm.name=Java HotSpot(TM) 64-Bit Server VM
    java.vendor=Oracle Corporation
    java.home=/usr/local/asfpackages/java/jdk1.8.0_191/jre
    file.encoding=ISO-8859-1
    default encoding=ISO-8859-1
    user.home=/home/jenkins
    user.dir=<https://builds.apache.org/job/JMeter-trunk/ws/src/protocol/http>
    user.language=en
    user.region=null
    user.country=US
    user.variant=
    Locale=en_US
    java.class.version=52.0
    java.awt.headless=null
    os.name=Linux
    os.version=4.15.0-66-generic
    os.arch=amd64

> Task :src:dist-check:batchBug62239
> Task :src:dist-check:batchFTP_TESTS
> Task :src:dist-check:batchHTMLParserTestFile_2
> Task :src:protocol:http:check
> Task :src:protocol:http:assemble UP-TO-DATE
> Task :src:dist-check:batchHttp4ImplDigestAuth
> Task :src:dist:compileTestJava NO-SOURCE
> Task :src:dist:testClasses UP-TO-DATE
> Task :src:dist:checkstyleTest NO-SOURCE
> Task :src:dist:spotbugsTest NO-SOURCE
> Task :src:dist:test NO-SOURCE
> Task :src:dist:check
> Task :src:dist-check:batchHttp4ImplPreemptiveBasicAuth
> Task :src:dist:distTar
> Task :src:dist:distTarSha512
> Task :src:dist:distZip
> Task :src:dist:distZipSha512
> Task :src:dist:previewSite
> Task :src:dist:assemble
> Task :src:dist-check:batchHttp4ImplPreemptiveBasicAuthJava
> Task :src:dist-check:batchJDBC_TESTS
> Task :src:dist-check:batchJMS_TESTS
> Task :src:dist-check:batchOS_TESTS
> Task :src:dist-check:batchResponseDecompression
> Task :src:dist-check:batchServerBatchTestLocal
> Task :src:dist-check:batchSlowCharsFeatureHttpClient4
> Task :src:dist-check:batchSlowCharsFeatureJava FAILED
checksum-dependency elapsed time: 30581ms, configurations processed: 354
    SHA-512 computation time: 5392ms (goes in parallel, it might exceed wall-clock time),
files processed: 53, processed: 8MiB, skipped: 3547MiB
    PGP signature resolution time: 1818ms (wall-clock), resolution requests: 209, signatures
resolved: 219
    PGP key resolution time: 20976ms (wall-clock), resolution requests: 209, download time:
0ms (goes in parallel, it might exceed wall-clock time), keys downloaded: 0
        PGP signature verification time: 42606ms (goes in parallel, it might exceed wall-clock
time), files processed: 470, processed: 567MiB, skipped: 2948MiB

FAILURE: Build failed with an exception.

* What went wrong:
Execution failed for task ':src:dist-check:batchSlowCharsFeatureJava'.
> Failures detected while testing <https://builds.apache.org/job/JMeter-trunk/ws/bin/testfiles/SlowCharsFeature.jmx>:
[unexpected output SlowCharsFeature_Java.csv, unexpected output SlowCharsFeature_Java.xml]

* Try:
Run with --stacktrace option to get the stack trace. Run with --info or --debug option to
get more log output. Run with --scan to get full insights.

* Get more help at https://help.gradle.org

Deprecated Gradle features were used in this build, making it incompatible with Gradle 7.0.
Use '--warning-mode all' to show the individual deprecation warnings.
See https://docs.gradle.org/6.1/userguide/command_line_interface.html#sec:command_line_warnings

BUILD FAILED in 14m 1s
352 actionable tasks: 200 executed, 152 up-to-date

See the profiling report at: file://<https://builds.apache.org/job/JMeter-trunk/ws/build/reports/profile/profile-2020-02-13-07-24-19.html>
A fine-grained performance profile is available: use the --scan option.
Build step 'Invoke Gradle script' changed build result to FAILURE
Build step 'Invoke Gradle script' marked build as failure
Xvfb stopping
Archiving artifacts
[Fast Archiver] Compressed 154.70 MB of artifacts by 50.6% relative to #7601
Recording test results

Mime
View raw message