jmeter-dev mailing list archives

Site index · List index
Message view « Date » · « Thread »
Top « Date » · « Thread »
From Apache Jenkins Server <jenk...@builds.apache.org>
Subject Build failed in Jenkins: JMeter-trunk #7605
Date Tue, 11 Feb 2020 22:51:42 GMT
See <https://builds.apache.org/job/JMeter-trunk/7605/display/redirect>

Changes:


------------------------------------------
[...truncated 115.03 KB...]
> Task :compileJava NO-SOURCE
> Task :processResources NO-SOURCE
> Task :classes UP-TO-DATE
> Task :checkstyleMain NO-SOURCE
> Task :compileTestJava NO-SOURCE
> Task :src:licenses:renderLicenseForSourceCopySpec
> Task :processTestResources NO-SOURCE
> Task :testClasses UP-TO-DATE
> Task :checkstyleTest NO-SOURCE
> Task :src:components:compileJava UP-TO-DATE
> Task :src:licenses:srcLicenseDir UP-TO-DATE
> Task :src:components:compileGroovy NO-SOURCE
> Task :src:licenses:jar UP-TO-DATE
> Task :src:components:processResources UP-TO-DATE
> Task :src:components:classes UP-TO-DATE
> Task :src:config:jar UP-TO-DATE
> Task :src:config:assemble UP-TO-DATE
> Task :src:components:checkstyleMain UP-TO-DATE
> Task :src:components:processTestResources UP-TO-DATE
> Task :src:examples:compileJava UP-TO-DATE
> Task :src:examples:classes UP-TO-DATE
> Task :src:generator:compileJava UP-TO-DATE
> Task :src:generator:classes UP-TO-DATE
> Task :src:generator:jar UP-TO-DATE
> Task :src:examples:checkstyleMain UP-TO-DATE
> Task :src:examples:compileTestJava NO-SOURCE
> Task :src:examples:testClasses UP-TO-DATE
> Task :src:generator:checkstyleMain UP-TO-DATE
> Task :src:examples:checkstyleTest NO-SOURCE
> Task :src:generator:compileTestJava NO-SOURCE
> Task :src:generator:testClasses UP-TO-DATE
> Task :src:generator:checkstyleTest NO-SOURCE
> Task :src:examples:jar UP-TO-DATE
> Task :src:examples:assemble UP-TO-DATE
> Task :src:generator:assemble UP-TO-DATE
> Task :gitProps
> Task :rat UP-TO-DATE
> Task :spotbugsMain NO-SOURCE
> Task :spotbugsTest NO-SOURCE
> Task :test NO-SOURCE
> Task :check
> Task :jar UP-TO-DATE
> Task :assemble UP-TO-DATE
> Task :src:core:compileTestGroovy
> Task :src:core:processTestResources UP-TO-DATE
> Task :src:core:testClasses
> Task :src:core:testJar UP-TO-DATE
> Task :src:protocol:junit:compileTestJava UP-TO-DATE
> Task :src:protocol:junit:testClasses UP-TO-DATE
> Task :src:protocol:ftp:compileTestJava UP-TO-DATE
> Task :src:protocol:ftp:testClasses UP-TO-DATE
> Task :src:protocol:mongodb:compileTestJava UP-TO-DATE
> Task :src:protocol:mongodb:testClasses UP-TO-DATE
> Task :src:protocol:ftp:testJar UP-TO-DATE
> Task :src:protocol:junit:testJar UP-TO-DATE
> Task :src:protocol:mongodb:testJar UP-TO-DATE
> Task :src:core:autostyleConfigsCheck
> Task :src:core:autostyleGroovyCheck

> Task :src:jorphan:test

ObjectTableModelTest > checkMoveRow_from_5_11_to_0() STANDARD_ERROR
    SLF4J: Failed to load class "org.slf4j.impl.StaticLoggerBinder".
    SLF4J: Defaulting to no-operation (NOP) logger implementation
    SLF4J: See http://www.slf4j.org/codes.html#StaticLoggerBinder for further details.
          0.4sec,    6 completed,   0 failed,   0 skipped, org.apache.jorphan.gui.ObjectTableModelTest
          0.5sec,   26 completed,   0 failed,   0 skipped, org.apache.jorphan.gui.ObjectTableSorterTest

> Task :src:protocol:ftp:checkstyleTest
> Task :src:protocol:mongodb:checkstyleTest
> Task :src:protocol:junit:checkstyleTest
Could not write standard input to Gradle SpotBugs Worker 13.
java.io.IOException: Broken pipe
	at java.io.FileOutputStream.writeBytes(Native Method)
	at java.io.FileOutputStream.write(FileOutputStream.java:326)
	at java.io.BufferedOutputStream.flushBuffer(BufferedOutputStream.java:82)
	at java.io.BufferedOutputStream.flush(BufferedOutputStream.java:140)
	at org.gradle.process.internal.streams.ExecOutputHandleRunner.forwardContent(ExecOutputHandleRunner.java:68)
	at org.gradle.process.internal.streams.ExecOutputHandleRunner.run(ExecOutputHandleRunner.java:53)
	at org.gradle.internal.concurrent.ExecutorPolicy$CatchAndRecordFailures.onExecute(ExecutorPolicy.java:64)
	at org.gradle.internal.concurrent.ManagedExecutorImpl$1.run(ManagedExecutorImpl.java:48)
	at java.util.concurrent.ThreadPoolExecutor.runWorker(ThreadPoolExecutor.java:1149)
	at java.util.concurrent.ThreadPoolExecutor$Worker.run(ThreadPoolExecutor.java:624)
	at org.gradle.internal.concurrent.ThreadFactoryImpl$ManagedThreadRunnable.run(ThreadFactoryImpl.java:56)
	at java.lang.Thread.run(Thread.java:748)
> Task :src:protocol:mongodb:spotbugsTest FAILED
> Task :src:protocol:junit:spotbugsTest FAILED
Could not write standard input to Gradle SpotBugs Worker 15.
java.io.IOException: Stream closed
	at java.lang.ProcessBuilder$NullOutputStream.write(ProcessBuilder.java:433)
	at java.io.OutputStream.write(OutputStream.java:116)
	at java.io.BufferedOutputStream.flushBuffer(BufferedOutputStream.java:82)
	at java.io.BufferedOutputStream.flush(BufferedOutputStream.java:140)
	at org.gradle.process.internal.streams.ExecOutputHandleRunner.forwardContent(ExecOutputHandleRunner.java:68)
	at org.gradle.process.internal.streams.ExecOutputHandleRunner.run(ExecOutputHandleRunner.java:53)
	at org.gradle.internal.concurrent.ExecutorPolicy$CatchAndRecordFailures.onExecute(ExecutorPolicy.java:64)
	at org.gradle.internal.concurrent.ManagedExecutorImpl$1.run(ManagedExecutorImpl.java:48)
	at java.util.concurrent.ThreadPoolExecutor.runWorker(ThreadPoolExecutor.java:1149)
	at java.util.concurrent.ThreadPoolExecutor$Worker.run(ThreadPoolExecutor.java:624)
	at org.gradle.internal.concurrent.ThreadFactoryImpl$ManagedThreadRunnable.run(ThreadFactoryImpl.java:56)
	at java.lang.Thread.run(Thread.java:748)
Could not write standard input to Gradle SpotBugs Worker 14.
java.io.IOException: Broken pipe
	at java.io.FileOutputStream.writeBytes(Native Method)
	at java.io.FileOutputStream.write(FileOutputStream.java:326)
	at java.io.BufferedOutputStream.flushBuffer(BufferedOutputStream.java:82)
	at java.io.BufferedOutputStream.flush(BufferedOutputStream.java:140)
	at org.gradle.process.internal.streams.ExecOutputHandleRunner.forwardContent(ExecOutputHandleRunner.java:68)
	at org.gradle.process.internal.streams.ExecOutputHandleRunner.run(ExecOutputHandleRunner.java:53)
	at org.gradle.internal.concurrent.ExecutorPolicy$CatchAndRecordFailures.onExecute(ExecutorPolicy.java:64)
	at org.gradle.internal.concurrent.ManagedExecutorImpl$1.run(ManagedExecutorImpl.java:48)
	at java.util.concurrent.ThreadPoolExecutor.runWorker(ThreadPoolExecutor.java:1149)
	at java.util.concurrent.ThreadPoolExecutor$Worker.run(ThreadPoolExecutor.java:624)
	at org.gradle.internal.concurrent.ThreadFactoryImpl$ManagedThreadRunnable.run(ThreadFactoryImpl.java:56)
	at java.lang.Thread.run(Thread.java:748)
> Task :src:protocol:ftp:spotbugsTest FAILED
> Task :src:core:autostyleJavaCheck

> Task :src:jorphan:test
          1.1sec,   32 completed,   0 failed,   0 skipped, org.apache.jorphan.util.ConverterSpec
FAILURE  15.1sec,  200 completed,   1 failed,   2 skipped,
Gradle Test Run :src:jorphan:test

200 tests completed, 1 failed, 2 skipped

> Task :src:jorphan:test FAILED
> Task :src:dist:distTarSource

> Task :src:protocol:bolt:spotbugsMain
SpotBugs rule violations were found. See the report at: file://<https://builds.apache.org/job/JMeter-trunk/ws/src/protocol/bolt/build/reports/spotbugs/main.xml>

> Task :src:protocol:junit-sample:spotbugsMain
SpotBugs rule violations were found. See the report at: file://<https://builds.apache.org/job/JMeter-trunk/ws/src/protocol/junit-sample/build/reports/spotbugs/main.xml>

> Task :src:protocol:jdbc:spotbugsMain
> Task :src:protocol:java:spotbugsMain
> Task :src:protocol:jms:spotbugsMain
> Task :src:protocol:native:spotbugsMain
> Task :src:protocol:ldap:spotbugsMain
> Task :src:protocol:mail:spotbugsMain
> Task :src:protocol:tcp:spotbugsMain

> Task :src:protocol:jdbc:spotbugsMain
SpotBugs rule violations were found. See the report at: file://<https://builds.apache.org/job/JMeter-trunk/ws/src/protocol/jdbc/build/reports/spotbugs/main.xml>

> Task :src:components:spotbugsMain

> Task :src:protocol:native:spotbugsMain
SpotBugs rule violations were found. See the report at: file://<https://builds.apache.org/job/JMeter-trunk/ws/src/protocol/native/build/reports/spotbugs/main.xml>

> Task :src:protocol:tcp:spotbugsMain
SpotBugs rule violations were found. See the report at: file://<https://builds.apache.org/job/JMeter-trunk/ws/src/protocol/tcp/build/reports/spotbugs/main.xml>

> Task :src:protocol:jms:spotbugsMain
SpotBugs rule violations were found. See the report at: file://<https://builds.apache.org/job/JMeter-trunk/ws/src/protocol/jms/build/reports/spotbugs/main.xml>

> Task :src:protocol:mail:spotbugsMain
SpotBugs rule violations were found. See the report at: file://<https://builds.apache.org/job/JMeter-trunk/ws/src/protocol/mail/build/reports/spotbugs/main.xml>

> Task :src:components:spotbugsMain
The following classes needed for analysis were missing:
  org.bouncycastle.asn1.x500.style.BCStyle
  org.bouncycastle.asn1.ASN1ObjectIdentifier
  org.bouncycastle.asn1.ASN1Encodable
  org.bouncycastle.asn1.x509.Extension
  org.bouncycastle.operator.DigestCalculatorProvider
  org.bouncycastle.util.Selector
  org.bouncycastle.cert.X509CertificateHolder
  org.bouncycastle.cms.SignerInformationVerifier
  org.bouncycastle.mail.smime.SMIMESignedParser
  org.bouncycastle.operator.bc.BcDigestCalculatorProvider
  org.bouncycastle.cms.CMSException
  org.bouncycastle.mail.smime.SMIMEException
  org.bouncycastle.cms.SignerInformationStore
  org.bouncycastle.cms.SignerInformation
  org.bouncycastle.util.Store
  org.bouncycastle.cms.jcajce.JcaSimpleSignerInfoVerifierBuilder
  org.bouncycastle.asn1.x500.X500Name
  org.bouncycastle.cert.jcajce.JcaX509CertificateHolder
  org.bouncycastle.asn1.x500.RDN
  org.bouncycastle.asn1.x500.AttributeTypeAndValue
  org.bouncycastle.asn1.x500.style.IETFUtils
  org.bouncycastle.asn1.x509.GeneralNames
  org.bouncycastle.asn1.x509.GeneralName
  org.bouncycastle.jce.provider.BouncyCastleProvider
  org.bouncycastle.operator.OperatorCreationException
SpotBugs rule violations were found. See the report at: file://<https://builds.apache.org/job/JMeter-trunk/ws/src/components/build/reports/spotbugs/main.xml>
checksum-dependency elapsed time: 12235ms, configurations processed: 244 (add -PchecksumTimingsPrint
to print detailed timings)

FAILURE: Build completed with 4 failures.

1: Task failed with an exception.
-----------
* What went wrong:
Execution failed for task ':src:protocol:mongodb:spotbugsTest'.
> Failed to run Gradle SpotBugs Worker
   > Process 'Gradle SpotBugs Worker 13' finished with non-zero exit value 1

* Try:
Run with --stacktrace option to get the stack trace. Run with --info or --debug option to
get more log output. Run with --scan to get full insights.
==============================================================================

2: Task failed with an exception.
-----------
* What went wrong:
Execution failed for task ':src:protocol:junit:spotbugsTest'.
> Failed to run Gradle SpotBugs Worker
   > A problem occurred waiting for process 'Gradle SpotBugs Worker 15' to complete.

* Try:
Run with --stacktrace option to get the stack trace. Run with --info or --debug option to
get more log output. Run with --scan to get full insights.
==============================================================================

3: Task failed with an exception.
-----------
* What went wrong:
Execution failed for task ':src:protocol:ftp:spotbugsTest'.
> Failed to run Gradle SpotBugs Worker
   > Process 'Gradle SpotBugs Worker 14' finished with non-zero exit value 1

* Try:
Run with --stacktrace option to get the stack trace. Run with --info or --debug option to
get more log output. Run with --scan to get full insights.
==============================================================================

4: Task failed with an exception.
-----------
* What went wrong:
Execution failed for task ':src:jorphan:test'.
> There were failing tests. See the report at: file://<https://builds.apache.org/job/JMeter-trunk/ws/src/jorphan/build/reports/tests/test/index.html>

* Try:
Run with --stacktrace option to get the stack trace. Run with --info or --debug option to
get more log output. Run with --scan to get full insights.
==============================================================================

* Get more help at https://help.gradle.org

Deprecated Gradle features were used in this build, making it incompatible with Gradle 7.0.
Use '--warning-mode all' to show the individual deprecation warnings.
See https://docs.gradle.org/6.1/userguide/command_line_interface.html#sec:command_line_warnings

BUILD FAILED in 1m 29s
228 actionable tasks: 85 executed, 143 up-to-date

See the profiling report at: file://<https://builds.apache.org/job/JMeter-trunk/ws/build/reports/profile/profile-2020-02-11-22-49-59.html>
A fine-grained performance profile is available: use the --scan option.
Build step 'Invoke Gradle script' changed build result to FAILURE
Build step 'Invoke Gradle script' marked build as failure
Xvfb stopping
Archiving artifacts
Recording test results

Mime
View raw message