jmeter-dev mailing list archives

Site index · List index
Message view « Date » · « Thread »
Top « Date » · « Thread »
From Apache Jenkins Server <jenk...@builds.apache.org>
Subject Build failed in Jenkins: JMeter Windows #1623
Date Wed, 19 Feb 2020 21:06:12 GMT
See <https://builds.apache.org/job/JMeter%20Windows/1623/display/redirect?page=changes>

Changes:

[felix.schumacher] Add redirection to https via .htaccess for the source of the site

[felix.schumacher] Found a nicer way to forward to https on another via .htaccess


------------------------------------------
[...truncated 103.33 KB...]
> Task :src:protocol:jdbc:autostyleCheck
> Task :src:functions:jar UP-TO-DATE
> Task :src:protocol:http:compileGroovy NO-SOURCE
> Task :src:dist:compileJava NO-SOURCE
> Task :src:dist:classes UP-TO-DATE
> Task :src:dist:checkstyleMain NO-SOURCE
> Task :src:protocol:http:classes UP-TO-DATE
> Task :src:protocol:http:jar UP-TO-DATE
> Task :src:dist:spotbugsMain SKIPPED
> Task :src:dist:jar UP-TO-DATE
> Task :src:dist-check:compileJava NO-SOURCE
> Task :src:dist-check:compileGroovy NO-SOURCE
> Task :src:dist-check:classes UP-TO-DATE
> Task :src:dist-check:checkstyleMain NO-SOURCE
> Task :src:dist-check:spotbugsMain SKIPPED
> Task :src:protocol:java:checkstyleMain
> Task :src:protocol:junit:checkstyleMain
> Task :src:protocol:java:spotbugsMain SKIPPED
> Task :src:protocol:junit:spotbugsMain SKIPPED
> Task :src:protocol:http:autostyleKotlinGradleCheck NO-SOURCE
> Task :src:protocol:junit-sample:autostyleConfigsCheck NO-SOURCE
> Task :src:protocol:http:autostyleMarkdownCheck NO-SOURCE
> Task :src:protocol:http:autostyleCheck
> Task :src:protocol:junit-sample:autostyleJavaCheck
> Task :src:protocol:junit-sample:autostyleKotlinGradleCheck NO-SOURCE
> Task :src:protocol:junit-sample:autostyleMarkdownCheck NO-SOURCE
> Task :src:protocol:junit-sample:autostyleCheck
> Task :src:protocol:jms:checkstyleMain
> Task :src:protocol:jms:spotbugsMain SKIPPED
> Task :src:functions:checkstyleMain
> Task :src:functions:spotbugsMain SKIPPED
> Task :src:dist:populateLibs
> Task :src:protocol:ldap:autostyleConfigsCheck NO-SOURCE
> Task :src:protocol:mail:autostyleConfigsCheck NO-SOURCE
> Task :src:protocol:jdbc:checkstyleMain
> Task :src:protocol:jdbc:spotbugsMain SKIPPED
> Task :src:protocol:http:checkstyleMain
> Task :src:protocol:http:spotbugsMain SKIPPED
> Task :src:protocol:mongodb:autostyleConfigsCheck
> Task :src:protocol:native:autostyleConfigsCheck NO-SOURCE
> Task :src:protocol:ldap:autostyleJavaCheck
> Task :src:protocol:ldap:autostyleKotlinGradleCheck NO-SOURCE
> Task :src:protocol:ldap:autostyleMarkdownCheck NO-SOURCE
> Task :src:protocol:ldap:autostyleCheck
> Task :src:protocol:mail:autostyleJavaCheck
> Task :src:protocol:mail:autostyleKotlinGradleCheck NO-SOURCE
> Task :src:protocol:native:autostyleJavaCheck
> Task :src:protocol:mail:autostyleMarkdownCheck NO-SOURCE
> Task :src:protocol:mail:autostyleCheck
> Task :src:protocol:native:autostyleKotlinGradleCheck NO-SOURCE
> Task :src:protocol:native:autostyleMarkdownCheck NO-SOURCE
> Task :src:protocol:native:autostyleCheck
> Task :src:protocol:mongodb:autostyleJavaCheck
> Task :src:dist:copyBinLibs UP-TO-DATE
> Task :src:protocol:mongodb:autostyleKotlinGradleCheck NO-SOURCE
> Task :src:protocol:mongodb:autostyleMarkdownCheck NO-SOURCE
> Task :src:protocol:mongodb:autostyleCheck

> Task :src:core:compileTestGroovy
Could not open/create prefs root node Software\JavaSoft\Prefs at root 0x80000002. Windows
RegCreateKeyEx(...) returned error code 5.

> Task :src:core:testClasses
> Task :src:core:testJar UP-TO-DATE
> Task :src:components:compileTestJava UP-TO-DATE
> Task :src:protocol:native:checkstyleMain
> Task :src:protocol:mail:checkstyleMain
> Task :src:protocol:bolt:compileTestJava UP-TO-DATE
> Task :src:protocol:ldap:checkstyleMain
> Task :src:protocol:mongodb:checkstyleMain
> Task :src:protocol:junit-sample:checkstyleMain
> Task :src:protocol:java:compileTestJava UP-TO-DATE
> Task :src:protocol:java:testClasses UP-TO-DATE
> Task :src:core:autostyleConfigsCheck
> Task :src:protocol:java:testJar UP-TO-DATE
> Task :src:protocol:ftp:compileTestJava UP-TO-DATE
> Task :src:protocol:ftp:testClasses UP-TO-DATE
> Task :src:protocol:jdbc:compileTestJava UP-TO-DATE
> Task :src:protocol:ftp:testJar UP-TO-DATE
> Task :src:core:autostyleGroovyCheck
> Task :src:protocol:jms:compileTestJava UP-TO-DATE
> Task :src:protocol:jms:testClasses UP-TO-DATE
> Task :src:protocol:junit:compileTestJava UP-TO-DATE
> Task :src:protocol:junit:testClasses UP-TO-DATE
> Task :src:protocol:jms:testJar UP-TO-DATE
> Task :src:protocol:junit:testJar UP-TO-DATE
> Task :src:protocol:mail:compileTestJava UP-TO-DATE
> Task :src:protocol:mail:testClasses UP-TO-DATE
> Task :src:protocol:mail:testJar UP-TO-DATE
> Task :src:protocol:ldap:compileTestJava UP-TO-DATE
> Task :src:protocol:ldap:testClasses UP-TO-DATE
> Task :src:protocol:ldap:testJar UP-TO-DATE
> Task :src:protocol:mongodb:compileTestJava UP-TO-DATE
> Task :src:protocol:mongodb:testClasses UP-TO-DATE
> Task :src:protocol:mongodb:testJar UP-TO-DATE
> Task :src:protocol:native:compileTestJava UP-TO-DATE
> Task :src:protocol:native:testClasses UP-TO-DATE
> Task :src:protocol:native:testJar UP-TO-DATE

> Task :rat
Warning: org.apache.xerces.jaxp.SAXParserImpl$JAXPSAXParser: Property 'http://www.oracle.com/xml/jaxp/properties/entityExpansionLimit'
is not recognized.
Compiler warnings:
  WARNING:  'org.apache.xerces.jaxp.SAXParserImpl: Property 'http://javax.xml.XMLConstants/property/accessExternalDTD'
is not recognized.'
Warning: org.apache.xerces.parsers.SAXParser: Feature 'http://javax.xml.XMLConstants/feature/secure-processing'
is not recognized.
Warning: org.apache.xerces.parsers.SAXParser: Property 'http://javax.xml.XMLConstants/property/accessExternalDTD'
is not recognized.
Warning: org.apache.xerces.parsers.SAXParser: Property 'http://www.oracle.com/xml/jaxp/properties/entityExpansionLimit'
is not recognized.

> Task :src:protocol:tcp:compileTestJava UP-TO-DATE
> Task :src:protocol:tcp:testClasses UP-TO-DATE
> Task :src:protocol:tcp:testJar UP-TO-DATE
> Task :src:protocol:ftp:checkstyleTest
> Task :src:protocol:ftp:spotbugsTest SKIPPED
> Task :src:protocol:java:checkstyleTest
> Task :src:protocol:java:spotbugsTest SKIPPED

> Task :rat FAILED
Compiler warnings:
  WARNING:  'org.apache.xerces.jaxp.SAXParserImpl: Property 'http://javax.xml.XMLConstants/property/accessExternalDTD'
is not recognized.'
Files with unapproved licenses:
 - F:/jenkins/jenkins-slave/workspace/JMeter Windows/xdocs/.htaccess


> Task :src:components:compileTestGroovy
> Task :src:core:autostyleJavaCheck

> Task :src:protocol:bolt:compileTestGroovy
Could not open/create prefs root node Software\JavaSoft\Prefs at root 0x80000002. Windows
RegCreateKeyEx(...) returned error code 5.

> Task :src:protocol:jdbc:compileTestGroovy
Could not open/create prefs root node Software\JavaSoft\Prefs at root 0x80000002. Windows
RegCreateKeyEx(...) returned error code 5.

> Task :src:protocol:ftp:test
          0.1sec,    1 completed,   0 failed,   0 skipped, org.apache.jmeter.resources.ResourceKeyUsageTestFtp
          2.3sec,    1 completed,   0 failed,   0 skipped, Gradle Test Run :src:protocol:ftp:test

> Task :src:protocol:java:test
          0.1sec,    1 completed,   0 failed,   0 skipped, org.apache.jmeter.resources.ResourceKeyUsageTestJava
          2.3sec,    1 completed,   0 failed,   0 skipped, Gradle Test Run :src:protocol:java:test

> Task :src:dist:copyLibs
checksum-dependency elapsed time: 3908ms, configurations processed: 203 (add -PchecksumTimingsPrint
to print detailed timings)

Build jmeter FAILURE reason:                                
    Execution failed for task ':rat':
        org.gradle.workers.internal.DefaultWorkerExecutor$WorkExecutionException: A failure
occurred while executing org.nosphere.apache.rat.RatWork
            at org.gradle.workers.internal.DefaultWorkerExecutor$WorkItemExecution.waitForCompletion(DefaultWorkerExecutor.java:354)
            at org.gradle.internal.work.DefaultAsyncWorkTracker.waitForItemsAndGatherFailures(DefaultAsyncWorkTracker.java:142)
            at org.gradle.internal.work.DefaultAsyncWorkTracker.waitForItemsAndGatherFailures(DefaultAsyncWorkTracker.java:94)
            at org.gradle.internal.work.DefaultAsyncWorkTracker.waitForAll(DefaultAsyncWorkTracker.java:80)
            at org.gradle.internal.work.DefaultAsyncWorkTracker.waitForCompletion(DefaultAsyncWorkTracker.java:68)
            at org.gradle.api.internal.tasks.execution.ExecuteActionsTaskExecuter$3.run(ExecuteActionsTaskExecuter.java:576)
            at org.gradle.internal.operations.DefaultBuildOperationExecutor$RunnableBuildOperationWorker.execute(DefaultBuildOperationExecutor.java:402)
            at org.gradle.internal.operations.DefaultBuildOperationExecutor$RunnableBuildOperationWorker.execute(DefaultBuildOperationExecutor.java:394)
            at org.gradle.internal.operations.DefaultBuildOperationExecutor$1.execute(DefaultBuildOperationExecutor.java:165)
            at org.gradle.internal.operations.DefaultBuildOperationExecutor.execute(DefaultBuildOperationExecutor.java:250)
            at org.gradle.internal.operations.DefaultBuildOperationExecutor.execute(DefaultBuildOperationExecutor.java:158)
            at org.gradle.internal.operations.DefaultBuildOperationExecutor.run(DefaultBuildOperationExecutor.java:92)
            at org.gradle.internal.operations.DelegatingBuildOperationExecutor.run(DelegatingBuildOperationExecutor.java:31)
            at org.gradle.api.internal.tasks.execution.ExecuteActionsTaskExecuter.executeAction(ExecuteActionsTaskExecuter.java:553)
            at org.gradle.api.internal.tasks.execution.ExecuteActionsTaskExecuter.executeActions(ExecuteActionsTaskExecuter.java:536)
            at org.gradle.api.internal.tasks.execution.ExecuteActionsTaskExecuter.access$300(ExecuteActionsTaskExecuter.java:109)
            at org.gradle.api.internal.tasks.execution.ExecuteActionsTaskExecuter$TaskExecution.executeWithPreviousOutputFiles(ExecuteActionsTaskExecuter.java:276)
            at org.gradle.api.internal.tasks.execution.ExecuteActionsTaskExecuter$TaskExecution.execute(ExecuteActionsTaskExecuter.java:265)
            at org.gradle.internal.execution.steps.ExecuteStep.lambda$execute$1(ExecuteStep.java:33)
            at org.gradle.internal.execution.steps.ExecuteStep.execute(ExecuteStep.java:33)
            at org.gradle.internal.execution.steps.ExecuteStep.execute(ExecuteStep.java:26)
            at org.gradle.internal.execution.steps.CleanupOutputsStep.execute(CleanupOutputsStep.java:63)
            at org.gradle.internal.execution.steps.CleanupOutputsStep.execute(CleanupOutputsStep.java:35)
            at org.gradle.internal.execution.steps.ResolveInputChangesStep.execute(ResolveInputChangesStep.java:49)
            at org.gradle.internal.execution.steps.ResolveInputChangesStep.execute(ResolveInputChangesStep.java:34)
            at org.gradle.internal.execution.steps.CancelExecutionStep.execute(CancelExecutionStep.java:43)
            at org.gradle.internal.execution.steps.TimeoutStep.executeWithoutTimeout(TimeoutStep.java:73)
            at org.gradle.internal.execution.steps.TimeoutStep.execute(TimeoutStep.java:54)
            at org.gradle.internal.execution.steps.CatchExceptionStep.execute(CatchExceptionStep.java:34)
            at org.gradle.internal.execution.steps.CreateOutputsStep.execute(CreateOutputsStep.java:44)
            at org.gradle.internal.execution.steps.SnapshotOutputsStep.execute(SnapshotOutputsStep.java:54)
            at org.gradle.internal.execution.steps.SnapshotOutputsStep.execute(SnapshotOutputsStep.java:38)
            at org.gradle.internal.execution.steps.BroadcastChangingOutputsStep.execute(BroadcastChangingOutputsStep.java:49)
            at org.gradle.internal.execution.steps.CacheStep.executeWithoutCache(CacheStep.java:153)
            at org.gradle.internal.execution.steps.CacheStep.execute(CacheStep.java:67)
            at org.gradle.internal.execution.steps.CacheStep.execute(CacheStep.java:41)
            at org.gradle.internal.execution.steps.StoreExecutionStateStep.execute(StoreExecutionStateStep.java:44)
            at org.gradle.internal.execution.steps.StoreExecutionStateStep.execute(StoreExecutionStateStep.java:33)
            at org.gradle.internal.execution.steps.RecordOutputsStep.execute(RecordOutputsStep.java:38)
            at org.gradle.internal.execution.steps.RecordOutputsStep.execute(RecordOutputsStep.java:24)
            at org.gradle.internal.execution.steps.SkipUpToDateStep.executeBecause(SkipUpToDateStep.java:92)
            at org.gradle.internal.execution.steps.SkipUpToDateStep.lambda$execute$0(SkipUpToDateStep.java:85)
            at org.gradle.internal.execution.steps.SkipUpToDateStep.execute(SkipUpToDateStep.java:55)
            at org.gradle.internal.execution.steps.SkipUpToDateStep.execute(SkipUpToDateStep.java:39)
            at org.gradle.internal.execution.steps.ResolveChangesStep.execute(ResolveChangesStep.java:76)
            at org.gradle.internal.execution.steps.ResolveChangesStep.execute(ResolveChangesStep.java:37)
            at org.gradle.internal.execution.steps.legacy.MarkSnapshottingInputsFinishedStep.execute(MarkSnapshottingInputsFinishedStep.java:36)
            at org.gradle.internal.execution.steps.legacy.MarkSnapshottingInputsFinishedStep.execute(MarkSnapshottingInputsFinishedStep.java:26)
            at org.gradle.internal.execution.steps.ResolveCachingStateStep.execute(ResolveCachingStateStep.java:94)
            at org.gradle.internal.execution.steps.ResolveCachingStateStep.execute(ResolveCachingStateStep.java:49)
            at org.gradle.internal.execution.steps.CaptureStateBeforeExecutionStep.execute(CaptureStateBeforeExecutionStep.java:79)
            at org.gradle.internal.execution.steps.CaptureStateBeforeExecutionStep.execute(CaptureStateBeforeExecutionStep.java:53)
            at org.gradle.internal.execution.steps.ValidateStep.execute(ValidateStep.java:74)
            at org.gradle.internal.execution.steps.SkipEmptyWorkStep.lambda$execute$2(SkipEmptyWorkStep.java:78)
            at org.gradle.internal.execution.steps.SkipEmptyWorkStep.execute(SkipEmptyWorkStep.java:78)
            at org.gradle.internal.execution.steps.SkipEmptyWorkStep.execute(SkipEmptyWorkStep.java:34)
            at org.gradle.internal.execution.steps.legacy.MarkSnapshottingInputsStartedStep.execute(MarkSnapshottingInputsStartedStep.java:39)
            at org.gradle.internal.execution.steps.LoadExecutionStateStep.execute(LoadExecutionStateStep.java:40)
            at org.gradle.internal.execution.steps.LoadExecutionStateStep.execute(LoadExecutionStateStep.java:28)
            Caused by: org.apache.rat.api.RatException: Apache Rat audit failure - 1 unapproved
license
            	See file:///F:/jenkins/jenkins-slave/workspace/JMeter%20Windows/build/reports/rat/index.html
                at org.nosphere.apache.rat.RatWork.run(RatWork.kt:85)
                at org.gradle.workers.internal.AdapterWorkAction.execute(AdapterWorkAction.java:50)
                at org.gradle.workers.internal.DefaultWorkerServer.execute(DefaultWorkerServer.java:50)
                at org.gradle.workers.internal.AbstractClassLoaderWorker$1.create(AbstractClassLoaderWorker.java:47)
                at org.gradle.workers.internal.AbstractClassLoaderWorker$1.create(AbstractClassLoaderWorker.java:37)
                at org.gradle.internal.classloader.ClassLoaderUtils.executeInClassloader(ClassLoaderUtils.java:98)
                at org.gradle.workers.internal.AbstractClassLoaderWorker.executeInClassLoader(AbstractClassLoaderWorker.java:37)
                at org.gradle.workers.internal.IsolatedClassloaderWorker.execute(IsolatedClassloaderWorker.java:49)
                at org.gradle.workers.internal.WorkerDaemonServer.execute(WorkerDaemonServer.java:84)
                at org.gradle.process.internal.worker.request.WorkerAction$1.call(WorkerAction.java:129)
                at org.gradle.process.internal.worker.child.WorkerLogEventListener.withWorkerLoggingProtocol(WorkerLogEventListener.java:41)
                at org.gradle.process.internal.worker.request.WorkerAction.run(WorkerAction.java:126)
                at org.gradle.internal.dispatch.ReflectionDispatch.dispatch(ReflectionDispatch.java:36)
                at org.gradle.internal.dispatch.ReflectionDispatch.dispatch(ReflectionDispatch.java:24)
                at org.gradle.internal.remote.internal.hub.MessageHubBackedObjectConnection$DispatchWrapper.dispatch(MessageHubBackedObjectConnection.java:182)
                at org.gradle.internal.remote.internal.hub.MessageHubBackedObjectConnection$DispatchWrapper.dispatch(MessageHubBackedObjectConnection.java:164)
                at org.gradle.internal.remote.internal.hub.MessageHub$Handler.run(MessageHub.java:412)
                at org.gradle.internal.concurrent.ExecutorPolicy$CatchAndRecordFailures.onExecute(ExecutorPolicy.java:64)
                at org.gradle.internal.concurrent.ManagedExecutorImpl$1.run(ManagedExecutorImpl.java:48)
                at org.gradle.internal.concurrent.ThreadFactoryImpl$ManagedThreadRunnable.run(ThreadFactoryImpl.java:56)


FAILURE: Build failed with an exception.

* What went wrong:
Execution failed for task ':rat'.
> A failure occurred while executing org.nosphere.apache.rat.RatWork
   > Apache Rat audit failure - 1 unapproved license
     	See file:///F:/jenkins/jenkins-slave/workspace/JMeter%20Windows/build/reports/rat/index.html

* Try:
Run with --stacktrace option to get the stack trace. Run with --info or --debug option to
get more log output. Run with --scan to get full insights.

* Get more help at https://help.gradle.org

Deprecated Gradle features were used in this build, making it incompatible with Gradle 7.0.
Use '--warning-mode all' to show the individual deprecation warnings.
See https://docs.gradle.org/6.1/userguide/command_line_interface.html#sec:command_line_warnings

BUILD FAILED in 55s
190 actionable tasks: 93 executed, 97 up-to-date
Could not open/create prefs root node Software\JavaSoft\Prefs at root 0x80000002. Windows
RegCreateKeyEx(...) returned error code 5.
Build step 'Invoke Gradle script' changed build result to FAILURE
Build step 'Invoke Gradle script' marked build as failure

Mime
View raw message