jmeter-dev mailing list archives

Site index · List index
Message view « Date » · « Thread »
Top « Date » · « Thread »
From Apache Jenkins Server <jenk...@builds.apache.org>
Subject Build failed in Jenkins: JMeter-trunk #7627
Date Sun, 16 Feb 2020 20:25:00 GMT
See <https://builds.apache.org/job/JMeter-trunk/7627/display/redirect?page=changes>

Changes:

[felix.schumacher] Updated hsqldb to 2.5.0 (from 2.4.1)

[felix.schumacher] Updated hamcrest to 2.2 (from 2.1)


------------------------------------------
[...truncated 181.61 KB...]
    Ignoring missing junit_success_default_code=1000 in org/apache/jmeter/resources/messages_fr.properties

HtmlReportGUISpec > test HtmlReportUI initialization STANDARD_OUT
    The JVM should have exited but did not.
    The following non-daemon threads are still running (DestroyJavaVM is OK):
    Thread[AWT-EventQueue-0,6,main], stackTrace:sun.misc.Unsafe#park
    java.util.concurrent.locks.LockSupport#park at line:175
    java.util.concurrent.locks.AbstractQueuedSynchronizer$ConditionObject#await at line:2039
    java.awt.EventQueue#getNextEvent at line:554
    java.awt.EventDispatchThread#pumpOneEventForFilters at line:187
    java.awt.EventDispatchThread#pumpEventsForFilter at line:116
    java.awt.EventDispatchThread#pumpEventsForHierarchy at line:105
    java.awt.EventDispatchThread#pumpEvents at line:101
    java.awt.EventDispatchThread#pumpEvents at line:93
    java.awt.EventDispatchThread#run at line:82

    Thread[/127.0.0.1:56832 to /127.0.0.1:34827 workers Thread 2,5,main], stackTrace:sun.nio.ch.FileDispatcherImpl#write0
    sun.nio.ch.SocketDispatcher#write at line:47
    sun.nio.ch.IOUtil#writeFromNativeBuffer at line:93
    sun.nio.ch.IOUtil#write at line:51
    sun.nio.ch.SocketChannelImpl#write at line:471
    org.gradle.internal.remote.internal.inet.SocketConnection$SocketOutputStream#writeWithNonBlockingRetry
at line:279
    org.gradle.internal.remote.internal.inet.SocketConnection$SocketOutputStream#writeBufferToChannel
at line:267
    org.gradle.internal.remote.internal.inet.SocketConnection$SocketOutputStream#flush at
line:261
    org.gradle.internal.remote.internal.inet.SocketConnection#flush at line:138
    org.gradle.internal.remote.internal.hub.MessageHub$ConnectionDispatch#run at line:335
    org.gradle.internal.concurrent.ExecutorPolicy$CatchAndRecordFailures#onExecute at line:64
    org.gradle.internal.concurrent.ManagedExecutorImpl$1#run at line:48
    java.util.concurrent.ThreadPoolExecutor#runWorker at line:1149
    java.util.concurrent.ThreadPoolExecutor$Worker#run at line:624
    org.gradle.internal.concurrent.ThreadFactoryImpl$ManagedThreadRunnable#run at line:56
    java.lang.Thread#run at line:748

    Thread[Test worker,5,main], stackTrace:java.beans.Introspector#getTargetEventInfo at line:1102
    java.beans.Introspector#getBeanInfo at line:427
    java.beans.Introspector#getBeanInfo at line:173
    java.beans.Introspector#getBeanInfo at line:260
    java.beans.Introspector#<init> at line:407
    java.beans.Introspector#getBeanInfo at line:173
    java.beans.Introspector#getBeanInfo at line:260
    java.beans.Introspector#<init> at line:407
    java.beans.Introspector#getBeanInfo at line:173
    java.beans.Introspector#getBeanInfo at line:260
    java.beans.Introspector#<init> at line:407
    java.beans.Introspector#getBeanInfo at line:173
    java.beans.Introspector#getBeanInfo at line:260
    java.beans.Introspector#<init> at line:407
    java.beans.Introspector#getBeanInfo at line:173
    java.beans.Introspector#getBeanInfo at line:260
    java.beans.Introspector#<init> at line:407
    java.beans.Introspector#getBeanInfo at line:173
    groovy.lang.MetaClassImpl$15#run at line:3328
    java.security.AccessController#doPrivileged
    groovy.lang.MetaClassImpl#addProperties at line:3326
    groovy.lang.MetaClassImpl#initialize at line:3303
    org.codehaus.groovy.reflection.ClassInfo#getMetaClassUnderLock at line:289
    org.codehaus.groovy.reflection.ClassInfo#getMetaClass at line:331
    org.codehaus.groovy.runtime.metaclass.MetaClassRegistryImpl#getMetaClass at line:277
    org.codehaus.groovy.runtime.InvokerHelper#getMetaClass at line:905
    org.codehaus.groovy.runtime.callsite.CallSiteArray#createCallConstructorSite at line:86
    org.codehaus.groovy.runtime.callsite.CallSiteArray#defaultCallConstructor at line:59
    org.codehaus.groovy.runtime.callsite.AbstractCallSite#callConstructor at line:238
    org.codehaus.groovy.runtime.callsite.AbstractCallSite#callConstructor at line:258
    org.apache.jmeter.gui.HtmlReportGUISpec#$spock_feature_1_0 at line:35
    sun.reflect.NativeMethodAccessorImpl#invoke0
    sun.reflect.NativeMethodAccessorImpl#invoke at line:62
    sun.reflect.DelegatingMethodAccessorImpl#invoke at line:43
    java.lang.reflect.Method#invoke at line:498
    org.spockframework.util.ReflectionUtil#invokeMethod at line:200
    org.spockframework.runtime.model.MethodInfo#invoke at line:113
    org.spockframework.runtime.BaseSpecRunner#invokeRaw at line:484
    org.spockframework.runtime.BaseSpecRunner#invoke at line:467
    org.spockframework.runtime.BaseSpecRunner#runFeatureMethod at line:408
    org.spockframework.runtime.BaseSpecRunner#doRunIteration at line:322
    org.spockframework.runtime.BaseSpecRunner$6#invoke at line:306
    org.spockframework.runtime.BaseSpecRunner#invokeRaw at line:484
    org.spockframework.runtime.BaseSpecRunner#invoke at line:467
    org.spockframework.runtime.BaseSpecRunner#runIteration at line:285
    org.spockframework.runtime.BaseSpecRunner#initializeAndRunIteration at line:275
    org.spockframework.runtime.BaseSpecRunner#runSimpleFeature at line:266
    org.spockframework.runtime.BaseSpecRunner#doRunFeature at line:260
    org.spockframework.runtime.BaseSpecRunner$5#invoke at line:243
    org.spockframework.runtime.BaseSpecRunner#invokeRaw at line:484
    org.spockframework.runtime.BaseSpecRunner#invoke at line:467
    org.spockframework.runtime.BaseSpecRunner#runFeature at line:235
    org.spockframework.runtime.BaseSpecRunner#runFeatures at line:185
    org.spockframework.runtime.BaseSpecRunner#doRunSpec at line:95
    org.spockframework.runtime.BaseSpecRunner$1#invoke at line:81
    org.spockframework.runtime.BaseSpecRunner#invokeRaw at line:484
    org.spockframework.runtime.BaseSpecRunner#invoke at line:467
    org.spockframework.runtime.BaseSpecRunner#runSpec at line:73
    org.spockframework.runtime.BaseSpecRunner#run at line:64
    org.spockframework.runtime.Sputnik#run at line:63
    org.junit.runner.JUnitCore#run at line:137
    org.junit.runner.JUnitCore#run at line:115
    org.junit.vintage.engine.execution.RunnerExecutor#execute at line:40
    org.junit.vintage.engine.VintageTestEngine$$Lambda$413/890732186#accept
    java.util.stream.ForEachOps$ForEachOp$OfRef#accept at line:184
    java.util.stream.ReferencePipeline$3$1#accept at line:193
    java.util.Iterator#forEachRemaining at line:116
    java.util.Spliterators$IteratorSpliterator#forEachRemaining at line:1801
    java.util.stream.AbstractPipeline#copyInto at line:481
    java.util.stream.AbstractPipeline#wrapAndCopyInto at line:471
    java.util.stream.ForEachOps$ForEachOp#evaluateSequential at line:151
    java.util.stream.ForEachOps$ForEachOp$OfRef#evaluateSequential at line:174
    java.util.stream.AbstractPipeline#evaluate at line:234
    java.util.stream.ReferencePipeline#forEach at line:418
    org.junit.vintage.engine.VintageTestEngine#executeAllChildren at line:80
    org.junit.vintage.engine.VintageTestEngine#execute at line:71
    org.junit.platform.launcher.core.DefaultLauncher#execute at line:220
    org.junit.platform.launcher.core.DefaultLauncher#lambda$execute$6 at line:188
    org.junit.platform.launcher.core.DefaultLauncher$$Lambda$165/658230980#accept
    org.junit.platform.launcher.core.DefaultLauncher#withInterceptedStreams at line:202
    org.junit.platform.launcher.core.DefaultLauncher#execute at line:181
    org.junit.platform.launcher.core.DefaultLauncher#execute at line:128
    org.gradle.api.internal.tasks.testing.junitplatform.JUnitPlatformTestClassProcessor$CollectAllTestClassesExecutor#processAllTestClasses
at line:99
    org.gradle.api.internal.tasks.testing.junitplatform.JUnitPlatformTestClassProcessor$CollectAllTestClassesExecutor#access$000
at line:79
    org.gradle.api.internal.tasks.testing.junitplatform.JUnitPlatformTestClassProcessor#stop
at line:75
    org.gradle.api.internal.tasks.testing.SuiteTestClassProcessor#stop at line:61
    sun.reflect.NativeMethodAccessorImpl#invoke0
    sun.reflect.NativeMethodAccessorImpl#invoke at line:62
    sun.reflect.DelegatingMethodAccessorImpl#invoke at line:43
    java.lang.reflect.Method#invoke at line:498
    org.gradle.internal.dispatch.ReflectionDispatch#dispatch at line:36
    org.gradle.internal.dispatch.ReflectionDispatch#dispatch at line:24
    org.gradle.internal.dispatch.ContextClassLoaderDispatch#dispatch at line:33
    org.gradle.internal.dispatch.ProxyDispatchAdapter$DispatchingInvocationHandler#invoke
at line:94
    com.sun.proxy.$Proxy2#stop
    org.gradle.api.internal.tasks.testing.worker.TestWorker#stop at line:132
    sun.reflect.NativeMethodAccessorImpl#invoke0
    sun.reflect.NativeMethodAccessorImpl#invoke at line:62
    sun.reflect.DelegatingMethodAccessorImpl#invoke at line:43
    java.lang.reflect.Method#invoke at line:498
    org.gradle.internal.dispatch.ReflectionDispatch#dispatch at line:36
    org.gradle.internal.dispatch.ReflectionDispatch#dispatch at line:24
    org.gradle.internal.remote.internal.hub.MessageHubBackedObjectConnection$DispatchWrapper#dispatch
at line:182
    org.gradle.internal.remote.internal.hub.MessageHubBackedObjectConnection$DispatchWrapper#dispatch
at line:164
    org.gradle.internal.remote.internal.hub.MessageHub$Handler#run at line:412
    org.gradle.internal.concurrent.ExecutorPolicy$CatchAndRecordFailures#onExecute at line:64
    org.gradle.internal.concurrent.ManagedExecutorImpl$1#run at line:48
    java.util.concurrent.ThreadPoolExecutor#runWorker at line:1149
    java.util.concurrent.ThreadPoolExecutor$Worker#run at line:624
    org.gradle.internal.concurrent.ThreadFactoryImpl$ManagedThreadRunnable#run at line:56
    java.lang.Thread#run at line:748

    Thread[AWT-Shutdown,5,system], stackTrace:java.lang.Object#wait
    sun.awt.AWTAutoShutdown#run at line:314
    java.lang.Thread#run at line:748

    Thread[/127.0.0.1:56832 to /127.0.0.1:34827 workers Thread 3,5,main], stackTrace:sun.nio.ch.EPollArrayWrapper#epollWait
    sun.nio.ch.EPollArrayWrapper#poll at line:269
    sun.nio.ch.EPollSelectorImpl#doSelect at line:93
    sun.nio.ch.SelectorImpl#lockAndDoSelect at line:86
    sun.nio.ch.SelectorImpl#select at line:97
    sun.nio.ch.SelectorImpl#select at line:101
    org.gradle.internal.remote.internal.inet.SocketConnection$SocketInputStream#read at line:185
    com.esotericsoftware.kryo.io.Input#fill at line:146
    com.esotericsoftware.kryo.io.Input#require at line:178
    com.esotericsoftware.kryo.io.Input#readByte at line:295
    org.gradle.internal.serialize.kryo.KryoBackedDecoder#readByte at line:81
    org.gradle.internal.remote.internal.hub.InterHubMessageSerializer$MessageReader#read at
line:64
    org.gradle.internal.remote.internal.hub.InterHubMessageSerializer$MessageReader#read at
line:52
    org.gradle.internal.remote.internal.inet.SocketConnection#receive at line:81
    org.gradle.internal.remote.internal.hub.MessageHub$ConnectionReceive#run at line:268
    org.gradle.internal.concurrent.ExecutorPolicy$CatchAndRecordFailures#onExecute at line:64
    org.gradle.internal.concurrent.ManagedExecutorImpl$1#run at line:48
    java.util.concurrent.ThreadPoolExecutor#runWorker at line:1149
    java.util.concurrent.ThreadPoolExecutor$Worker#run at line:624
    org.gradle.internal.concurrent.ThreadFactoryImpl$ManagedThreadRunnable#run at line:56
    java.lang.Thread#run at line:748

    Thread[main,5,main], stackTrace:sun.misc.Unsafe#park
    java.util.concurrent.locks.LockSupport#park at line:175
    java.util.concurrent.locks.AbstractQueuedSynchronizer#parkAndCheckInterrupt at line:836
    java.util.concurrent.locks.AbstractQueuedSynchronizer#doAcquireSharedInterruptibly at
line:997
    java.util.concurrent.locks.AbstractQueuedSynchronizer#acquireSharedInterruptibly at line:1304
    java.util.concurrent.CountDownLatch#await at line:231
    org.gradle.api.internal.tasks.testing.worker.TestWorker#execute at line:72
    org.gradle.api.internal.tasks.testing.worker.TestWorker#execute at line:46
    org.gradle.process.internal.worker.child.ActionExecutionWorker#execute at line:91
    org.gradle.process.internal.worker.child.ActionExecutionWorker#execute at line:34
    org.gradle.process.internal.worker.child.SystemApplicationClassLoaderWorker#call at line:137
    org.gradle.process.internal.worker.child.SystemApplicationClassLoaderWorker#call at line:69
    worker.org.gradle.process.internal.worker.GradleWorkerMain#run at line:68
    worker.org.gradle.process.internal.worker.GradleWorkerMain#main at line:73


> Task :src:functions:compileTestJava
> Task :src:functions:compileTestGroovy
> Task :src:functions:testClasses
> Task :src:functions:testJar UP-TO-DATE
> Task :src:functions:checkstyleMain

> Task :src:licenses:gatherBinaryLicenses
License overrides were declared but unused for the following dependencies: [org.hamcrest:hamcrest-core:2.1,
org.hamcrest:hamcrest:2.1, org.ow2.asm:asm:7.1]

> Task :src:licenses:gatherBinaryLicenses FAILED
> Task :src:protocol:http:compileTestJava
> Task :src:functions:checkstyleTest

> Task :src:dist:javadocAggregate
javadoc: warning - Multiple sources of package comments found for package "org.apache.jmeter.assertions"
javadoc: warning - Multiple sources of package comments found for package "org.apache.jmeter.visualizers"
javadoc: warning - Multiple sources of package comments found for package "org.apache.jmeter.report.config"
javadoc: warning - Multiple sources of package comments found for package "org.apache.jmeter.report.processor"
javadoc: warning - Multiple sources of package comments found for package "org.apache.jmeter.report.processor.graph"
javadoc: warning - Multiple sources of package comments found for package "org.apache.jmeter.report.processor.graph.impl"
javadoc: warning - Multiple sources of package comments found for package "org.apache.jmeter.report.dashboard"
javadoc: warning - Multiple sources of package comments found for package "org.apache.jmeter.report.core"
javadoc: warning - Multiple sources of package comments found for package "org.apache.commons.cli.avalon"

> Task :src:generator:spotbugsMain
> Task :src:examples:spotbugsMain

> Task :src:dist:javadocAggregate
9 warnings
checksum-dependency elapsed time: 12326ms, configurations processed: 324 (add -PchecksumTimingsPrint
to print detailed timings)

FAILURE: Build failed with an exception.

* What went wrong:
Execution failed for task ':src:licenses:gatherBinaryLicenses'.
> LICENSE-like files are missing
  ==============================
  
  BSD-3-Clause
  * org.hamcrest:hamcrest-core:2.2


* Try:
Run with --stacktrace option to get the stack trace. Run with --info or --debug option to
get more log output. Run with --scan to get full insights.

* Get more help at https://help.gradle.org

Deprecated Gradle features were used in this build, making it incompatible with Gradle 7.0.
Use '--warning-mode all' to show the individual deprecation warnings.
See https://docs.gradle.org/6.1/userguide/command_line_interface.html#sec:command_line_warnings

BUILD FAILED in 4m 49s
305 actionable tasks: 198 executed, 107 up-to-date

See the profiling report at: file://<https://builds.apache.org/job/JMeter-trunk/ws/build/reports/profile/profile-2020-02-16-20-20-04.html>
A fine-grained performance profile is available: use the --scan option.
Build step 'Invoke Gradle script' changed build result to FAILURE
Build step 'Invoke Gradle script' marked build as failure
Xvfb stopping
Archiving artifacts
[Fast Archiver] Compressed 32.91 MB of artifacts by 62.9% relative to #7626
Recording test results

Mime
View raw message