jmeter-dev mailing list archives

Site index · List index
Message view « Date » · « Thread »
Top « Date » · « Thread »
From Apache Jenkins Server <jenk...@builds.apache.org>
Subject Build failed in Jenkins: JMeter-trunk #7606
Date Tue, 11 Feb 2020 22:54:57 GMT
See <https://builds.apache.org/job/JMeter-trunk/7606/display/redirect>

Changes:


------------------------------------------
[...truncated 157.32 KB...]
> Task :src:jorphan:test
          1.7sec,   16 completed,   0 failed,   0 skipped, org.apache.jorphan.io.TextFileSpec
          0.8sec,   32 completed,   0 failed,   0 skipped, org.apache.jorphan.util.ConverterSpec
SKIPPED   3.3sec,    0 completed,   0 failed,   0 skipped, org.apache.jorphan.exec.TestKeyToolUtils
          8.7sec,   85 completed,   0 failed,   0 skipped, Gradle Test Run :src:jorphan:test

> Task :src:protocol:junit:spotbugsTest
> Task :src:protocol:mongodb:spotbugsTest
> Task :src:dist:distTarSource
> Task :src:protocol:native:spotbugsTest
> Task :src:protocol:java:spotbugsTest
> Task :src:protocol:ldap:spotbugsTest
> Task :src:protocol:tcp:spotbugsTest

> Task :src:protocol:jms:spotbugsTest
SpotBugs rule violations were found. See the report at: file://<https://builds.apache.org/job/JMeter-trunk/ws/src/protocol/jms/build/reports/spotbugs/test.xml>

> Task :src:protocol:bolt:spotbugsTest
SpotBugs rule violations were found. See the report at: file://<https://builds.apache.org/job/JMeter-trunk/ws/src/protocol/bolt/build/reports/spotbugs/test.xml>
checksum-dependency elapsed time: 10060ms, configurations processed: 273 (add -PchecksumTimingsPrint
to print detailed timings)

Build jmeter FAILURE reason:                                
    org.gradle.execution.MultipleBuildFailures: Build completed with 2 failures.
        at org.gradle.initialization.DefaultGradleLauncher.runWork(DefaultGradleLauncher.java:246)
        at org.gradle.initialization.DefaultGradleLauncher.doClassicBuildStages(DefaultGradleLauncher.java:154)
        at org.gradle.initialization.DefaultGradleLauncher.doBuildStages(DefaultGradleLauncher.java:130)
        at org.gradle.initialization.DefaultGradleLauncher.executeTasks(DefaultGradleLauncher.java:110)
        Execution failed for task ':src:protocol:mail:spotbugsTest':
        Execution failed for task ':src:protocol:jdbc:spotbugsTest':
            org.gradle.process.internal.worker.WorkerProcessException: Failed to run Gradle
SpotBugs Worker
                at org.gradle.process.internal.worker.WorkerProcessException.runFailed(WorkerProcessException.java:29)
                at org.gradle.process.internal.worker.DefaultSingleRequestWorkerProcessBuilder$1.invoke(DefaultSingleRequestWorkerProcessBuilder.java:140)
                at com.github.spotbugs.internal.spotbugs.SpotBugsWorkerManager.runWorker(SpotBugsWorkerManager.java:15)
                at com.github.spotbugs.SpotBugsTask.run(SpotBugsTask.java:270)
                at org.gradle.internal.reflect.JavaMethod.invoke(JavaMethod.java:104)
                at org.gradle.api.internal.project.taskfactory.StandardTaskAction.doExecute(StandardTaskAction.java:49)
                at org.gradle.api.internal.project.taskfactory.StandardTaskAction.execute(StandardTaskAction.java:42)
                at org.gradle.api.internal.project.taskfactory.StandardTaskAction.execute(StandardTaskAction.java:28)
                at org.gradle.api.internal.AbstractTask$TaskActionWrapper.execute(AbstractTask.java:727)
                at org.gradle.api.internal.AbstractTask$TaskActionWrapper.execute(AbstractTask.java:694)
                at org.gradle.api.internal.tasks.execution.ExecuteActionsTaskExecuter$3.run(ExecuteActionsTaskExecuter.java:568)
                at org.gradle.internal.operations.DefaultBuildOperationExecutor$RunnableBuildOperationWorker.execute(DefaultBuildOperationExecutor.java:402)
                at org.gradle.internal.operations.DefaultBuildOperationExecutor$RunnableBuildOperationWorker.execute(DefaultBuildOperationExecutor.java:394)
                at org.gradle.internal.operations.DefaultBuildOperationExecutor$1.execute(DefaultBuildOperationExecutor.java:165)
                at org.gradle.internal.operations.DefaultBuildOperationExecutor.execute(DefaultBuildOperationExecutor.java:250)
                at org.gradle.internal.operations.DefaultBuildOperationExecutor.execute(DefaultBuildOperationExecutor.java:158)
                at org.gradle.internal.operations.DefaultBuildOperationExecutor.run(DefaultBuildOperationExecutor.java:92)
                at org.gradle.internal.operations.DelegatingBuildOperationExecutor.run(DelegatingBuildOperationExecutor.java:31)
                at org.gradle.api.internal.tasks.execution.ExecuteActionsTaskExecuter.executeAction(ExecuteActionsTaskExecuter.java:553)
                at org.gradle.api.internal.tasks.execution.ExecuteActionsTaskExecuter.executeActions(ExecuteActionsTaskExecuter.java:536)
                at org.gradle.api.internal.tasks.execution.ExecuteActionsTaskExecuter.access$300(ExecuteActionsTaskExecuter.java:109)
                at org.gradle.api.internal.tasks.execution.ExecuteActionsTaskExecuter$TaskExecution.executeWithPreviousOutputFiles(ExecuteActionsTaskExecuter.java:276)
                at org.gradle.api.internal.tasks.execution.ExecuteActionsTaskExecuter$TaskExecution.execute(ExecuteActionsTaskExecuter.java:265)
                at org.gradle.internal.execution.steps.ExecuteStep.lambda$execute$1(ExecuteStep.java:33)
                at org.gradle.internal.execution.steps.ExecuteStep.execute(ExecuteStep.java:33)
                at org.gradle.internal.execution.steps.ExecuteStep.execute(ExecuteStep.java:26)
                at org.gradle.internal.execution.steps.CleanupOutputsStep.execute(CleanupOutputsStep.java:63)
                at org.gradle.internal.execution.steps.CleanupOutputsStep.execute(CleanupOutputsStep.java:35)
                at org.gradle.internal.execution.steps.ResolveInputChangesStep.execute(ResolveInputChangesStep.java:49)
                at org.gradle.internal.execution.steps.ResolveInputChangesStep.execute(ResolveInputChangesStep.java:34)
                at org.gradle.internal.execution.steps.CancelExecutionStep.execute(CancelExecutionStep.java:43)
                at org.gradle.internal.execution.steps.TimeoutStep.executeWithoutTimeout(TimeoutStep.java:73)
                at org.gradle.internal.execution.steps.TimeoutStep.execute(TimeoutStep.java:54)
                at org.gradle.internal.execution.steps.CatchExceptionStep.execute(CatchExceptionStep.java:34)
                at org.gradle.internal.execution.steps.CreateOutputsStep.execute(CreateOutputsStep.java:44)
                at org.gradle.internal.execution.steps.SnapshotOutputsStep.execute(SnapshotOutputsStep.java:54)
                at org.gradle.internal.execution.steps.SnapshotOutputsStep.execute(SnapshotOutputsStep.java:38)
                at org.gradle.internal.execution.steps.BroadcastChangingOutputsStep.execute(BroadcastChangingOutputsStep.java:49)
                at org.gradle.internal.execution.steps.CacheStep.executeWithoutCache(CacheStep.java:153)
                at org.gradle.internal.execution.steps.CacheStep.execute(CacheStep.java:67)
                at org.gradle.internal.execution.steps.CacheStep.execute(CacheStep.java:41)
                at org.gradle.internal.execution.steps.StoreExecutionStateStep.execute(StoreExecutionStateStep.java:44)
                at org.gradle.internal.execution.steps.StoreExecutionStateStep.execute(StoreExecutionStateStep.java:33)
                at org.gradle.internal.execution.steps.RecordOutputsStep.execute(RecordOutputsStep.java:38)
                at org.gradle.internal.execution.steps.RecordOutputsStep.execute(RecordOutputsStep.java:24)
                at org.gradle.internal.execution.steps.SkipUpToDateStep.executeBecause(SkipUpToDateStep.java:92)
                at org.gradle.internal.execution.steps.SkipUpToDateStep.lambda$execute$0(SkipUpToDateStep.java:85)
                at org.gradle.internal.execution.steps.SkipUpToDateStep.execute(SkipUpToDateStep.java:55)
                at org.gradle.internal.execution.steps.SkipUpToDateStep.execute(SkipUpToDateStep.java:39)
                at org.gradle.internal.execution.steps.ResolveChangesStep.execute(ResolveChangesStep.java:76)
                at org.gradle.internal.execution.steps.ResolveChangesStep.execute(ResolveChangesStep.java:37)
                at org.gradle.internal.execution.steps.legacy.MarkSnapshottingInputsFinishedStep.execute(MarkSnapshottingInputsFinishedStep.java:36)
                at org.gradle.internal.execution.steps.legacy.MarkSnapshottingInputsFinishedStep.execute(MarkSnapshottingInputsFinishedStep.java:26)
                at org.gradle.internal.execution.steps.ResolveCachingStateStep.execute(ResolveCachingStateStep.java:94)
                at org.gradle.internal.execution.steps.ResolveCachingStateStep.execute(ResolveCachingStateStep.java:49)
                at org.gradle.internal.execution.steps.CaptureStateBeforeExecutionStep.execute(CaptureStateBeforeExecutionStep.java:79)
                at org.gradle.internal.execution.steps.CaptureStateBeforeExecutionStep.execute(CaptureStateBeforeExecutionStep.java:53)
                at org.gradle.internal.execution.steps.ValidateStep.execute(ValidateStep.java:74)
                at org.gradle.internal.execution.steps.SkipEmptyWorkStep.lambda$execute$2(SkipEmptyWorkStep.java:78)
                at org.gradle.internal.execution.steps.SkipEmptyWorkStep.execute(SkipEmptyWorkStep.java:78)
                at org.gradle.internal.execution.steps.SkipEmptyWorkStep.execute(SkipEmptyWorkStep.java:34)
                at org.gradle.internal.execution.steps.legacy.MarkSnapshottingInputsStartedStep.execute(MarkSnapshottingInputsStartedStep.java:39)
                at org.gradle.internal.execution.steps.LoadExecutionStateStep.execute(LoadExecutionStateStep.java:40)
                at org.gradle.internal.execution.steps.LoadExecutionStateStep.execute(LoadExecutionStateStep.java:28)
            org.gradle.process.internal.worker.WorkerProcessException: Failed to run Gradle
SpotBugs Worker
                at org.gradle.process.internal.worker.WorkerProcessException.runFailed(WorkerProcessException.java:29)
                at org.gradle.process.internal.worker.DefaultSingleRequestWorkerProcessBuilder$1.invoke(DefaultSingleRequestWorkerProcessBuilder.java:140)
                at com.github.spotbugs.internal.spotbugs.SpotBugsWorkerManager.runWorker(SpotBugsWorkerManager.java:15)
                at com.github.spotbugs.SpotBugsTask.run(SpotBugsTask.java:270)
                at org.gradle.internal.reflect.JavaMethod.invoke(JavaMethod.java:104)
                at org.gradle.api.internal.project.taskfactory.StandardTaskAction.doExecute(StandardTaskAction.java:49)
                at org.gradle.api.internal.project.taskfactory.StandardTaskAction.execute(StandardTaskAction.java:42)
                at org.gradle.api.internal.project.taskfactory.StandardTaskAction.execute(StandardTaskAction.java:28)
                at org.gradle.api.internal.AbstractTask$TaskActionWrapper.execute(AbstractTask.java:727)
                at org.gradle.api.internal.AbstractTask$TaskActionWrapper.execute(AbstractTask.java:694)
                at org.gradle.api.internal.tasks.execution.ExecuteActionsTaskExecuter$3.run(ExecuteActionsTaskExecuter.java:568)
                at org.gradle.internal.operations.DefaultBuildOperationExecutor$RunnableBuildOperationWorker.execute(DefaultBuildOperationExecutor.java:402)
                at org.gradle.internal.operations.DefaultBuildOperationExecutor$RunnableBuildOperationWorker.execute(DefaultBuildOperationExecutor.java:394)
                at org.gradle.internal.operations.DefaultBuildOperationExecutor$1.execute(DefaultBuildOperationExecutor.java:165)
                at org.gradle.internal.operations.DefaultBuildOperationExecutor.execute(DefaultBuildOperationExecutor.java:250)
                at org.gradle.internal.operations.DefaultBuildOperationExecutor.execute(DefaultBuildOperationExecutor.java:158)
                at org.gradle.internal.operations.DefaultBuildOperationExecutor.run(DefaultBuildOperationExecutor.java:92)
                at org.gradle.internal.operations.DelegatingBuildOperationExecutor.run(DelegatingBuildOperationExecutor.java:31)
                at org.gradle.api.internal.tasks.execution.ExecuteActionsTaskExecuter.executeAction(ExecuteActionsTaskExecuter.java:553)
                at org.gradle.api.internal.tasks.execution.ExecuteActionsTaskExecuter.executeActions(ExecuteActionsTaskExecuter.java:536)
                at org.gradle.api.internal.tasks.execution.ExecuteActionsTaskExecuter.access$300(ExecuteActionsTaskExecuter.java:109)
                at org.gradle.api.internal.tasks.execution.ExecuteActionsTaskExecuter$TaskExecution.executeWithPreviousOutputFiles(ExecuteActionsTaskExecuter.java:276)
                at org.gradle.api.internal.tasks.execution.ExecuteActionsTaskExecuter$TaskExecution.execute(ExecuteActionsTaskExecuter.java:265)
                at org.gradle.internal.execution.steps.ExecuteStep.lambda$execute$1(ExecuteStep.java:33)
                at java.util.Optional.orElseGet(Optional.java:267)
                at org.gradle.internal.execution.steps.ExecuteStep.execute(ExecuteStep.java:33)
                at org.gradle.internal.execution.steps.ExecuteStep.execute(ExecuteStep.java:26)
                at org.gradle.internal.execution.steps.CleanupOutputsStep.execute(CleanupOutputsStep.java:63)
                at org.gradle.internal.execution.steps.CleanupOutputsStep.execute(CleanupOutputsStep.java:35)
                at org.gradle.internal.execution.steps.ResolveInputChangesStep.execute(ResolveInputChangesStep.java:49)
                at org.gradle.internal.execution.steps.ResolveInputChangesStep.execute(ResolveInputChangesStep.java:34)
                at org.gradle.internal.execution.steps.CancelExecutionStep.execute(CancelExecutionStep.java:43)
                at org.gradle.internal.execution.steps.TimeoutStep.executeWithoutTimeout(TimeoutStep.java:73)
                at org.gradle.internal.execution.steps.TimeoutStep.execute(TimeoutStep.java:54)
                at org.gradle.internal.execution.steps.CatchExceptionStep.execute(CatchExceptionStep.java:34)
                at org.gradle.internal.execution.steps.CreateOutputsStep.execute(CreateOutputsStep.java:44)
                at org.gradle.internal.execution.steps.SnapshotOutputsStep.execute(SnapshotOutputsStep.java:54)
                at org.gradle.internal.execution.steps.SnapshotOutputsStep.execute(SnapshotOutputsStep.java:38)
                at org.gradle.internal.execution.steps.BroadcastChangingOutputsStep.execute(BroadcastChangingOutputsStep.java:49)
                at org.gradle.internal.execution.steps.CacheStep.executeWithoutCache(CacheStep.java:153)
                at org.gradle.internal.execution.steps.CacheStep.execute(CacheStep.java:67)
                at org.gradle.internal.execution.steps.CacheStep.execute(CacheStep.java:41)
                at org.gradle.internal.execution.steps.StoreExecutionStateStep.execute(StoreExecutionStateStep.java:44)
                at org.gradle.internal.execution.steps.StoreExecutionStateStep.execute(StoreExecutionStateStep.java:33)
                at org.gradle.internal.execution.steps.RecordOutputsStep.execute(RecordOutputsStep.java:38)
                at org.gradle.internal.execution.steps.RecordOutputsStep.execute(RecordOutputsStep.java:24)
                at org.gradle.internal.execution.steps.SkipUpToDateStep.executeBecause(SkipUpToDateStep.java:92)
                at org.gradle.internal.execution.steps.SkipUpToDateStep.lambda$execute$0(SkipUpToDateStep.java:85)
                at java.util.Optional.map(Optional.java:215)
                at org.gradle.internal.execution.steps.SkipUpToDateStep.execute(SkipUpToDateStep.java:55)
                at org.gradle.internal.execution.steps.SkipUpToDateStep.execute(SkipUpToDateStep.java:39)
                at org.gradle.internal.execution.steps.ResolveChangesStep.execute(ResolveChangesStep.java:76)
                at org.gradle.internal.execution.steps.ResolveChangesStep.execute(ResolveChangesStep.java:37)
                at org.gradle.internal.execution.steps.legacy.MarkSnapshottingInputsFinishedStep.execute(MarkSnapshottingInputsFinishedStep.java:36)
                at org.gradle.internal.execution.steps.legacy.MarkSnapshottingInputsFinishedStep.execute(MarkSnapshottingInputsFinishedStep.java:26)
                at org.gradle.internal.execution.steps.ResolveCachingStateStep.execute(ResolveCachingStateStep.java:94)
                at org.gradle.internal.execution.steps.ResolveCachingStateStep.execute(ResolveCachingStateStep.java:49)
                at org.gradle.internal.execution.steps.CaptureStateBeforeExecutionStep.execute(CaptureStateBeforeExecutionStep.java:79)
                at org.gradle.internal.execution.steps.CaptureStateBeforeExecutionStep.execute(CaptureStateBeforeExecutionStep.java:53)
                at org.gradle.internal.execution.steps.ValidateStep.execute(ValidateStep.java:74)
                at org.gradle.internal.execution.steps.SkipEmptyWorkStep.lambda$execute$2(SkipEmptyWorkStep.java:78)
                at java.util.Optional.orElseGet(Optional.java:267)
                at org.gradle.internal.execution.steps.SkipEmptyWorkStep.execute(SkipEmptyWorkStep.java:78)
                at org.gradle.internal.execution.steps.SkipEmptyWorkStep.execute(SkipEmptyWorkStep.java:34)
                at org.gradle.internal.execution.steps.legacy.MarkSnapshottingInputsStartedStep.execute(MarkSnapshottingInputsStartedStep.java:39)
                at org.gradle.internal.execution.steps.LoadExecutionStateStep.execute(LoadExecutionStateStep.java:40)
                at org.gradle.internal.execution.steps.LoadExecutionStateStep.execute(LoadExecutionStateStep.java:28)
                Caused by: org.gradle.process.internal.ExecException: Process 'Gradle
SpotBugs Worker 11' finished with non-zero exit value 1
                    at org.gradle.process.internal.DefaultExecHandle$ExecResultImpl.assertNormalExitValue(DefaultExecHandle.java:417)
                    at org.gradle.process.internal.worker.DefaultWorkerProcess.onProcessStop(DefaultWorkerProcess.java:141)
                    at org.gradle.process.internal.worker.DefaultWorkerProcess.access$000(DefaultWorkerProcess.java:42)
                    at org.gradle.process.internal.worker.DefaultWorkerProcess$1.executionFinished(DefaultWorkerProcess.java:94)
                    at org.gradle.internal.dispatch.ReflectionDispatch.dispatch(ReflectionDispatch.java:36)
                    at org.gradle.internal.dispatch.ReflectionDispatch.dispatch(ReflectionDispatch.java:24)
                    at org.gradle.internal.event.AbstractBroadcastDispatch.dispatch(AbstractBroadcastDispatch.java:42)
                    at org.gradle.internal.event.BroadcastDispatch$SingletonDispatch.dispatch(BroadcastDispatch.java:231)
                    at org.gradle.internal.event.BroadcastDispatch$SingletonDispatch.dispatch(BroadcastDispatch.java:150)
                    at org.gradle.internal.event.ListenerBroadcast.dispatch(ListenerBroadcast.java:141)
                    at org.gradle.internal.event.ListenerBroadcast.dispatch(ListenerBroadcast.java:37)
                    at org.gradle.internal.dispatch.ProxyDispatchAdapter$DispatchingInvocationHandler.invoke(ProxyDispatchAdapter.java:94)
                    at org.gradle.process.internal.DefaultExecHandle.setEndStateInfo(DefaultExecHandle.java:221)
                    at org.gradle.process.internal.DefaultExecHandle.finished(DefaultExecHandle.java:357)
                    at org.gradle.process.internal.ExecHandleRunner.completed(ExecHandleRunner.java:110)
                    at org.gradle.process.internal.ExecHandleRunner.run(ExecHandleRunner.java:84)
                    at org.gradle.internal.operations.CurrentBuildOperationPreservingRunnable.run(CurrentBuildOperationPreservingRunnable.java:42)
                    at org.gradle.internal.concurrent.ExecutorPolicy$CatchAndRecordFailures.onExecute(ExecutorPolicy.java:64)
                    at org.gradle.internal.concurrent.ManagedExecutorImpl$1.run(ManagedExecutorImpl.java:48)
                    at org.gradle.internal.concurrent.ThreadFactoryImpl$ManagedThreadRunnable.run(ThreadFactoryImpl.java:56)
                Caused by: org.gradle.process.internal.ExecException: Process 'Gradle
SpotBugs Worker 13' finished with non-zero exit value 1
                    at org.gradle.process.internal.DefaultExecHandle$ExecResultImpl.assertNormalExitValue(DefaultExecHandle.java:417)
                    at org.gradle.process.internal.worker.DefaultWorkerProcess.onProcessStop(DefaultWorkerProcess.java:141)
                    at org.gradle.process.internal.worker.DefaultWorkerProcess.access$000(DefaultWorkerProcess.java:42)
                    at org.gradle.process.internal.worker.DefaultWorkerProcess$1.executionFinished(DefaultWorkerProcess.java:94)
                    at org.gradle.internal.dispatch.ReflectionDispatch.dispatch(ReflectionDispatch.java:36)
                    at org.gradle.internal.dispatch.ReflectionDispatch.dispatch(ReflectionDispatch.java:24)
                    at org.gradle.internal.event.AbstractBroadcastDispatch.dispatch(AbstractBroadcastDispatch.java:42)
                    at org.gradle.internal.event.BroadcastDispatch$SingletonDispatch.dispatch(BroadcastDispatch.java:231)
                    at org.gradle.internal.event.BroadcastDispatch$SingletonDispatch.dispatch(BroadcastDispatch.java:150)
                    at org.gradle.internal.event.ListenerBroadcast.dispatch(ListenerBroadcast.java:141)
                    at org.gradle.internal.event.ListenerBroadcast.dispatch(ListenerBroadcast.java:37)
                    at org.gradle.internal.dispatch.ProxyDispatchAdapter$DispatchingInvocationHandler.invoke(ProxyDispatchAdapter.java:94)
                    at org.gradle.process.internal.DefaultExecHandle.setEndStateInfo(DefaultExecHandle.java:221)
                    at org.gradle.process.internal.DefaultExecHandle.finished(DefaultExecHandle.java:357)
                    at org.gradle.process.internal.ExecHandleRunner.completed(ExecHandleRunner.java:110)
                    at org.gradle.process.internal.ExecHandleRunner.run(ExecHandleRunner.java:84)
                    at org.gradle.internal.operations.CurrentBuildOperationPreservingRunnable.run(CurrentBuildOperationPreservingRunnable.java:42)
                    at org.gradle.internal.concurrent.ExecutorPolicy$CatchAndRecordFailures.onExecute(ExecutorPolicy.java:64)
                    at org.gradle.internal.concurrent.ManagedExecutorImpl$1.run(ManagedExecutorImpl.java:48)
                    at java.util.concurrent.ThreadPoolExecutor.runWorker(ThreadPoolExecutor.java:1149)
                    at java.util.concurrent.ThreadPoolExecutor$Worker.run(ThreadPoolExecutor.java:624)
                    at org.gradle.internal.concurrent.ThreadFactoryImpl$ManagedThreadRunnable.run(ThreadFactoryImpl.java:56)
                    at java.lang.Thread.run(Thread.java:748)


FAILURE: Build completed with 2 failures.

1: Task failed with an exception.
-----------
* What went wrong:
Execution failed for task ':src:protocol:mail:spotbugsTest'.
> Failed to run Gradle SpotBugs Worker
   > Process 'Gradle SpotBugs Worker 11' finished with non-zero exit value 1

* Try:
Run with --stacktrace option to get the stack trace. Run with --info or --debug option to
get more log output. Run with --scan to get full insights.
==============================================================================

2: Task failed with an exception.
-----------
* What went wrong:
Execution failed for task ':src:protocol:jdbc:spotbugsTest'.
> Failed to run Gradle SpotBugs Worker
   > Process 'Gradle SpotBugs Worker 13' finished with non-zero exit value 1

* Try:
Run with --stacktrace option to get the stack trace. Run with --info or --debug option to
get more log output. Run with --scan to get full insights.
==============================================================================

* Get more help at https://help.gradle.org

Deprecated Gradle features were used in this build, making it incompatible with Gradle 7.0.
Use '--warning-mode all' to show the individual deprecation warnings.
See https://docs.gradle.org/6.1/userguide/command_line_interface.html#sec:command_line_warnings

BUILD FAILED in 51s
266 actionable tasks: 93 executed, 173 up-to-date

See the profiling report at: file://<https://builds.apache.org/job/JMeter-trunk/ws/build/reports/profile/profile-2020-02-11-22-53-56.html>
A fine-grained performance profile is available: use the --scan option.
Build step 'Invoke Gradle script' changed build result to FAILURE
Build step 'Invoke Gradle script' marked build as failure
Xvfb stopping
Archiving artifacts
Recording test results

Mime
View raw message