jmeter-dev mailing list archives

Site index · List index
Message view « Date » · « Thread »
Top « Date » · « Thread »
From Apache Jenkins Server <jenk...@builds.apache.org>
Subject Build failed in Jenkins: JMeter-trunk #7614
Date Sun, 16 Feb 2020 13:19:08 GMT
See <https://builds.apache.org/job/JMeter-trunk/7614/display/redirect?page=changes>

Changes:

[felix.schumacher] Updated commons-dbcp2 to 2.7.0 (from 2.5.0)


------------------------------------------
[...truncated 188.53 KB...]
    org.gradle.internal.remote.internal.inet.SocketConnection#flush at line:138
    org.gradle.internal.remote.internal.hub.MessageHub$ConnectionDispatch#run at line:335
    org.gradle.internal.concurrent.ExecutorPolicy$CatchAndRecordFailures#onExecute at line:64
    org.gradle.internal.concurrent.ManagedExecutorImpl$1#run at line:48
    java.util.concurrent.ThreadPoolExecutor#runWorker at line:1149
    java.util.concurrent.ThreadPoolExecutor$Worker#run at line:624
    org.gradle.internal.concurrent.ThreadFactoryImpl$ManagedThreadRunnable#run at line:56
    java.lang.Thread#run at line:748

    Thread[AWT-Shutdown,5,system], stackTrace:java.lang.Object#wait
    sun.awt.AWTAutoShutdown#run at line:314
    java.lang.Thread#run at line:748

    Thread[main,5,main], stackTrace:sun.misc.Unsafe#park
    java.util.concurrent.locks.LockSupport#park at line:175
    java.util.concurrent.locks.AbstractQueuedSynchronizer#parkAndCheckInterrupt at line:836
    java.util.concurrent.locks.AbstractQueuedSynchronizer#doAcquireSharedInterruptibly at
line:997
    java.util.concurrent.locks.AbstractQueuedSynchronizer#acquireSharedInterruptibly at line:1304
    java.util.concurrent.CountDownLatch#await at line:231
    org.gradle.api.internal.tasks.testing.worker.TestWorker#execute at line:72
    org.gradle.api.internal.tasks.testing.worker.TestWorker#execute at line:46
    org.gradle.process.internal.worker.child.ActionExecutionWorker#execute at line:91
    org.gradle.process.internal.worker.child.ActionExecutionWorker#execute at line:34
    org.gradle.process.internal.worker.child.SystemApplicationClassLoaderWorker#call at line:137
    org.gradle.process.internal.worker.child.SystemApplicationClassLoaderWorker#call at line:69
    worker.org.gradle.process.internal.worker.GradleWorkerMain#run at line:68
    worker.org.gradle.process.internal.worker.GradleWorkerMain#main at line:73

          1.1sec,    1 completed,   0 failed,   0 skipped, org.apache.jmeter.gui.HtmlReportGUISpec
          0.1sec,    4 completed,   0 failed,   0 skipped, org.apache.jmeter.report.processor.ListResultDataSpec
          0.3sec,    4 completed,   0 failed,   0 skipped, org.apache.jmeter.report.processor.Top5ErrorsBySamplerConsumerSpec
          0.0sec,    3 completed,   0 failed,   0 skipped, org.apache.jmeter.report.processor.FieldSampleComparatorSpec
          0.0sec,    5 completed,   0 failed,   0 skipped, org.apache.jmeter.report.processor.Top5ErrorsSummaryDataSpec
          0.1sec,    1 completed,   0 failed,   0 skipped, org.apache.jmeter.report.processor.ApdexSummaryConsumerSpec
          0.1sec,    2 completed,   0 failed,   0 skipped, org.apache.jmeter.report.processor.graph.impl.ResponseTimePercentilesOverTimeGraphConsumerSpec
          0.0sec,   14 completed,   0 failed,   0 skipped, org.apache.jmeter.report.core.ConvertersSpec
          0.0sec,    6 completed,   0 failed,   0 skipped, org.apache.jmeter.report.core.SampleMetadataParserSpec
         18.1sec,  260 completed,   0 failed,   0 skipped, Gradle Test Run :src:core:test

> Task :src:core:check
> Task :src:core:assemble

> Task :src:components:test
          0.1sec,    8 completed,   0 failed,   0 skipped, org.apache.jmeter.extractor.json.render.RenderAsJmesPathRendererSpec
          0.0sec,    4 completed,   0 failed,   0 skipped, org.apache.jmeter.extractor.JoddExtractorSpec
          0.2sec,   37 completed,   0 failed,   0 skipped, org.apache.jmeter.extractor.BoundaryExtractorSpec
          0.0sec,    6 completed,   0 failed,   0 skipped, org.apache.jmeter.timers.UniformRandomTimerSpec
          0.1sec,    7 completed,   0 failed,   0 skipped, org.apache.jmeter.assertions.CompareAssertionSpec
          0.0sec,    7 completed,   0 failed,   0 skipped, org.apache.jmeter.assertions.MD5HexAssertionSpec
          0.2sec,    5 completed,   0 failed,   0 skipped, org.apache.jmeter.assertions.gui.AssertionGuiSpec
          0.3sec,    5 completed,   0 failed,   0 skipped, org.apache.jmeter.visualizers.backend.graphite.TextGraphiteMetricsSenderSpec
          0.1sec,    7 completed,   0 failed,   0 skipped, org.apache.jmeter.visualizers.backend.graphite.PickleGraphiteMetricsSenderSpec
          0.1sec,    3 completed,   0 failed,   0 skipped, org.apache.jmeter.visualizers.backend.influxdb.InfluxdbBackendListenerClientSpec
          0.1sec,    4 completed,   0 failed,   0 skipped, org.apache.jmeter.control.RandomOrderControllerSpec
          0.1sec,    8 completed,   0 failed,   0 skipped, org.apache.jmeter.control.ThroughputControllerSpec
          1.1sec,    5 completed,   0 failed,   0 skipped, org.apache.jmeter.control.RunTimeSpec
WARNING  22.0sec,  487 completed,   0 failed,   1 skipped, Gradle
Test Run :src:components:test

> Task :src:components:check
> Task :src:components:jar
> Task :src:components:testJar
> Task :src:components:assemble
> Task :src:functions:compileJava
> Task :src:functions:compileGroovy NO-SOURCE
> Task :src:functions:classes
> Task :src:functions:jar UP-TO-DATE
> Task :src:functions:compileTestJava
> Task :src:protocol:http:compileJava
> Task :src:protocol:http:compileGroovy NO-SOURCE
> Task :src:protocol:http:classes
> Task :src:dist:compileJava NO-SOURCE
> Task :src:dist:classes UP-TO-DATE
> Task :src:dist:checkstyleMain NO-SOURCE
> Task :src:dist:jar UP-TO-DATE
> Task :src:protocol:http:jar UP-TO-DATE
> Task :src:dist-check:compileJava NO-SOURCE
> Task :src:dist-check:compileGroovy NO-SOURCE
> Task :src:dist-check:classes UP-TO-DATE
> Task :src:dist-check:checkstyleMain NO-SOURCE
> Task :src:dist-check:spotbugsMain NO-SOURCE
> Task :src:dist-check:jar UP-TO-DATE
> Task :src:dist-check:assemble UP-TO-DATE
> Task :src:functions:compileTestGroovy
> Task :src:functions:testClasses
> Task :src:functions:testJar UP-TO-DATE
> Task :src:functions:checkstyleMain
> Task :src:functions:checkstyleTest
> Task :src:protocol:http:compileTestJava
> Task :src:protocol:http:compileTestGroovy
> Task :src:protocol:http:testClasses
> Task :src:protocol:http:testJar UP-TO-DATE
> Task :src:protocol:http:checkstyleMain
> Task :src:protocol:http:checkstyleTest
> Task :src:licenses:gatherBinaryLicenses
> Task :src:licenses:renderLicenseForBinary
> Task :src:licenses:renderLicenseForBinaryCopySpec
> Task :src:licenses:binLicenseDir
> Task :src:licenses:assemble
> Task :src:dist-check:compileTestJava
> Task :src:dist-check:compileTestGroovy
> Task :src:dist-check:testClasses
> Task :src:dist-check:checkstyleTest
> Task :src:generator:spotbugsMain
> Task :src:generator:spotbugsTest NO-SOURCE
> Task :src:generator:test NO-SOURCE
> Task :src:generator:check
> Task :src:examples:spotbugsMain
> Task :src:examples:spotbugsTest NO-SOURCE
> Task :src:examples:test NO-SOURCE
> Task :src:examples:check

> Task :src:functions:spotbugsMain
SpotBugs rule violations were found. See the report at: file://<https://builds.apache.org/job/JMeter-trunk/ws/src/functions/build/reports/spotbugs/main.xml>

> Task :src:dist-check:spotbugsTest
SpotBugs rule violations were found. See the report at: file://<https://builds.apache.org/job/JMeter-trunk/ws/src/dist-check/build/reports/spotbugs/test.xml>

> Task :src:dist:javadocAggregate
> Task :src:protocol:http:spotbugsMain

> Task :src:functions:spotbugsTest
SpotBugs rule violations were found. See the report at: file://<https://builds.apache.org/job/JMeter-trunk/ws/src/functions/build/reports/spotbugs/test.xml>

> Task :src:functions:test

Gradle Test Executor 56 STANDARD_OUT
    Setting JMeterHome: <https://builds.apache.org/job/JMeter-trunk/ws/src/functions/../../.>
    Initializing Properties: ../.././bin/jmeter.properties
    JMeterVersion=5.3-SNAPSHOT fee5548
    java.version=1.8.0_191
    java.vm.name=Java HotSpot(TM) 64-Bit Server VM
    java.vendor=Oracle Corporation
    java.home=/usr/local/asfpackages/java/jdk1.8.0_191/jre
    file.encoding=ISO-8859-1
    default encoding=ISO-8859-1
    user.home=/home/jenkins
    user.dir=<https://builds.apache.org/job/JMeter-trunk/ws/src/functions>
    user.language=en
    user.region=null
    user.country=US
    user.variant=
    Locale=en_US
    java.class.version=52.0
    java.awt.headless=null
    os.name=Linux
    os.version=4.15.0-74-generic
    os.arch=amd64

> Task :src:protocol:http:spotbugsMain
SpotBugs rule violations were found. See the report at: file://<https://builds.apache.org/job/JMeter-trunk/ws/src/protocol/http/build/reports/spotbugs/main.xml>

> Task :src:functions:check
> Task :src:functions:assemble UP-TO-DATE

> Task :src:protocol:http:spotbugsTest
SpotBugs rule violations were found. See the report at: file://<https://builds.apache.org/job/JMeter-trunk/ws/src/protocol/http/build/reports/spotbugs/test.xml>

> Task :src:protocol:http:test

Gradle Test Executor 58 STANDARD_OUT
    Setting JMeterHome: <https://builds.apache.org/job/JMeter-trunk/ws/src/protocol/http/../../../.>
    Initializing Properties: ../../.././bin/jmeter.properties
    JMeterVersion=5.3-SNAPSHOT fee5548
    java.version=1.8.0_191
    java.vm.name=Java HotSpot(TM) 64-Bit Server VM
    java.vendor=Oracle Corporation
    java.home=/usr/local/asfpackages/java/jdk1.8.0_191/jre
    file.encoding=ISO-8859-1
    default encoding=ISO-8859-1
    user.home=/home/jenkins
    user.dir=<https://builds.apache.org/job/JMeter-trunk/ws/src/protocol/http>
    user.language=en
    user.region=null
    user.country=US
    user.variant=
    Locale=en_US
    java.class.version=52.0
    java.awt.headless=null
    os.name=Linux
    os.version=4.15.0-74-generic
    os.arch=amd64

> Task :src:protocol:http:check
> Task :src:protocol:http:assemble UP-TO-DATE
> Task :src:dist:compileTestJava NO-SOURCE
> Task :src:dist:testClasses UP-TO-DATE
> Task :src:dist:checkstyleTest NO-SOURCE
> Task :src:dist:spotbugsMain NO-SOURCE
> Task :src:dist:spotbugsTest NO-SOURCE
> Task :src:dist:test NO-SOURCE
> Task :src:dist:check
> Task :src:dist:populateLibs
> Task :src:dist:copyBinLibs UP-TO-DATE
> Task :src:dist:copyLibs
> Task :src:dist:createDist
> Task :src:dist-check:copyExtraTestLibs
> Task :src:dist-check:batchBUG_62847
> Task :src:dist:distTar
> Task :src:dist:distTarSha512
> Task :src:dist-check:batchBatchTestLocal
> Task :src:dist-check:batchBug50898
> Task :src:dist:distZip
> Task :src:dist-check:batchBug52968
> Task :src:dist:distZipSha512
> Task :src:dist:previewSite
> Task :src:dist:assemble
> Task :src:dist-check:batchBug54685
> Task :src:dist-check:batchBug55375
> Task :src:dist-check:batchBug56243
> Task :src:dist-check:batchBug56811
> Task :src:dist-check:batchBug62239
> Task :src:dist-check:batchFTP_TESTS
> Task :src:dist-check:batchHTMLParserTestFile_2
> Task :src:dist-check:batchHttp4ImplDigestAuth
> Task :src:dist-check:batchHttp4ImplPreemptiveBasicAuth
> Task :src:dist-check:batchHttp4ImplPreemptiveBasicAuthJava
> Task :src:dist-check:batchJDBC_TESTS FAILED
checksum-dependency elapsed time: 33902ms, configurations processed: 354
    SHA-512 computation time: 2136ms (goes in parallel, it might exceed wall-clock time),
files processed: 52, processed: 8MiB, skipped: 3547MiB
    PGP signature resolution time: 5027ms (wall-clock), resolution requests: 209, signatures
resolved: 219
    PGP key resolution time: 20198ms (wall-clock), resolution requests: 209, download time:
0ms (goes in parallel, it might exceed wall-clock time), keys downloaded: 0
        PGP signature verification time: 61285ms (goes in parallel, it might exceed wall-clock
time), files processed: 560, processed: 666MiB, skipped: 2849MiB

FAILURE: Build failed with an exception.

* What went wrong:
Execution failed for task ':src:dist-check:batchJDBC_TESTS'.
> Failures detected while testing <https://builds.apache.org/job/JMeter-trunk/ws/bin/testfiles/JDBC_TESTS.jmx>:
[unexpected output JDBC_TESTS.xml]

* Try:
Run with --stacktrace option to get the stack trace. Run with --info or --debug option to
get more log output. Run with --scan to get full insights.

* Get more help at https://help.gradle.org

Deprecated Gradle features were used in this build, making it incompatible with Gradle 7.0.
Use '--warning-mode all' to show the individual deprecation warnings.
See https://docs.gradle.org/6.1/userguide/command_line_interface.html#sec:command_line_warnings

BUILD FAILED in 8m 39s
346 actionable tasks: 234 executed, 112 up-to-date

See the profiling report at: file://<https://builds.apache.org/job/JMeter-trunk/ws/build/reports/profile/profile-2020-02-16-13-09-49.html>
A fine-grained performance profile is available: use the --scan option.
Build step 'Invoke Gradle script' changed build result to FAILURE
Build step 'Invoke Gradle script' marked build as failure
Xvfb stopping
Archiving artifacts
[Fast Archiver] Compressed 154.72 MB of artifacts by 49.8% relative to #7611
Recording test results

Mime
View raw message