jmeter-dev mailing list archives

Site index · List index
Message view « Date » · « Thread »
Top « Date » · « Thread »
From Apache Jenkins Server <jenk...@builds.apache.org>
Subject Build failed in Jenkins: JMeter Ubuntu #976
Date Fri, 21 Feb 2020 12:09:44 GMT
See <https://builds.apache.org/job/JMeter%20Ubuntu/976/display/redirect?page=changes>

Changes:

[felix.schumacher] Updated junit4 and junit5

[felix.schumacher] Updated slf4j to 1.7.30 (from 1.7.28)

[felix.schumacher] License overrides for asm and jcl-over-slf4j are not needed anymore


------------------------------------------
[...truncated 205.98 KB...]
Waiting for possible Shutdown/StopTestNow/HeapDump/ThreadDump message on port 4445
summary =      9 in 00:00:00 =   48.4/s Avg:     1 Min:     0 Max:     9 Err:     0 (0.00%)
Tidying up ...    @ Fri Feb 21 12:08:29 UTC 2020 (1582286909697)
... end of run
No errors present in the logfile <https://builds.apache.org/job/JMeter%20Ubuntu/ws/bin/Bug56243.log>
(the file is empty)

> Task :src:dist-check:batchBug56811
Creating summariser <summary>
Created the tree successfully using <https://builds.apache.org/job/JMeter%20Ubuntu/ws/bin/testfiles/Bug56811.jmx>
Starting standalone test @ Fri Feb 21 12:08:32 UTC 2020 (1582286912395)
Waiting for possible Shutdown/StopTestNow/HeapDump/ThreadDump message on port 4445
summary +      1 in 00:00:00 =    2.2/s Avg:     6 Min:     6 Max:     6 Err:     0 (0.00%)
Active: 1 Started: 4 Finished: 3
summary +      8 in 00:00:00 =  181.8/s Avg:     3 Min:     0 Max:     7 Err:     3 (37.50%)
Active: 0 Started: 4 Finished: 4
summary =      9 in 00:00:00 =   18.2/s Avg:     4 Min:     0 Max:     7 Err:     3 (33.33%)
Tidying up ...    @ Fri Feb 21 12:08:33 UTC 2020 (1582286913647)
... end of run
No errors present in the logfile <https://builds.apache.org/job/JMeter%20Ubuntu/ws/bin/Bug56811.log>
(the file is empty)

> Task :src:dist-check:batchBug62239
Creating summariser <summary>
Created the tree successfully using <https://builds.apache.org/job/JMeter%20Ubuntu/ws/bin/testfiles/Bug62239.jmx>
Starting standalone test @ Fri Feb 21 12:08:36 UTC 2020 (1582286916724)
Waiting for possible Shutdown/StopTestNow/HeapDump/ThreadDump message on port 4445
summary =    108 in 00:00:00 =  252.3/s Avg:     0 Min:     0 Max:     2 Err:     0 (0.00%)
Tidying up ...    @ Fri Feb 21 12:08:37 UTC 2020 (1582286917388)
... end of run
No errors present in the logfile <https://builds.apache.org/job/JMeter%20Ubuntu/ws/bin/Bug62239.log>
(the file is empty)

> Task :src:dist-check:batchFTP_TESTS
Creating summariser <summary>
Created the tree successfully using <https://builds.apache.org/job/JMeter%20Ubuntu/ws/bin/testfiles/FTP_TESTS.jmx>
Starting standalone test @ Fri Feb 21 12:08:39 UTC 2020 (1582286919935)
Waiting for possible Shutdown/StopTestNow/HeapDump/ThreadDump message on port 4445
summary =      6 in 00:00:03 =    2.2/s Avg:   228 Min:    14 Max:  1117 Err:     0 (0.00%)
Tidying up ...    @ Fri Feb 21 12:08:43 UTC 2020 (1582286923754)
... end of run
No errors present in the logfile <https://builds.apache.org/job/JMeter%20Ubuntu/ws/bin/FTP_TESTS.log>
(the file is empty)

> Task :src:dist-check:batchHTMLParserTestFile_2
Creating summariser <summary>
Created the tree successfully using <https://builds.apache.org/job/JMeter%20Ubuntu/ws/bin/testfiles/HTMLParserTestFile_2.jmx>
Starting standalone test @ Fri Feb 21 12:08:46 UTC 2020 (1582286926204)
Waiting for possible Shutdown/StopTestNow/HeapDump/ThreadDump message on port 4445
summary =      1 in 00:00:00 =    2.6/s Avg:   178 Min:   178 Max:   178 Err:     0 (0.00%)
Tidying up ...    @ Fri Feb 21 12:08:47 UTC 2020 (1582286927320)
... end of run
No errors present in the logfile <https://builds.apache.org/job/JMeter%20Ubuntu/ws/bin/HTMLParserTestFile_2.log>
(the file is empty)

> Task :src:dist-check:batchHttp4ImplDigestAuth
Creating summariser <summary>
Created the tree successfully using <https://builds.apache.org/job/JMeter%20Ubuntu/ws/bin/testfiles/Http4ImplDigestAuth.jmx>
Starting standalone test @ Fri Feb 21 12:08:49 UTC 2020 (1582286929855)
Waiting for possible Shutdown/StopTestNow/HeapDump/ThreadDump message on port 4445
summary =      2 in 00:00:02 =    0.8/s Avg:   756 Min:   207 Max:  1306 Err:     0 (0.00%)
Tidying up ...    @ Fri Feb 21 12:08:52 UTC 2020 (1582286932970)
... end of run
No errors present in the logfile <https://builds.apache.org/job/JMeter%20Ubuntu/ws/bin/Http4ImplDigestAuth.log>
(the file is empty)

> Task :src:dist-check:batchHttp4ImplPreemptiveBasicAuth
Creating summariser <summary>
Created the tree successfully using <https://builds.apache.org/job/JMeter%20Ubuntu/ws/bin/testfiles/Http4ImplPreemptiveBasicAuth.jmx>
Starting standalone test @ Fri Feb 21 12:08:55 UTC 2020 (1582286935596)
Waiting for possible Shutdown/StopTestNow/HeapDump/ThreadDump message on port 4445
summary +      3 in 00:00:06 =    0.5/s Avg:  1299 Min:   168 Max:  3030 Err:     0 (0.00%)
Active: 1 Started: 2 Finished: 1
summary +      9 in 00:00:16 =    0.6/s Avg:  1533 Min:   167 Max:  2920 Err:     0 (0.00%)
Active: 0 Started: 6 Finished: 6
summary =     12 in 00:00:21 =    0.6/s Avg:  1474 Min:   167 Max:  3030 Err:     0 (0.00%)
Tidying up ...    @ Fri Feb 21 12:09:17 UTC 2020 (1582286957941)
... end of run
No errors present in the logfile <https://builds.apache.org/job/JMeter%20Ubuntu/ws/bin/Http4ImplPreemptiveBasicAuth.log>
(the file is empty)

> Task :src:dist-check:batchHttp4ImplPreemptiveBasicAuthJava
Creating summariser <summary>
Created the tree successfully using <https://builds.apache.org/job/JMeter%20Ubuntu/ws/bin/testfiles/Http4ImplPreemptiveBasicAuth.jmx>
Starting standalone test @ Fri Feb 21 12:09:20 UTC 2020 (1582286960594)
Waiting for possible Shutdown/StopTestNow/HeapDump/ThreadDump message on port 4445
summary +      7 in 00:00:13 =    0.5/s Avg:  1528 Min:   167 Max:  5280 Err:     3 (42.86%)
Active: 1 Started: 4 Finished: 3
summary +      5 in 00:00:07 =    0.7/s Avg:  1269 Min:   167 Max:  2007 Err:     3 (60.00%)
Active: 0 Started: 6 Finished: 6
summary =     12 in 00:00:20 =    0.6/s Avg:  1420 Min:   167 Max:  5280 Err:     6 (50.00%)
Tidying up ...    @ Fri Feb 21 12:09:42 UTC 2020 (1582286982071)
... end of run
ERROR: unexpected output for Http4ImplPreemptiveBasicAuth.csv:
  - expected 853 bytes, <https://builds.apache.org/job/JMeter%20Ubuntu/ws/bin/testfiles/Http4ImplPreemptiveBasicAuth.csv>
  + actual 1420 bytes, <https://builds.apache.org/job/JMeter%20Ubuntu/ws/bin/Http4ImplPreemptiveBasicAuth.csv>
@@ -1,13 +1,13 @@
 label,responseCode,responseMessage,threadName,dataType,success
 HTTP-Request-WithNoMatchingAuth,200,OK,Thread Group 1-1,text,true
 HTTP-Request-WithNoMatchingAuth,200,OK,Thread Group 1-1,text,true
-HTTPS-Request-WithNoMatchingAuth,200,OK,Thread Group 2-1,text,true
-HTTPS-Request-WithNoMatchingAuth,200,OK,Thread Group 2-1,text,true
+HTTPS-Request-WithNoMatchingAuth,Non HTTP response code: java.net.SocketTimeoutException,Non
HTTP response message: connect timed out,Thread Group 2-1,text,false
+HTTPS-Request-WithNoMatchingAuth,Non HTTP response code: java.net.SocketTimeoutException,Non
HTTP response message: connect timed out,Thread Group 2-1,text,false
 HTTP-Request-NoAuthManager,200,OK,Thread Group 3-1,text,true
 HTTP-Request-NoAuthManager,200,OK,Thread Group 3-1,text,true
-HTTPS-Request-NoAuthManager,200,OK,Thread Group 4-1,text,true
-HTTPS-Request-NoAuthManager,200,OK,Thread Group 4-1,text,true
+HTTPS-Request-NoAuthManager,Non HTTP response code: java.net.SocketTimeoutException,Non HTTP
response message: Read timed out,Thread Group 4-1,text,false
+HTTPS-Request-NoAuthManager,Non HTTP response code: java.net.SocketTimeoutException,Non HTTP
response message: connect timed out,Thread Group 4-1,text,false
 HTTP-Request-WithMatchingBasicAuth,200,OK,Thread Group 5-1,text,true
 HTTP-Request-WithMatchingBasicAuth,200,OK,Thread Group 5-1,text,true
-HTTPS-Request-WithMatchingBasicAuth,200,OK,Thread Group 6-1,text,true
-HTTPS-Request-WithMatchingBasicAuth,200,OK,Thread Group 6-1,text,true
+HTTPS-Request-WithMatchingBasicAuth,Non HTTP response code: java.net.SocketTimeoutException,Non
HTTP response message: connect timed out,Thread Group 6-1,text,false
+HTTPS-Request-WithMatchingBasicAuth,Non HTTP response code: java.net.SocketTimeoutException,Non
HTTP response message: connect timed out,Thread Group 6-1,text,false
ERROR: unexpected output for Http4ImplPreemptiveBasicAuth.xml:
  - expected 3165 bytes, <https://builds.apache.org/job/JMeter%20Ubuntu/ws/bin/testfiles/Http4ImplPreemptiveBasicAuth.xml>
  + actual 3732 bytes, <https://builds.apache.org/job/JMeter%20Ubuntu/ws/bin/Http4ImplPreemptiveBasicAuth.xml>
@@ -14,14 +14,14 @@
     <error>false</error>
   </assertionResult>
 </httpSample>
-<httpSample s="true" lb="HTTPS-Request-WithNoMatchingAuth" rc="200" rm="OK" tn="Thread
Group 2-1" dt="text">
+<httpSample s="false" lb="HTTPS-Request-WithNoMatchingAuth" rc="Non HTTP response code:
java.net.SocketTimeoutException" rm="Non HTTP response message: connect timed out" tn="Thread
Group 2-1" dt="text">
   <assertionResult>
     <name>JSA_CheckAuthorization</name>
     <failure>false</failure>
     <error>false</error>
   </assertionResult>
 </httpSample>
-<httpSample s="true" lb="HTTPS-Request-WithNoMatchingAuth" rc="200" rm="OK" tn="Thread
Group 2-1" dt="text">
+<httpSample s="false" lb="HTTPS-Request-WithNoMatchingAuth" rc="Non HTTP response code:
java.net.SocketTimeoutException" rm="Non HTTP response message: connect timed out" tn="Thread
Group 2-1" dt="text">
   <assertionResult>
     <name>JSA_CheckAuthorization</name>
     <failure>false</failure>
@@ -42,14 +42,14 @@
     <error>false</error>
   </assertionResult>
 </httpSample>
-<httpSample s="true" lb="HTTPS-Request-NoAuthManager" rc="200" rm="OK" tn="Thread Group
4-1" dt="text">
+<httpSample s="false" lb="HTTPS-Request-NoAuthManager" rc="Non HTTP response code: java.net.SocketTimeoutException"
rm="Non HTTP response message: Read timed out" tn="Thread Group 4-1" dt="text">
   <assertionResult>
     <name>JSA_CheckAuthorization</name>
     <failure>false</failure>
     <error>false</error>
   </assertionResult>
 </httpSample>
-<httpSample s="true" lb="HTTPS-Request-NoAuthManager" rc="200" rm="OK" tn="Thread Group
4-1" dt="text">
+<httpSample s="false" lb="HTTPS-Request-NoAuthManager" rc="Non HTTP response code: java.net.SocketTimeoutException"
rm="Non HTTP response message: connect timed out" tn="Thread Group 4-1" dt="text">
   <assertionResult>
     <name>JSA_CheckAuthorization</name>
     <failure>false</failure>
@@ -70,14 +70,14 @@
     <error>false</error>
   </assertionResult>
 </httpSample>
-<httpSample s="true" lb="HTTPS-Request-WithMatchingBasicAuth" rc="200" rm="OK" tn="Thread
Group 6-1" dt="text">
+<httpSample s="false" lb="HTTPS-Request-WithMatchingBasicAuth" rc="Non HTTP response code:
java.net.SocketTimeoutException" rm="Non HTTP response message: connect timed out" tn="Thread
Group 6-1" dt="text">
   <assertionResult>
     <name>JSA_CheckAuthorization</name>
     <failure>false</failure>
     <error>false</error>
   </assertionResult>
 </httpSample>
-<httpSample s="true" lb="HTTPS-Request-WithMatchingBasicAuth" rc="200" rm="OK" tn="Thread
Group 6-1" dt="text">
+<httpSample s="false" lb="HTTPS-Request-WithMatchingBasicAuth" rc="Non HTTP response code:
java.net.SocketTimeoutException" rm="Non HTTP response message: connect timed out" tn="Thread
Group 6-1" dt="text">
   <assertionResult>
     <name>JSA_CheckAuthorization</name>
     <failure>false</failure>
No errors present in the logfile <https://builds.apache.org/job/JMeter%20Ubuntu/ws/bin/Http4ImplPreemptiveBasicAuth.log>
(the file is empty)

> Task :src:dist-check:batchHttp4ImplPreemptiveBasicAuthJava FAILED
checksum-dependency elapsed time: 12023ms, configurations processed: 237 (add -PchecksumTimingsPrint
to print detailed timings)

Build jmeter FAILURE reason:                                
    Execution failed for task ':src:dist-check:batchHttp4ImplPreemptiveBasicAuthJava':
        Failures detected while testing <https://builds.apache.org/job/JMeter%20Ubuntu/ws/bin/testfiles/Http4ImplPreemptiveBasicAuth.jmx>:
[unexpected output Http4ImplPreemptiveBasicAuth.csv, unexpected output Http4ImplPreemptiveBasicAuth.xml]
            at org.apache.jmeter.buildtools.batchtest.BatchTest.exec(BatchTest.kt:184)
            at org.gradle.internal.reflect.JavaMethod.invoke(JavaMethod.java:104)
            at org.gradle.api.internal.project.taskfactory.StandardTaskAction.doExecute(StandardTaskAction.java:49)
            at org.gradle.api.internal.project.taskfactory.StandardTaskAction.execute(StandardTaskAction.java:42)
            at org.gradle.api.internal.project.taskfactory.StandardTaskAction.execute(StandardTaskAction.java:28)
            at org.gradle.api.internal.AbstractTask$TaskActionWrapper.execute(AbstractTask.java:727)
            at org.gradle.api.internal.AbstractTask$TaskActionWrapper.execute(AbstractTask.java:694)
            at org.gradle.api.internal.tasks.execution.ExecuteActionsTaskExecuter$3.run(ExecuteActionsTaskExecuter.java:568)
            at org.gradle.internal.operations.DefaultBuildOperationExecutor$RunnableBuildOperationWorker.execute(DefaultBuildOperationExecutor.java:402)
            at org.gradle.internal.operations.DefaultBuildOperationExecutor$RunnableBuildOperationWorker.execute(DefaultBuildOperationExecutor.java:394)
            at org.gradle.internal.operations.DefaultBuildOperationExecutor$1.execute(DefaultBuildOperationExecutor.java:165)
            at org.gradle.internal.operations.DefaultBuildOperationExecutor.execute(DefaultBuildOperationExecutor.java:250)
            at org.gradle.internal.operations.DefaultBuildOperationExecutor.execute(DefaultBuildOperationExecutor.java:158)
            at org.gradle.internal.operations.DefaultBuildOperationExecutor.run(DefaultBuildOperationExecutor.java:92)
            at org.gradle.internal.operations.DelegatingBuildOperationExecutor.run(DelegatingBuildOperationExecutor.java:31)
            at org.gradle.api.internal.tasks.execution.ExecuteActionsTaskExecuter.executeAction(ExecuteActionsTaskExecuter.java:553)
            at org.gradle.api.internal.tasks.execution.ExecuteActionsTaskExecuter.executeActions(ExecuteActionsTaskExecuter.java:536)
            at org.gradle.api.internal.tasks.execution.ExecuteActionsTaskExecuter.access$300(ExecuteActionsTaskExecuter.java:109)
            at org.gradle.api.internal.tasks.execution.ExecuteActionsTaskExecuter$TaskExecution.executeWithPreviousOutputFiles(ExecuteActionsTaskExecuter.java:276)
            at org.gradle.api.internal.tasks.execution.ExecuteActionsTaskExecuter$TaskExecution.execute(ExecuteActionsTaskExecuter.java:265)
            at org.gradle.internal.execution.steps.ExecuteStep.lambda$execute$1(ExecuteStep.java:33)
            at org.gradle.internal.execution.steps.ExecuteStep.execute(ExecuteStep.java:33)
            at org.gradle.internal.execution.steps.ExecuteStep.execute(ExecuteStep.java:26)
            at org.gradle.internal.execution.steps.CleanupOutputsStep.execute(CleanupOutputsStep.java:63)
            at org.gradle.internal.execution.steps.CleanupOutputsStep.execute(CleanupOutputsStep.java:35)
            at org.gradle.internal.execution.steps.ResolveInputChangesStep.execute(ResolveInputChangesStep.java:49)
            at org.gradle.internal.execution.steps.ResolveInputChangesStep.execute(ResolveInputChangesStep.java:34)
            at org.gradle.internal.execution.steps.CancelExecutionStep.execute(CancelExecutionStep.java:43)
            at org.gradle.internal.execution.steps.TimeoutStep.executeWithoutTimeout(TimeoutStep.java:73)
            at org.gradle.internal.execution.steps.TimeoutStep.execute(TimeoutStep.java:54)
            at org.gradle.internal.execution.steps.CatchExceptionStep.execute(CatchExceptionStep.java:34)
            at org.gradle.internal.execution.steps.CreateOutputsStep.execute(CreateOutputsStep.java:44)
            at org.gradle.internal.execution.steps.SnapshotOutputsStep.execute(SnapshotOutputsStep.java:54)
            at org.gradle.internal.execution.steps.SnapshotOutputsStep.execute(SnapshotOutputsStep.java:38)
            at org.gradle.internal.execution.steps.BroadcastChangingOutputsStep.execute(BroadcastChangingOutputsStep.java:49)
            at org.gradle.internal.execution.steps.CacheStep.executeWithoutCache(CacheStep.java:153)
            at org.gradle.internal.execution.steps.CacheStep.execute(CacheStep.java:67)
            at org.gradle.internal.execution.steps.CacheStep.execute(CacheStep.java:41)
            at org.gradle.internal.execution.steps.StoreExecutionStateStep.execute(StoreExecutionStateStep.java:44)
            at org.gradle.internal.execution.steps.StoreExecutionStateStep.execute(StoreExecutionStateStep.java:33)
            at org.gradle.internal.execution.steps.RecordOutputsStep.execute(RecordOutputsStep.java:38)
            at org.gradle.internal.execution.steps.RecordOutputsStep.execute(RecordOutputsStep.java:24)
            at org.gradle.internal.execution.steps.SkipUpToDateStep.executeBecause(SkipUpToDateStep.java:92)
            at org.gradle.internal.execution.steps.SkipUpToDateStep.lambda$execute$0(SkipUpToDateStep.java:85)
            at org.gradle.internal.execution.steps.SkipUpToDateStep.execute(SkipUpToDateStep.java:55)
            at org.gradle.internal.execution.steps.SkipUpToDateStep.execute(SkipUpToDateStep.java:39)
            at org.gradle.internal.execution.steps.ResolveChangesStep.execute(ResolveChangesStep.java:76)
            at org.gradle.internal.execution.steps.ResolveChangesStep.execute(ResolveChangesStep.java:37)
            at org.gradle.internal.execution.steps.legacy.MarkSnapshottingInputsFinishedStep.execute(MarkSnapshottingInputsFinishedStep.java:36)
            at org.gradle.internal.execution.steps.legacy.MarkSnapshottingInputsFinishedStep.execute(MarkSnapshottingInputsFinishedStep.java:26)
            at org.gradle.internal.execution.steps.ResolveCachingStateStep.execute(ResolveCachingStateStep.java:94)
            at org.gradle.internal.execution.steps.ResolveCachingStateStep.execute(ResolveCachingStateStep.java:49)
            at org.gradle.internal.execution.steps.CaptureStateBeforeExecutionStep.execute(CaptureStateBeforeExecutionStep.java:79)
            at org.gradle.internal.execution.steps.CaptureStateBeforeExecutionStep.execute(CaptureStateBeforeExecutionStep.java:53)
            at org.gradle.internal.execution.steps.ValidateStep.execute(ValidateStep.java:74)
            at org.gradle.internal.execution.steps.SkipEmptyWorkStep.lambda$execute$2(SkipEmptyWorkStep.java:78)
            at org.gradle.internal.execution.steps.SkipEmptyWorkStep.execute(SkipEmptyWorkStep.java:78)
            at org.gradle.internal.execution.steps.SkipEmptyWorkStep.execute(SkipEmptyWorkStep.java:34)
            at org.gradle.internal.execution.steps.legacy.MarkSnapshottingInputsStartedStep.execute(MarkSnapshottingInputsStartedStep.java:39)
            at org.gradle.internal.execution.steps.LoadExecutionStateStep.execute(LoadExecutionStateStep.java:40)
            at org.gradle.internal.execution.steps.LoadExecutionStateStep.execute(LoadExecutionStateStep.java:28)


FAILURE: Build failed with an exception.

* What went wrong:
Execution failed for task ':src:dist-check:batchHttp4ImplPreemptiveBasicAuthJava'.
> Failures detected while testing <https://builds.apache.org/job/JMeter%20Ubuntu/ws/bin/testfiles/Http4ImplPreemptiveBasicAuth.jmx>:
[unexpected output Http4ImplPreemptiveBasicAuth.csv, unexpected output Http4ImplPreemptiveBasicAuth.xml]

* Try:
Run with --stacktrace option to get the stack trace. Run with --info or --debug option to
get more log output. Run with --scan to get full insights.

* Get more help at https://help.gradle.org

Deprecated Gradle features were used in this build, making it incompatible with Gradle 7.0.
Use '--warning-mode all' to show the individual deprecation warnings.
See https://docs.gradle.org/6.1/userguide/command_line_interface.html#sec:command_line_warnings

BUILD FAILED in 3m 18s
247 actionable tasks: 183 executed, 64 up-to-date
Build step 'Invoke Gradle script' changed build result to FAILURE
Build step 'Invoke Gradle script' marked build as failure
[locks-and-latches] Releasing all the locks
[locks-and-latches] All the locks released

Mime
View raw message