jmeter-dev mailing list archives

Site index · List index
Message view « Date » · « Thread »
Top « Date » · « Thread »
From Apache Jenkins Server <jenk...@builds.apache.org>
Subject Build failed in Jenkins: JMeter-trunk #7713
Date Tue, 07 Apr 2020 09:58:05 GMT
See <https://builds.apache.org/job/JMeter-trunk/7713/display/redirect?page=changes>

Changes:

[sitnikov.vladimir] UX: align component fields with name and description fields


------------------------------------------
[...truncated 63.06 KB...]
> Task :src:protocol:mongodb:autostyleConfigsCheck
> Task :src:bshclient:compileJava UP-TO-DATE
> Task :src:protocol:native:autostyleConfigsCheck NO-SOURCE
> Task :src:protocol:tcp:autostyleConfigsCheck NO-SOURCE
> Task :src:protocol:mail:autostyleConfigsCheck NO-SOURCE
> Task :src:config:compileTestJava NO-SOURCE
> Task :src:protocol:checkstyleMain NO-SOURCE
> Task :src:licenses:checkstyleMain NO-SOURCE
> Task :src:release:checkstyleMain NO-SOURCE
> Task :src:testkit-wiremock:compileTestJava NO-SOURCE
> Task :src:examples:processTestResources NO-SOURCE
> Task :src:protocol:junit-sample:autostyleMarkdownCheck NO-SOURCE
> Task :src:protocol:junit-sample:autostyleCheck
> Task :src:testkit:checkstyleMain UP-TO-DATE
> Task :src:dist:preparePropertiesbuildPrintableDoc UP-TO-DATE
> Task :src:protocol:junit:autostyleMarkdownCheck NO-SOURCE
> Task :src:config:processTestResources NO-SOURCE
> Task :src:protocol:compileTestJava NO-SOURCE
> Task :src:release:compileTestJava NO-SOURCE
> Task :src:licenses:compileTestJava NO-SOURCE
> Task :src:bshclient:processResources NO-SOURCE
> Task :src:jorphan:processResources UP-TO-DATE
> Task :src:protocol:native:autostyleJavaCheck
> Task :src:protocol:jms:autostyleJavaCheck
> Task :src:protocol:ldap:autostyleJavaCheck
> Task :src:protocol:mongodb:autostyleJavaCheck
> Task :src:jorphan:classes UP-TO-DATE
> Task :src:bshclient:classes UP-TO-DATE
> Task :src:testkit-wiremock:processTestResources NO-SOURCE
> Task :src:protocol:native:autostyleKotlinGradleCheck NO-SOURCE
> Task :src:protocol:mongodb:autostyleKotlinGradleCheck NO-SOURCE
> Task :src:protocol:jms:autostyleKotlinGradleCheck NO-SOURCE
> Task :src:protocol:ldap:autostyleKotlinGradleCheck NO-SOURCE
> Task :src:protocol:tcp:autostyleJavaCheck
> Task :src:config:testClasses UP-TO-DATE
> Task :src:licenses:processTestResources NO-SOURCE
> Task :src:protocol:processTestResources NO-SOURCE
> Task :src:protocol:junit:autostyleCheck
> Task :src:protocol:testClasses UP-TO-DATE
> Task :src:licenses:testClasses UP-TO-DATE
> Task :src:protocol:junit-sample:processTestResources NO-SOURCE
> Task :src:testkit-wiremock:testClasses UP-TO-DATE
> Task :src:jorphan:jar UP-TO-DATE
> Task :src:protocol:mail:autostyleJavaCheck
> Task :src:testkit:compileTestJava NO-SOURCE
> Task :src:licenses:checkstyleTest NO-SOURCE
> Task :src:release:processTestResources NO-SOURCE
> Task :src:config:checkstyleTest NO-SOURCE
> Task :src:protocol:ldap:autostyleMarkdownCheck NO-SOURCE
> Task :src:protocol:tcp:autostyleKotlinGradleCheck NO-SOURCE
> Task :src:protocol:jms:autostyleMarkdownCheck NO-SOURCE
> Task :src:protocol:mongodb:autostyleMarkdownCheck NO-SOURCE
> Task :src:bshclient:checkstyleMain UP-TO-DATE
> Task :src:protocol:native:autostyleMarkdownCheck NO-SOURCE
> Task :src:launcher:checkstyleMain UP-TO-DATE
> Task :src:testkit-wiremock:checkstyleTest NO-SOURCE
> Task :src:protocol:checkstyleTest NO-SOURCE
> Task :src:testkit-wiremock:checkstyleTestFixtures NO-SOURCE
> Task :src:protocol:native:autostyleCheck
> Task :src:dist-check:processTestResources UP-TO-DATE
> Task :src:protocol:jms:autostyleCheck
> Task :src:protocol:ldap:autostyleCheck
> Task :src:release:testClasses UP-TO-DATE
> Task :src:bshclient:compileTestJava NO-SOURCE
> Task :src:protocol:mongodb:autostyleCheck
> Task :src:launcher:compileTestJava NO-SOURCE
> Task :src:release:checkstyleTest NO-SOURCE
> Task :src:bshclient:processTestResources NO-SOURCE
> Task :src:testkit:processTestResources NO-SOURCE
> Task :src:testkit:testClasses UP-TO-DATE
> Task :src:launcher:processTestResources NO-SOURCE
> Task :src:protocol:mail:autostyleKotlinGradleCheck NO-SOURCE
> Task :src:licenses:spotbugsMain NO-SOURCE
> Task :src:config:spotbugsMain NO-SOURCE
> Task :src:protocol:spotbugsMain NO-SOURCE
> Task :src:protocol:tcp:autostyleMarkdownCheck NO-SOURCE
> Task :src:release:spotbugsMain NO-SOURCE
> Task :src:testkit:checkstyleTest NO-SOURCE
> Task :src:protocol:tcp:autostyleCheck
> Task :src:testkit:checkstyleTestFixtures NO-SOURCE
> Task :src:launcher:testClasses UP-TO-DATE
> Task :src:bshclient:testClasses UP-TO-DATE
> Task :src:protocol:spotbugsTest NO-SOURCE
> Task :src:config:spotbugsTest NO-SOURCE
> Task :src:licenses:spotbugsTest NO-SOURCE
> Task :src:release:spotbugsTest NO-SOURCE
> Task :src:protocol:mail:autostyleMarkdownCheck NO-SOURCE
> Task :src:protocol:mail:autostyleCheck
> Task :src:config:test NO-SOURCE
> Task :src:licenses:test NO-SOURCE
> Task :src:protocol:test NO-SOURCE
> Task :src:bshclient:checkstyleTest NO-SOURCE
> Task :src:launcher:checkstyleTest NO-SOURCE
> Task :src:release:test NO-SOURCE
> Task :src:config:check
> Task :src:protocol:check
> Task :src:licenses:check
> Task :src:release:check
> Task :src:release:jar UP-TO-DATE
> Task :src:release:assemble UP-TO-DATE
> Task :src:protocol:jar UP-TO-DATE
> Task :src:protocol:assemble UP-TO-DATE
> Task :autostyleConfigsCheck
> Task :src:jorphan:compileTestJava UP-TO-DATE
> Task :autostyleJavaCheck NO-SOURCE
> Task :src:licenses:gatherSourceLicenses UP-TO-DATE
> Task :src:jorphan:compileTestGroovy UP-TO-DATE
> Task :src:jorphan:processTestResources NO-SOURCE
> Task :src:jorphan:testClasses UP-TO-DATE
> Task :src:licenses:renderLicenseForSource UP-TO-DATE
> Task :src:testkit:spotbugsMain UP-TO-DATE
> Task :src:launcher:spotbugsMain UP-TO-DATE
> Task :src:bshclient:spotbugsMain UP-TO-DATE
> Task :src:testkit:spotbugsTest NO-SOURCE
> Task :src:launcher:spotbugsTest NO-SOURCE
> Task :src:bshclient:spotbugsTest NO-SOURCE
> Task :src:testkit:spotbugsTestFixtures NO-SOURCE
> Task :src:launcher:test NO-SOURCE
> Task :src:bshclient:test NO-SOURCE
> Task :src:launcher:check
> Task :src:testkit:test NO-SOURCE
> Task :src:launcher:assemble UP-TO-DATE
> Task :src:testkit:check
> Task :src:bshclient:check
> Task :src:testkit:assemble UP-TO-DATE
> Task :src:jorphan:testJar UP-TO-DATE
> Task :src:jorphan:autostyleConfigsCheck NO-SOURCE
> Task :src:bshclient:jar UP-TO-DATE
> Task :src:bshclient:assemble UP-TO-DATE
> Task :src:jorphan:autostyleGroovyCheck
> Task :src:licenses:renderLicenseForSourceCopySpec
> Task :src:core:autostyleConfigsCheck
> Task :autostyleKotlinGradleCheck
> Task :src:protocol:http:autostyleJavaCheck
> Task :src:dist-check:populateLibs
> Task :src:components:autostyleConfigsCheck
> Task :src:protocol:http:autostyleKotlinGradleCheck NO-SOURCE
> Task :src:testkit-wiremock:spotbugsMain UP-TO-DATE
> Task :src:protocol:http:autostyleMarkdownCheck NO-SOURCE
> Task :src:protocol:http:autostyleCheck
> Task :src:testkit-wiremock:spotbugsTest NO-SOURCE
> Task :src:testkit-wiremock:spotbugsTestFixtures NO-SOURCE
> Task :src:testkit-wiremock:test NO-SOURCE
> Task :src:testkit-wiremock:check
> Task :src:testkit-wiremock:assemble UP-TO-DATE
> Task :src:components:autostyleGroovyCheck
> Task :src:jorphan:autostyleJavaCheck
> Task :src:jorphan:autostyleKotlinGradleCheck
> Task :src:jorphan:autostyleMarkdownCheck NO-SOURCE
> Task :src:jorphan:autostyleCheck
> Task :src:jorphan:checkstyleMain UP-TO-DATE
> Task :src:jorphan:checkstyleTest UP-TO-DATE
> Task :autostyleMarkdownCheck
> Task :autostyleCheck
> Task :compileJava NO-SOURCE
> Task :processResources NO-SOURCE
> Task :classes UP-TO-DATE
> Task :checkstyleMain NO-SOURCE
> Task :src:licenses:srcLicenseDir UP-TO-DATE
> Task :src:jorphan:spotbugsMain UP-TO-DATE
> Task :compileTestJava NO-SOURCE
> Task :processTestResources NO-SOURCE
> Task :testClasses UP-TO-DATE
> Task :checkstyleTest NO-SOURCE
> Task :src:licenses:jar UP-TO-DATE
> Task :gitProps
> Task :src:dist:buildPrintableDoc
> Task :src:jorphan:spotbugsTest UP-TO-DATE
> Task :src:config:jar UP-TO-DATE
> Task :src:config:assemble UP-TO-DATE
> Task :src:components:autostyleJavaCheck FAILED

> Task :src:jorphan:test

ObjectTableModelTest > checkMoveRow_from_5_11_to_0() STANDARD_ERROR
    SLF4J: Failed to load class "org.slf4j.impl.StaticLoggerBinder".
    SLF4J: Defaulting to no-operation (NOP) logger implementation
    SLF4J: See http://www.slf4j.org/codes.html#StaticLoggerBinder for further details.
          0.2sec,    6 completed,   0 failed,   0 skipped, org.apache.jorphan.gui.ObjectTableModelTest

> Task :rat

> Task :src:jorphan:test
          0.3sec,   26 completed,   0 failed,   0 skipped, org.apache.jorphan.gui.ObjectTableSorterTest

> Task :src:core:compileJava
Note: Some input files use or override a deprecated API.
Note: Recompile with -Xlint:deprecation for details.
Note: <https://builds.apache.org/job/JMeter-trunk/ws/src/core/src/main/java/org/apache/jmeter/save/converters/TestElementPropertyConverter.java>
uses unchecked or unsafe operations.
Note: Recompile with -Xlint:unchecked for details.

> Task :src:jorphan:test
          3.9sec, org.apache.jorphan.exec.TestKeyToolUtils > testDNSNameBasedCert()
          3.4sec, org.apache.jorphan.exec.TestKeyToolUtils > testIPBasedCert()
         12.6sec,    3 completed,   0 failed,   0 skipped, org.apache.jorphan.exec.TestKeyToolUtils
WARNING   0.1sec,   10 completed,   0 failed,   2 skipped, org.apache.jorphan.math.TestStatCalculator
          0.1sec,    8 completed,   0 failed,   0 skipped, org.apache.jorphan.util.TestConverter
          0.1sec,   50 completed,   0 failed,   0 skipped, org.apache.jorphan.util.TestJorphanUtils
          0.0sec,    5 completed,   0 failed,   0 skipped, org.apache.jorphan.collections.PackageTest
          0.1sec,    4 completed,   0 failed,   0 skipped, org.apache.jorphan.reflect.TestClassTools
          0.4sec,   37 completed,   0 failed,   0 skipped, org.apache.commons.cli.avalon.ClutilTestCase
          1.2sec,    5 completed,   0 failed,   0 skipped, org.apache.jorphan.gui.MinMaxLongRendererTest
          0.9sec,   16 completed,   0 failed,   0 skipped, org.apache.jorphan.io.TextFileSpec
          0.2sec,   32 completed,   0 failed,   0 skipped, org.apache.jorphan.util.ConverterSpec
WARNING  20.9sec,  202 completed,   0 failed,   2 skipped, Gradle
Test Run :src:jorphan:test

> Task :src:dist:distTarSource
checksum-dependency elapsed time: 26437ms, configurations processed: 133
    SHA-512 computation time: 126ms (goes in parallel, it might exceed wall-clock time), files
processed: 33, processed: 5MiB, skipped: 1163MiB
    PGP signature resolution time: 164ms (wall-clock), resolution requests: 79, signatures
resolved: 201
    PGP key resolution time: 22209ms (wall-clock), resolution requests: 79, download time:
0ms (goes in parallel, it might exceed wall-clock time), keys downloaded: 0
        PGP signature verification time: 20491ms (goes in parallel, it might exceed wall-clock
time), files processed: 424, processed: 514MiB, skipped: 647MiB

FAILURE: Build failed with an exception.

* What went wrong:
Execution failed for task ':src:components:autostyleJavaCheck'.
> The following files have format violations:
    src/components/src/main/java/org/apache/jmeter/control/gui/ThroughputControllerGui.java
      @@ -18,7 +18,6 @@
       package org.apache.jmeter.control.gui;
       
       import java.awt.BorderLayout;
      -import java.awt.Dimension;
       import java.awt.event.ItemEvent;
       
       import javax.swing.DefaultComboBoxModel;
  Run './gradlew autostyleApply' to fix the violations.

* Try:
Run with --stacktrace option to get the stack trace. Run with --info or --debug option to
get more log output. Run with --scan to get full insights.

* Get more help at https://help.gradle.org

Deprecated Gradle features were used in this build, making it incompatible with Gradle 7.0.
Use '--warning-mode all' to show the individual deprecation warnings.
See https://docs.gradle.org/6.3/userguide/command_line_interface.html#sec:command_line_warnings

BUILD FAILED in 1m 46s
148 actionable tasks: 85 executed, 63 up-to-date

See the profiling report at: file://<https://builds.apache.org/job/JMeter-trunk/ws/build/reports/profile/profile-2020-04-07-09-55-58.html>
A fine-grained performance profile is available: use the --scan option.
Build step 'Invoke Gradle script' changed build result to FAILURE
Build step 'Invoke Gradle script' marked build as failure
Xvfb stopping
Archiving artifacts
[Fast Archiver] Compressed 15.42 MB of artifacts by 11.4% relative to #7712
Recording test results

Mime
View raw message