jmeter-dev mailing list archives

Site index · List index
Message view « Date » · « Thread »
Top « Date » · « Thread »
From Apache Jenkins Server <jenk...@builds.apache.org>
Subject Build failed in Jenkins: JMeter-trunk #7716
Date Sat, 11 Apr 2020 16:37:52 GMT
See <https://builds.apache.org/job/JMeter-trunk/7716/display/redirect?page=changes>

Changes:

[pmouawad] Bug 64340 - Workbench reappears in menu to add Non Test Elements,


------------------------------------------
[...truncated 56.48 KB...]
> Task :src:licenses:spotbugsMain NO-SOURCE
> Task :src:licenses:spotbugsTest NO-SOURCE
> Task :src:licenses:test NO-SOURCE
> Task :src:licenses:check
> Task :src:protocol:mongodb:autostyleConfigsCheck
> Task :src:dist:autostyleKotlinGradleCheck
> Task :src:dist:autostyleMarkdownCheck NO-SOURCE
> Task :src:dist:autostyleCheck
> Task :src:dist:processResources NO-SOURCE
> Task :src:dist:processTestResources NO-SOURCE
> Task :src:protocol:native:autostyleConfigsCheck NO-SOURCE
> Task :src:testkit-wiremock:autostyleJavaCheck
> Task :src:bshclient:autostyleJavaCheck
> Task :src:generator:autostyleJavaCheck
> Task :src:testkit:autostyleJavaCheck
> Task :src:testkit-wiremock:autostyleKotlinGradleCheck
> Task :src:testkit-wiremock:autostyleMarkdownCheck NO-SOURCE
> Task :src:testkit-wiremock:autostyleCheck
> Task :src:generator:autostyleKotlinGradleCheck
> Task :src:testkit:autostyleKotlinGradleCheck
> Task :src:generator:autostyleMarkdownCheck NO-SOURCE
> Task :src:generator:autostyleCheck
> Task :src:testkit:autostyleMarkdownCheck NO-SOURCE
> Task :src:bshclient:autostyleKotlinGradleCheck
> Task :src:testkit:autostyleCheck
> Task :src:generator:processTestResources NO-SOURCE
> Task :src:bshclient:autostyleMarkdownCheck NO-SOURCE
> Task :src:bshclient:autostyleCheck
> Task :src:protocol:tcp:autostyleConfigsCheck NO-SOURCE
> Task :autostyleKotlinGradleCheck
> Task :src:launcher:autostyleJavaCheck
> Task :src:launcher:autostyleKotlinGradleCheck
> Task :src:bshclient:compileJava UP-TO-DATE
> Task :src:launcher:autostyleMarkdownCheck NO-SOURCE
> Task :src:launcher:autostyleCheck
> Task :src:bshclient:processResources NO-SOURCE
> Task :src:protocol:ftp:autostyleJavaCheck
> Task :src:protocol:native:autostyleJavaCheck
> Task :src:protocol:junit-sample:autostyleJavaCheck
> Task :src:protocol:junit:autostyleJavaCheck
> Task :src:protocol:bolt:autostyleJavaCheck
> Task :src:examples:autostyleJavaCheck
> Task :src:bshclient:classes UP-TO-DATE
> Task :src:protocol:junit:autostyleKotlinGradleCheck NO-SOURCE
> Task :src:protocol:ftp:autostyleKotlinGradleCheck NO-SOURCE
> Task :src:protocol:native:autostyleKotlinGradleCheck NO-SOURCE
> Task :src:protocol:bolt:autostyleKotlinGradleCheck NO-SOURCE
> Task :src:protocol:junit-sample:autostyleKotlinGradleCheck NO-SOURCE
> Task :src:examples:autostyleKotlinGradleCheck
> Task :src:protocol:junit-sample:autostyleMarkdownCheck NO-SOURCE
> Task :src:protocol:junit-sample:autostyleCheck
> Task :src:examples:autostyleMarkdownCheck NO-SOURCE
> Task :src:protocol:bolt:autostyleMarkdownCheck NO-SOURCE
> Task :src:examples:autostyleCheck
> Task :src:protocol:native:autostyleMarkdownCheck NO-SOURCE
> Task :src:protocol:bolt:autostyleCheck
> Task :src:protocol:junit:autostyleMarkdownCheck NO-SOURCE
> Task :src:protocol:native:autostyleCheck
> Task :src:protocol:junit-sample:processTestResources NO-SOURCE
> Task :src:assemble UP-TO-DATE
> Task :src:bom:assemble UP-TO-DATE
> Task :src:protocol:ftp:autostyleMarkdownCheck NO-SOURCE
> Task :src:protocol:junit:autostyleCheck
> Task :src:protocol:ftp:autostyleCheck
> Task :src:dist:preparePropertiesbuildPrintableDoc UP-TO-DATE
> Task :src:protocol:mongodb:autostyleJavaCheck
> Task :src:dist-check:autostyleJavaCheck
> Task :src:protocol:jar UP-TO-DATE
> Task :src:protocol:assemble UP-TO-DATE
> Task :src:protocol:mongodb:autostyleKotlinGradleCheck NO-SOURCE
> Task :src:protocol:mongodb:autostyleMarkdownCheck NO-SOURCE
> Task :src:protocol:mongodb:autostyleCheck
> Task :src:protocol:jdbc:autostyleJavaCheck
> Task :src:protocol:jdbc:autostyleKotlinGradleCheck NO-SOURCE
> Task :src:protocol:ldap:autostyleJavaCheck
> Task :src:protocol:jdbc:autostyleMarkdownCheck NO-SOURCE
> Task :src:protocol:ldap:autostyleKotlinGradleCheck NO-SOURCE
> Task :src:protocol:jdbc:autostyleCheck
> Task :src:protocol:ldap:autostyleMarkdownCheck NO-SOURCE
> Task :src:protocol:ldap:autostyleCheck
> Task :src:release:jar UP-TO-DATE
> Task :src:release:assemble UP-TO-DATE
> Task :src:protocol:mail:autostyleJavaCheck
> Task :src:protocol:mail:autostyleKotlinGradleCheck NO-SOURCE
> Task :src:protocol:mail:autostyleMarkdownCheck NO-SOURCE
> Task :src:protocol:mail:autostyleCheck
> Task :src:dist-check:autostyleKotlinGradleCheck
> Task :src:dist-check:autostyleMarkdownCheck NO-SOURCE
> Task :src:dist-check:autostyleCheck
> Task :src:dist-check:processResources NO-SOURCE
> Task :src:dist-check:processTestResources UP-TO-DATE
> Task :autostyleMarkdownCheck
> Task :autostyleCheck
> Task :compileJava NO-SOURCE
> Task :processResources NO-SOURCE
> Task :classes UP-TO-DATE
> Task :checkstyleMain NO-SOURCE
> Task :src:examples:processResources UP-TO-DATE
> Task :src:protocol:tcp:autostyleJavaCheck
> Task :src:dist:buildPrintableDoc UP-TO-DATE
> Task :src:licenses:gatherSourceLicenses UP-TO-DATE
> Task :src:protocol:java:autostyleJavaCheck
> Task :src:protocol:jms:autostyleJavaCheck
> Task :compileTestJava NO-SOURCE
> Task :src:examples:processTestResources NO-SOURCE
> Task :processTestResources NO-SOURCE
> Task :testClasses UP-TO-DATE
> Task :src:protocol:tcp:autostyleKotlinGradleCheck NO-SOURCE
> Task :src:licenses:renderLicenseForSource UP-TO-DATE
> Task :src:protocol:java:autostyleKotlinGradleCheck NO-SOURCE
> Task :src:protocol:jms:autostyleKotlinGradleCheck NO-SOURCE
> Task :checkstyleTest NO-SOURCE
> Task :src:protocol:tcp:autostyleMarkdownCheck NO-SOURCE
> Task :src:protocol:java:autostyleMarkdownCheck NO-SOURCE
> Task :src:protocol:tcp:autostyleCheck
> Task :src:protocol:java:autostyleCheck
> Task :src:protocol:jms:autostyleMarkdownCheck NO-SOURCE
> Task :src:protocol:jms:autostyleCheck
> Task :src:dist:processSiteXslt UP-TO-DATE
> Task :src:licenses:renderLicenseForSourceCopySpec
> Task :src:licenses:srcLicenseDir UP-TO-DATE
> Task :gitProps
> Task :src:licenses:jar UP-TO-DATE
> Task :src:functions:autostyleJavaCheck
> Task :src:functions:autostyleKotlinGradleCheck
> Task :src:functions:autostyleMarkdownCheck NO-SOURCE
> Task :src:functions:autostyleCheck
> Task :src:config:jar UP-TO-DATE
> Task :src:config:assemble UP-TO-DATE
> Task :spotbugsMain NO-SOURCE
> Task :spotbugsTest NO-SOURCE
> Task :test NO-SOURCE
> Task :jar UP-TO-DATE
> Task :assemble UP-TO-DATE
> Task :src:launcher:checkstyleMain UP-TO-DATE
> Task :src:testkit:checkstyleMain UP-TO-DATE
> Task :src:bshclient:checkstyleMain UP-TO-DATE
> Task :src:bshclient:compileTestJava NO-SOURCE
> Task :src:launcher:compileTestJava NO-SOURCE
> Task :src:testkit:compileTestJava NO-SOURCE
> Task :src:testkit-wiremock:checkstyleMain UP-TO-DATE
> Task :src:bshclient:processTestResources NO-SOURCE
> Task :src:launcher:processTestResources NO-SOURCE
> Task :src:testkit:processTestResources NO-SOURCE
> Task :src:bshclient:testClasses UP-TO-DATE
> Task :src:launcher:testClasses UP-TO-DATE
> Task :src:testkit-wiremock:compileTestJava NO-SOURCE
> Task :src:testkit:testClasses UP-TO-DATE
> Task :src:dist-check:populateLibs
> Task :src:bshclient:checkstyleTest NO-SOURCE
> Task :src:testkit-wiremock:processTestResources NO-SOURCE
> Task :src:testkit-wiremock:testClasses UP-TO-DATE
> Task :src:launcher:checkstyleTest NO-SOURCE
> Task :src:testkit:checkstyleTest NO-SOURCE
> Task :src:testkit-wiremock:checkstyleTest NO-SOURCE
> Task :src:testkit-wiremock:checkstyleTestFixtures NO-SOURCE
> Task :src:testkit:checkstyleTestFixtures NO-SOURCE
> Task :src:testkit:spotbugsMain UP-TO-DATE
> Task :src:launcher:spotbugsMain UP-TO-DATE
> Task :src:bshclient:spotbugsMain UP-TO-DATE
> Task :src:testkit-wiremock:spotbugsMain UP-TO-DATE
> Task :src:testkit:spotbugsTest NO-SOURCE
> Task :src:testkit-wiremock:spotbugsTest NO-SOURCE
> Task :src:launcher:spotbugsTest NO-SOURCE
> Task :src:bshclient:spotbugsTest NO-SOURCE
> Task :src:testkit:spotbugsTestFixtures NO-SOURCE
> Task :src:testkit-wiremock:spotbugsTestFixtures NO-SOURCE
> Task :src:launcher:test NO-SOURCE
> Task :src:launcher:check
> Task :src:launcher:assemble UP-TO-DATE
> Task :src:testkit:test NO-SOURCE
> Task :src:bshclient:test NO-SOURCE
> Task :src:bshclient:check
> Task :src:testkit-wiremock:test NO-SOURCE
> Task :src:testkit:check
> Task :src:testkit:assemble UP-TO-DATE
> Task :src:testkit-wiremock:check
> Task :src:testkit-wiremock:assemble UP-TO-DATE
> Task :src:bshclient:jar UP-TO-DATE
> Task :src:bshclient:assemble UP-TO-DATE
> Task :src:protocol:http:autostyleJavaCheck
> Task :src:protocol:http:autostyleKotlinGradleCheck NO-SOURCE
> Task :src:protocol:http:autostyleMarkdownCheck NO-SOURCE
> Task :src:protocol:http:autostyleCheck

> Task :src:jorphan:compileJava
Note: Some input files use or override a deprecated API.
Note: Recompile with -Xlint:deprecation for details.
Note: <https://builds.apache.org/job/JMeter-trunk/ws/src/jorphan/src/main/java/org/apache/jorphan/gui/DynamicStyle.java>
uses unchecked or unsafe operations.
Note: Recompile with -Xlint:unchecked for details.

> Task :src:jorphan:compileGroovy NO-SOURCE
> Task :src:jorphan:processResources UP-TO-DATE
> Task :src:jorphan:classes
> Task :src:jorphan:jar
> Task :src:jorphan:compileTestJava UP-TO-DATE
> Task :src:components:autostyleJavaCheck
> Task :src:components:autostyleKotlinGradleCheck
> Task :src:components:autostyleMarkdownCheck NO-SOURCE
> Task :src:components:autostyleCheck
> Task :src:components:processResources UP-TO-DATE
> Task :src:components:processTestResources UP-TO-DATE
> Task :src:core:autostyleJavaCheck FAILED
> Task :rat
> Task :src:jorphan:compileTestGroovy
> Task :src:dist:distTarSource
checksum-dependency elapsed time: 58846ms, configurations processed: 122
    SHA-512 computation time: 440ms (goes in parallel, it might exceed wall-clock time), files
processed: 34, processed: 6MiB, skipped: 1102MiB
    PGP signature resolution time: 200ms (wall-clock), resolution requests: 72, signatures
resolved: 167
    PGP key resolution time: 48941ms (wall-clock), resolution requests: 72, download time:
0ms (goes in parallel, it might exceed wall-clock time), keys downloaded: 0
        PGP signature verification time: 84705ms (goes in parallel, it might exceed wall-clock
time), files processed: 448, processed: 541MiB, skipped: 561MiB

FAILURE: Build failed with an exception.

* What went wrong:
Execution failed for task ':src:core:autostyleJavaCheck'.
> The following files have format violations:
    src/core/src/main/java/org/apache/jmeter/control/gui/WorkBenchGui.java
      @@ -25,7 +25,6 @@
       import javax.swing.JPopupMenu;
       
       import org.apache.jmeter.gui.AbstractJMeterGuiComponent;
      -import org.apache.jmeter.gui.TestElementMetadata;
       import org.apache.jmeter.gui.action.ActionNames;
       import org.apache.jmeter.gui.util.MenuFactory;
       import org.apache.jmeter.gui.util.VerticalPanel;
  Run './gradlew autostyleApply' to fix the violations.

* Try:
Run with --stacktrace option to get the stack trace. Run with --info or --debug option to
get more log output. Run with --scan to get full insights.

* Get more help at https://help.gradle.org

Deprecated Gradle features were used in this build, making it incompatible with Gradle 7.0.
Use '--warning-mode all' to show the individual deprecation warnings.
See https://docs.gradle.org/6.3/userguide/command_line_interface.html#sec:command_line_warnings

BUILD FAILED in 54s
145 actionable tasks: 85 executed, 60 up-to-date

See the profiling report at: file://<https://builds.apache.org/job/JMeter-trunk/ws/build/reports/profile/profile-2020-04-11-16-36-55.html>
A fine-grained performance profile is available: use the --scan option.
Build step 'Invoke Gradle script' changed build result to FAILURE
Build step 'Invoke Gradle script' marked build as failure
Xvfb stopping
Archiving artifacts
[Fast Archiver] Compressed 15.42 MB of artifacts by 13.2% relative to #7715
Recording test results
ERROR: Step ?Publish JUnit test result report? failed: No test report files were found. Configuration
error?

Mime
View raw message