jmeter-dev mailing list archives

Site index · List index
Message view « Date » · « Thread »
Top « Date » · « Thread »
From Apache Jenkins Server <jenk...@builds.apache.org>
Subject Build failed in Jenkins: JMeter Ubuntu #1003
Date Wed, 29 Apr 2020 16:54:53 GMT
See <https://builds.apache.org/job/JMeter%20Ubuntu/1003/display/redirect?page=changes>

Changes:

[felix.schumacher] Correct link to nightly jenkins builds.


------------------------------------------
[...truncated 189.38 KB...]
    java.home=/usr/local/asfpackages/java/jdk1.8.0_241/jre
    file.encoding=ISO-8859-1
    default encoding=ISO-8859-1
    user.home=/home/jenkins
    user.dir=<https://builds.apache.org/job/JMeter%20Ubuntu/ws/src/protocol/http>
    user.language=en
    user.region=null
    user.country=US
    user.variant=
    Locale=en_US
    java.class.version=52.0
    java.awt.headless=true
    os.name=Linux
    os.version=4.15.0-76-generic
    os.arch=amd64

> Task :src:dist-check:checkstyleTest
> Task :src:dist-check:spotbugsTest SKIPPED

> Task :src:functions:test
          0.2sec,    1 completed,   0 failed,   0 skipped, org.apache.jmeter.resources.ResourceKeyUsageTestFunctions
          0.7sec,   18 completed,   0 failed,   0 skipped, org.apache.jmeter.functions.TestSimpleFunctions
          0.0sec,    6 completed,   0 failed,   0 skipped, org.apache.jmeter.functions.TestIsVarDefined
          0.0sec,    5 completed,   0 failed,   0 skipped, org.apache.jmeter.functions.TestMachineIPName
          0.1sec,    6 completed,   0 failed,   0 skipped, org.apache.jmeter.functions.CSVReadFunctionTest
          0.0sec,    3 completed,   0 failed,   0 skipped, org.apache.jmeter.functions.TestSetProperty
          0.0sec,    9 completed,   0 failed,   0 skipped, org.apache.jmeter.functions.TestDigestFunction
          0.0sec,    1 completed,   0 failed,   0 skipped, org.apache.jmeter.functions.SumFunctionTest
          0.3sec,    5 completed,   0 failed,   0 skipped, org.apache.jmeter.functions.TestJavascriptFunctionWithRhino
          0.6sec,    5 completed,   0 failed,   0 skipped, org.apache.jmeter.functions.TestJavascriptFunction
          0.1sec,   15 completed,   0 failed,   0 skipped, org.apache.jmeter.functions.TestStringtoFile
          0.0sec,    8 completed,   0 failed,   0 skipped, org.apache.jmeter.functions.TestDateTimeConvertFunction
          0.0sec,    5 completed,   0 failed,   0 skipped, org.apache.jmeter.functions.TestFileToString
          0.0sec,    3 completed,   0 failed,   0 skipped, org.apache.jmeter.functions.TestUrlEncodeDecode
          0.0sec,    5 completed,   0 failed,   0 skipped, org.apache.jmeter.functions.TestIsPropDefined
          0.0sec,    5 completed,   0 failed,   0 skipped, org.apache.jmeter.functions.StringFromFileFunctionTest
          0.1sec,    6 completed,   0 failed,   0 skipped, org.apache.jmeter.functions.TestJexl2Function
          0.0sec,    7 completed,   0 failed,   0 skipped, org.apache.jmeter.functions.TestFileRowColContainer
          0.0sec,    2 completed,   0 failed,   0 skipped, org.apache.jmeter.functions.RandomFunctionTest
          0.3sec,    6 completed,   0 failed,   0 skipped, org.apache.jmeter.functions.TestJexl3Function
          0.0sec,    6 completed,   0 failed,   0 skipped, org.apache.jmeter.functions.TestEscapeOroRegexpChars
          0.2sec,   12 completed,   0 failed,   0 skipped, org.apache.jmeter.functions.TestTimeShiftFunction
          0.0sec,   22 completed,   0 failed,   0 skipped, org.apache.jmeter.functions.TestRegexFunction
WARNING   0.7sec,    6 completed,   0 failed,   5 skipped, org.apache.jmeter.functions.XPathConcurrencyTest
          0.0sec,    8 completed,   0 failed,   0 skipped, org.apache.jmeter.functions.TestChangeCase
          0.0sec,    4 completed,   0 failed,   0 skipped, org.apache.jmeter.functions.TestRandomFromMultipleVars
          0.0sec,    2 completed,   0 failed,   0 skipped, org.apache.jmeter.functions.TestSamplerNameFunction

> Task :src:dist-check:batchBug56243
Creating summariser <summary>
Created the tree successfully using <https://builds.apache.org/job/JMeter%20Ubuntu/ws/bin/testfiles/Bug56243.jmx>
Starting standalone test @ Wed Apr 29 16:54:31 UTC 2020 (1588179271697)
Waiting for possible Shutdown/StopTestNow/HeapDump/ThreadDump message on port 4445
summary +      1 in 00:00:00 =    6.5/s Avg:     7 Min:     7 Max:     7 Err:     0 (0.00%)
Active: 1 Started: 1 Finished: 0
summary +      8 in 00:00:00 =  222.2/s Avg:     0 Min:     0 Max:     1 Err:     0 (0.00%)
Active: 0 Started: 1 Finished: 1
summary =      9 in 00:00:00 =   46.9/s Avg:     1 Min:     0 Max:     7 Err:     0 (0.00%)
Tidying up ...    @ Wed Apr 29 16:54:32 UTC 2020 (1588179272768)
... end of run
No errors present in the logfile <https://builds.apache.org/job/JMeter%20Ubuntu/ws/bin/Bug56243.log>
(the file is empty)

> Task :src:protocol:http:test
          0.8sec,   55 completed,   0 failed,   0 skipped, org.apache.jmeter.curl.BasicCurlParserTest
          0.5sec,    1 completed,   0 failed,   0 skipped, org.apache.jmeter.resources.ResourceKeyUsageTestHttp
          0.2sec,   21 completed,   0 failed,   0 skipped, org.apache.jmeter.gui.action.ParseCurlCommandActionTest
          0.0sec,    7 completed,   0 failed,   0 skipped, org.apache.jmeter.protocol.http.visualizers.RequestViewHTTPTest
          2.0sec, org.apache.jmeter.protocol.http.proxy.TestHttpRequestHdr
> testPostRequestEncodings()
          2.0sec, org.apache.jmeter.protocol.http.proxy.TestHttpRequestHdr
> testGetRequestEncodings()
          2.1sec, org.apache.jmeter.protocol.http.proxy.TestHttpRequestHdr
> testEncodedArguments()
          2.1sec, org.apache.jmeter.protocol.http.sampler.TestHTTPHC4Impl
> testNotifyFirstSampleAfterLoopRestartWhenThreadIterationIsSameUser()
          2.1sec, org.apache.jmeter.protocol.http.sampler.TestHTTPHC4Impl
> testNotifyFirstSampleAfterLoopRestartWhenThreadIterationIsANewUser()
          2.2sec,    2 completed,   0 failed,   0 skipped, org.apache.jmeter.protocol.http.sampler.TestHTTPHC4Impl
          2.1sec, org.apache.jmeter.protocol.http.proxy.TestHttpRequestHdr
> testPostMultipartFormData()
          2.2sec, org.apache.jmeter.protocol.http.proxy.TestHttpRequestHdr
> testRepeatedArguments()
          2.3sec,   10 completed,   0 failed,   0 skipped, org.apache.jmeter.protocol.http.proxy.TestHttpRequestHdr
          2.3sec, org.apache.jmeter.protocol.http.control.TestCacheManagerHC4
> testExpiresBug59962()
          2.0sec, org.apache.jmeter.protocol.http.control.TestCacheManagerUrlConnection
> testExpires()
          2.3sec, org.apache.jmeter.protocol.http.control.TestCacheManagerHC4
> testExpires()
          2.0sec, org.apache.jmeter.protocol.http.control.TestCacheManagerHC4
> testPrivateCacheExpireNoMaxAge()
          2.1sec, org.apache.jmeter.protocol.http.control.TestCacheManagerUrlConnection
> testExpiresBug59962()
FAILURE   3.0sec, org.apache.jmeter.protocol.http.control.TestCacheManagerHC4
> testNoCacheControlNoMaxAgeNoExpire()
    org.opentest4j.AssertionFailedError: Should not find valid entry ==> expected: <false>
but was: <true>
        at org.junit.jupiter.api.AssertionUtils.fail(AssertionUtils.java:55)
        at org.junit.jupiter.api.AssertFalse.assertFalse(AssertFalse.java:40)
        at org.junit.jupiter.api.Assertions.assertFalse(Assertions.java:218)
        at org.apache.jmeter.protocol.http.control.TestCacheManagerBase.testNoCacheControlNoMaxAgeNoExpire(TestCacheManagerBase.java:285)
        at org.junit.platform.commons.util.ReflectionUtils.invokeMethod(ReflectionUtils.java:686)
        at org.junit.jupiter.engine.execution.MethodInvocation.proceed(MethodInvocation.java:60)
        at org.junit.jupiter.engine.execution.InvocationInterceptorChain$ValidatingInvocation.proceed(InvocationInterceptorChain.java:131)
        at org.junit.jupiter.engine.extension.TimeoutInvocation.proceed(TimeoutInvocation.java:46)
        at org.junit.jupiter.engine.extension.TimeoutExtension.intercept(TimeoutExtension.java:149)
        at org.junit.jupiter.engine.extension.TimeoutExtension.interceptTestableMethod(TimeoutExtension.java:140)
        at org.junit.jupiter.engine.extension.TimeoutExtension.interceptTestMethod(TimeoutExtension.java:84)
        at org.junit.jupiter.engine.execution.ExecutableInvoker$ReflectiveInterceptorCall.lambda$ofVoidMethod$0(ExecutableInvoker.java:115)
        at org.junit.jupiter.engine.execution.ExecutableInvoker.lambda$invoke$0(ExecutableInvoker.java:105)
        at org.junit.jupiter.engine.execution.InvocationInterceptorChain$InterceptedInvocation.proceed(InvocationInterceptorChain.java:106)
        at org.junit.jupiter.engine.execution.InvocationInterceptorChain.proceed(InvocationInterceptorChain.java:64)
        at org.junit.jupiter.engine.execution.InvocationInterceptorChain.chainAndInvoke(InvocationInterceptorChain.java:45)
        at org.junit.jupiter.engine.execution.InvocationInterceptorChain.invoke(InvocationInterceptorChain.java:37)
        at org.junit.jupiter.engine.execution.ExecutableInvoker.invoke(ExecutableInvoker.java:104)
        at org.junit.jupiter.engine.execution.ExecutableInvoker.invoke(ExecutableInvoker.java:98)
        at org.junit.jupiter.engine.descriptor.TestMethodTestDescriptor.lambda$invokeTestMethod$6(TestMethodTestDescriptor.java:205)
        at org.junit.platform.engine.support.hierarchical.ThrowableCollector.execute(ThrowableCollector.java:73)
        at org.junit.jupiter.engine.descriptor.TestMethodTestDescriptor.invokeTestMethod(TestMethodTestDescriptor.java:201)
        at org.junit.jupiter.engine.descriptor.TestMethodTestDescriptor.execute(TestMethodTestDescriptor.java:137)
        at org.junit.jupiter.engine.descriptor.TestMethodTestDescriptor.execute(TestMethodTestDescriptor.java:71)
        at org.junit.platform.engine.support.hierarchical.NodeTestTask.lambda$executeRecursively$5(NodeTestTask.java:135)
        at org.junit.platform.engine.support.hierarchical.ThrowableCollector.execute(ThrowableCollector.java:73)
        at org.junit.platform.engine.support.hierarchical.NodeTestTask.lambda$executeRecursively$7(NodeTestTask.java:125)
        at org.junit.platform.engine.support.hierarchical.Node.around(Node.java:135)
        at org.junit.platform.engine.support.hierarchical.NodeTestTask.lambda$executeRecursively$8(NodeTestTask.java:123)
        at org.junit.platform.engine.support.hierarchical.ThrowableCollector.execute(ThrowableCollector.java:73)
        at org.junit.platform.engine.support.hierarchical.NodeTestTask.executeRecursively(NodeTestTask.java:122)
        at org.junit.platform.engine.support.hierarchical.NodeTestTask.execute(NodeTestTask.java:80)

          3.0sec, org.apache.jmeter.protocol.http.control.TestCacheManagerHC4
> testPrivateCacheNoMaxAgeNoExpire()
          2.0sec, org.apache.jmeter.protocol.http.control.TestCacheManagerUrlConnection
> testPrivateCacheExpireNoMaxAge()
FAILURE   3.5sec,   25 completed,   1 failed,   0 skipped, org.apache.jmeter.protocol.http.control.TestCacheManagerHC4

> Task :src:functions:test
          0.7sec,    7 completed,   0 failed,   0 skipped, org.apache.jmeter.functions.TestGroovyFunction
          0.0sec,   15 completed,   0 failed,   0 skipped, org.apache.jmeter.functions.TestTimeFunction
          0.0sec,    1 completed,   0 failed,   0 skipped, org.apache.jmeter.functions.SplitFunctionTest
          0.0sec,    1 completed,   0 failed,   0 skipped, org.apache.jmeter.functions.VariableTest
          0.0sec,    2 completed,   0 failed,   0 skipped, org.apache.jmeter.functions.EvalFunctionTest
          0.0sec,   14 completed,   0 failed,   0 skipped, org.apache.jmeter.functions.TestTimeRandomDateFunction
          0.3sec,   10 completed,   0 failed,   0 skipped, org.apache.jmeter.functions.PackageTest
          0.2sec,   22 completed,   0 failed,   0 skipped, org.apache.jmeter.functions.ChangeCaseSpec
WARNING   0.0sec,    1 completed,   0 failed,   1 skipped, org.apache.jmeter.functions.gui.FunctionHelperSpec
          0.3sec,    2 completed,   0 failed,   0 skipped, org.apache.jmeter.functions.IterationCounterSpec
WARNING  10.1sec,  256 completed,   0 failed,   6 skipped, Gradle
Test Run :src:functions:test

> Task :src:functions:check

> Task :src:protocol:http:test
          3.0sec, org.apache.jmeter.protocol.http.control.TestCacheManagerUrlConnection
> testNoCacheControlNoMaxAgeNoExpire()
          3.0sec, org.apache.jmeter.protocol.http.control.TestCacheManagerUrlConnection
> testPrivateCacheNoMaxAgeNoExpire()
          4.5sec,   24 completed,   0 failed,   0 skipped, org.apache.jmeter.protocol.http.control.TestCacheManagerUrlConnection
          3.4sec,   16 completed,   0 failed,   0 skipped, org.apache.jmeter.protocol.http.sampler.ParallelResourcesAndIpSource
          0.2sec,    1 completed,   0 failed,   0 skipped, org.apache.jmeter.protocol.http.sampler.PackageTest
          0.0sec,    2 completed,   0 failed,   0 skipped, org.apache.jmeter.protocol.http.sampler.PutWriterTest
          0.0sec,   18 completed,   0 failed,   0 skipped, org.apache.jmeter.protocol.http.sampler.TestHTTPSamplers
          0.0sec,    8 completed,   0 failed,   0 skipped, org.apache.jmeter.protocol.http.sampler.PostWriterTest
          0.0sec,    2 completed,   0 failed,   0 skipped, org.apache.jmeter.protocol.http.sampler.TestHttpWebdav
          0.5sec,    8 completed,   0 failed,   0 skipped, org.apache.jmeter.protocol.http.sampler.TestDecompression
          0.5sec,    1 completed,   0 failed,   0 skipped, org.apache.jmeter.protocol.http.sampler.TestSerializedHTTPSampler
          0.0sec,    3 completed,   0 failed,   0 skipped, org.apache.jmeter.protocol.http.config.MultipartUrlConfigTest
          0.0sec,    2 completed,   0 failed,   0 skipped, org.apache.jmeter.protocol.http.config.UrlConfigTest
          0.0sec,    3 completed,   0 failed,   0 skipped, org.apache.jmeter.protocol.http.util.TestHTTPFileArg
          0.0sec,    3 completed,   0 failed,   0 skipped, org.apache.jmeter.protocol.http.util.TestHTTPArgument
          0.0sec,    4 completed,   0 failed,   0 skipped, org.apache.jmeter.protocol.http.util.accesslog.TestTCLogParser
          0.0sec,    6 completed,   0 failed,   0 skipped, org.apache.jmeter.protocol.http.util.accesslog.TestLogFilter
          0.0sec,    3 completed,   0 failed,   0 skipped, org.apache.jmeter.protocol.http.util.accesslog.TestSessionFilter
          0.0sec,    5 completed,   0 failed,   0 skipped, org.apache.jmeter.protocol.http.util.TestHTTPFileArgs
          0.0sec,   17 completed,   0 failed,   0 skipped, org.apache.jmeter.protocol.http.modifier.TestURLRewritingModifier
          1.0sec,   18 completed,   0 failed,   0 skipped, org.apache.jmeter.protocol.http.modifier.TestAnchorModifier
          0.0sec,    2 completed,   0 failed,   0 skipped, org.apache.jmeter.protocol.http.parser.TestBaseParser

> Task :src:dist-check:batchBug56811
Creating summariser <summary>
Created the tree successfully using <https://builds.apache.org/job/JMeter%20Ubuntu/ws/bin/testfiles/Bug56811.jmx>
Starting standalone test @ Wed Apr 29 16:54:35 UTC 2020 (1588179275864)
Waiting for possible Shutdown/StopTestNow/HeapDump/ThreadDump message on port 4445
summary =      9 in 00:00:01 =   16.5/s Avg:     4 Min:     0 Max:     8 Err:     3 (33.33%)
Tidying up ...    @ Wed Apr 29 16:54:37 UTC 2020 (1588179277129)
... end of run
No errors present in the logfile <https://builds.apache.org/job/JMeter%20Ubuntu/ws/bin/Bug56811.log>
(the file is empty)

> Task :src:protocol:http:test
          0.4sec,    4 completed,   0 failed,   0 skipped, org.apache.jmeter.protocol.http.parser.TestCssParser
          0.0sec,    6 completed,   0 failed,   0 skipped, org.apache.jmeter.protocol.http.parser.TestHtmlParsingUtils
          0.3sec,    7 completed,   0 failed,   0 skipped, org.apache.jmeter.protocol.http.proxy.TestProxyControl

> Task :src:dist-check:batchBug62239
Creating summariser <summary>
Created the tree successfully using <https://builds.apache.org/job/JMeter%20Ubuntu/ws/bin/testfiles/Bug62239.jmx>
Starting standalone test @ Wed Apr 29 16:54:40 UTC 2020 (1588179280302)
Waiting for possible Shutdown/StopTestNow/HeapDump/ThreadDump message on port 4445
summary =    108 in 00:00:00 =  225.0/s Avg:     0 Min:     0 Max:     1 Err:     0 (0.00%)
Tidying up ...    @ Wed Apr 29 16:54:41 UTC 2020 (1588179281021)
... end of run
No errors present in the logfile <https://builds.apache.org/job/JMeter%20Ubuntu/ws/bin/Bug62239.log>
(the file is empty)

> Task :src:dist-check:batchFTP_TESTS
Creating summariser <summary>
Created the tree successfully using <https://builds.apache.org/job/JMeter%20Ubuntu/ws/bin/testfiles/FTP_TESTS.jmx>
Starting standalone test @ Wed Apr 29 16:54:43 UTC 2020 (1588179283621)
Waiting for possible Shutdown/StopTestNow/HeapDump/ThreadDump message on port 4445
summary =      6 in 00:00:03 =    2.1/s Avg:   255 Min:    14 Max:  1272 Err:     0 (0.00%)
Tidying up ...    @ Wed Apr 29 16:54:47 UTC 2020 (1588179287518)
... end of run
No errors present in the logfile <https://builds.apache.org/job/JMeter%20Ubuntu/ws/bin/FTP_TESTS.log>
(the file is empty)

> Task :src:protocol:http:test
          6.1sec, org.apache.jmeter.protocol.http.control.DnsManagerTest
> badDnsInCustomResolverShouldFailHttpSampler(String, WireMockServer)[1], [1]
HttpClient4
WARNING   6.1sec,    2 completed,   0 failed,   1 skipped, org.apache.jmeter.protocol.http.control.DnsManagerTest
          0.1sec,    1 completed,   0 failed,   0 skipped, org.apache.jmeter.protocol.http.control.gui.TestHttpTestSampleGui
          0.0sec,    1 completed,   0 failed,   0 skipped, org.apache.jmeter.protocol.http.control.TestAuthorization
          0.1sec,   33 completed,   0 failed,   0 skipped, org.apache.jmeter.protocol.http.control.TestHC4CookieManager
          0.1sec,    4 completed,   0 failed,   0 skipped, org.apache.jmeter.protocol.http.control.TestCookieManagerThreadIteration
          0.0sec,    6 completed,   0 failed,   0 skipped, org.apache.jmeter.protocol.http.control.TestAuthManager
          0.1sec,    5 completed,   0 failed,   0 skipped, org.apache.jmeter.protocol.http.control.TestCacheManagerThreadIteration
          0.0sec,    2 completed,   0 failed,   0 skipped, org.apache.jmeter.protocol.http.control.TestAuthManagerThreadIteration
          0.0sec,    2 completed,   0 failed,   0 skipped, org.apache.jmeter.testelement.TestHeaderManager
          0.0sec,    7 completed,   0 failed,   0 skipped, org.apache.jmeter.protocol.http.visualizers.RequestViewHTTPTest
WARNING   0.0sec,    2 completed,   0 failed,   2 skipped, org.apache.jmeter.protocol.http.sampler.SamplingNamingTest
          0.5sec,   53 completed,   0 failed,   0 skipped, org.apache.jmeter.protocol.http.sampler.TestHTTPSamplersAgainstHttpMirrorServer
          0.2sec,   46 completed,   0 failed,   0 skipped, org.apache.jmeter.protocol.http.parser.TestBug60842HtmlParser
          0.5sec,  103 completed,   0 failed,   0 skipped, org.apache.jmeter.protocol.http.parser.TestHTMLParser
          0.9sec,    9 completed,   0 failed,   0 skipped, org.apache.jmeter.protocol.http.control.TestHTTPMirrorThread
          0.4sec,   58 completed,   0 failed,   0 skipped, org.apache.jmeter.protocol.http.util.HTTPUtilsSpec
          0.4sec,   11 completed,   0 failed,   0 skipped, org.apache.jmeter.protocol.http.control.DNSCacheManagerSpec
FAILURE  23.3sec,  629 completed,   1 failed,   3 skipped,
Gradle Test Run :src:protocol:http:test

629 tests completed, 1 failed, 3 skipped

> Task :src:protocol:http:test FAILED

> Task :src:dist-check:batchHTMLParserTestFile_2
Creating summariser <summary>
Created the tree successfully using <https://builds.apache.org/job/JMeter%20Ubuntu/ws/bin/testfiles/HTMLParserTestFile_2.jmx>
Starting standalone test @ Wed Apr 29 16:54:50 UTC 2020 (1588179290175)
Waiting for possible Shutdown/StopTestNow/HeapDump/ThreadDump message on port 4445
summary =      1 in 00:00:00 =    2.9/s Avg:   179 Min:   179 Max:   179 Err:     0 (0.00%)
Tidying up ...    @ Wed Apr 29 16:54:51 UTC 2020 (1588179291252)
... end of run
No errors present in the logfile <https://builds.apache.org/job/JMeter%20Ubuntu/ws/bin/HTMLParserTestFile_2.log>
(the file is empty)
checksum-dependency elapsed time: 16748ms, configurations processed: 237 (add -PchecksumTimingsPrint
to print detailed timings)

FAILURE: Build failed with an exception.

* What went wrong:
Execution failed for task ':src:protocol:http:test'.
> There were failing tests. See the report at: file:///home/jenkins/jenkins-slave/workspace/JMeter%20Ubuntu/src/protocol/http/build/reports/tests/test/index.html

* Try:
Run with --stacktrace option to get the stack trace. Run with --info or --debug option to
get more log output. Run with --scan to get full insights.

* Get more help at https://help.gradle.org

Deprecated Gradle features were used in this build, making it incompatible with Gradle 7.0.
Use '--warning-mode all' to show the individual deprecation warnings.
See https://docs.gradle.org/6.3/userguide/command_line_interface.html#sec:command_line_warnings

BUILD FAILED in 1m 42s
244 actionable tasks: 139 executed, 105 up-to-date
Build step 'Invoke Gradle script' changed build result to FAILURE
Build step 'Invoke Gradle script' marked build as failure
[locks-and-latches] Releasing all the locks
[locks-and-latches] All the locks released

Mime
View raw message