jmeter-dev mailing list archives

Site index · List index
Message view « Date » · « Thread »
Top « Date » · « Thread »
From Apache Jenkins Server <jenk...@builds.apache.org>
Subject Build failed in Jenkins: JMeter Windows #1683
Date Sat, 09 May 2020 18:21:19 GMT
See <https://builds.apache.org/job/JMeter%20Windows/1683/display/redirect?page=changes>

Changes:

[felix.schumacher] When preemptive auth is disabled HTTP Sampler does not automatically


------------------------------------------
[...truncated 231.35 KB...]
	at org.apache.jmeter.threads.JMeterThread.run(JMeterThread.java:256) [ApacheJMeter_core.jar:5.3-SNAPSHOT]
	at java.lang.Thread.run(Thread.java:748) [?:1.8.0_152]
2020-05-09 11:18:47,460 WARN o.a.j.p.j.p.AbstractJDBCProcessor: SQL Problem in JDBC PreProcessor:
java.sql.SQLSyntaxErrorException: unexpected token: USERS
2020-05-09 11:18:47,467 WARN o.a.j.p.j.p.AbstractJDBCProcessor: SQL Problem in JDBC PostProcessor:
java.sql.SQLSyntaxErrorException: unexpected token: USERS

> Task :src:dist-check:batchJMS_TESTS
Creating summariser <summary>
Created the tree successfully using F:\jenkins\jenkins-slave\workspace\JMeter Windows\bin\testfiles\JMS_TESTS.jmx
Starting standalone test @ Sat May 09 11:18:49 PDT 2020 (1589048329075)
Waiting for possible Shutdown/StopTestNow/HeapDump/ThreadDump message on port 4445

> Task :src:dist:assemble

> Task :src:dist-check:batchJMS_TESTS
summary +     16 in 00:00:11 =    1.4/s Avg:   428 Min:     1 Max:  2145 Err:     0 (0.00%)
Active: 1 Started: 1 Finished: 0
summary +     11 in 00:00:19 =    0.6/s Avg:   826 Min:     0 Max:  3001 Err:     0 (0.00%)
Active: 0 Started: 1 Finished: 1
summary =     27 in 00:00:30 =    0.9/s Avg:   590 Min:     0 Max:  3001 Err:     0 (0.00%)
Tidying up ...    @ Sat May 09 11:19:19 PDT 2020 (1589048359703)
... end of run
No errors present in the logfile F:\jenkins\jenkins-slave\workspace\JMeter Windows\bin\JMS_TESTS.log
(the file is empty)

> Task :src:dist-check:batchOS_TESTS
Creating summariser <summary>
Created the tree successfully using F:\jenkins\jenkins-slave\workspace\JMeter Windows\bin\testfiles\OS_TESTS.jmx
Starting standalone test @ Sat May 09 11:19:22 PDT 2020 (1589048362327)
Waiting for possible Shutdown/StopTestNow/HeapDump/ThreadDump message on port 4445
summary =      3 in 00:00:02 =    1.3/s Avg:   348 Min:    16 Max:  1004 Err:     0 (0.00%)
Tidying up ...    @ Sat May 09 11:19:24 PDT 2020 (1589048364760)
... end of run
No errors present in the logfile F:\jenkins\jenkins-slave\workspace\JMeter Windows\bin\OS_TESTS.log
(the file is empty)

> Task :src:dist-check:batchResponseDecompression
Creating summariser <summary>
Created the tree successfully using F:\jenkins\jenkins-slave\workspace\JMeter Windows\bin\testfiles\ResponseDecompression.jmx
Starting standalone test @ Sat May 09 11:19:26 PDT 2020 (1589048366732)
Waiting for possible Shutdown/StopTestNow/HeapDump/ThreadDump message on port 4445
summary =      2 in 00:00:02 =    1.1/s Avg:   503 Min:   368 Max:   638 Err:     0 (0.00%)
Tidying up ...    @ Sat May 09 11:19:29 PDT 2020 (1589048369135)
... end of run
No errors present in the logfile F:\jenkins\jenkins-slave\workspace\JMeter Windows\bin\ResponseDecompression.log
(the file is empty)
[server] Created remote object: UnicastServerRef2 [liveRef: [endpoint:[jenkins-win-he-de-5.apache.org:63049,SSLRMIServerSocketFactory(host=jenkins-win-he-de-5.apache.org/176.9.73.62,
keyStoreLocation=rmi_keystore.jks, type=JKS, trustStoreLocation=rmi_keystore.jks, type=JKS,
alias=rmi),SSLRMIClientSocketFactory(keyStoreLocation=rmi_keystore.jks, type=JKS, trustStoreLocation=rmi_keystore.jks,
type=JKS, alias=rmi)](local),objID:[-27cc86be:171faa9e5f1:-7fff, -2516832651226881471]]]

> Task :src:dist-check:batchServerBatchTestLocal
Creating summariser <summary>
Created the tree successfully using F:\jenkins\jenkins-slave\workspace\JMeter Windows\bin\testfiles\BatchTestLocal.jmx
Configuring remote engine: jenkins-win-he-de-5.apache.org:63046
Starting distributed test with remote engines: [jenkins-win-he-de-5.apache.org:63046] @ Sat
May 09 11:19:33 PDT 2020 (1589048373905)

[server] Starting the test on host jenkins-win-he-de-5.apache.org:63046 @ Sat May 09 11:19:36
PDT 2020 (1589048376734)

> Task :src:dist-check:batchServerBatchTestLocal
Remote engines have been started:[jenkins-win-he-de-5.apache.org:63046]
Waiting for possible Shutdown/StopTestNow/HeapDump/ThreadDump message on port 4445
summary =    132 in 00:00:07 =   19.1/s Avg:     4 Min:     0 Max:   102 Err:    16 (12.12%)
Tidying up remote @ Sat May 09 11:19:44 PDT 2020 (1589048384179)

[server] Finished the test on host jenkins-win-he-de-5.apache.org:63046 @ Sat May 09 11:19:44
PDT 2020 (1589048384179) - exit requested.

> Task :src:dist-check:batchServerBatchTestLocal
... end of run
No errors present in the logfile F:\jenkins\jenkins-slave\workspace\JMeter Windows\bin\BatchTestLocal.log
(the file is empty)
No errors present in the logfile F:\jenkins\jenkins-slave\workspace\JMeter Windows\bin\BatchTestLocalServer.log
(the file is empty)

> Task :src:dist-check:batchSlowCharsFeatureHttpClient4 SKIPPED
> Task :src:dist-check:batchSlowCharsFeatureJava SKIPPED
> Task :src:dist-check:batchTCP_TESTS SKIPPED

> Task :src:dist-check:batchTEST_HTTPHttpClient4
Creating summariser <summary>
Created the tree successfully using F:\jenkins\jenkins-slave\workspace\JMeter Windows\bin\testfiles\TEST_HTTP.jmx
Starting standalone test @ Sat May 09 11:19:51 PDT 2020 (1589048391264)
Waiting for possible Shutdown/StopTestNow/HeapDump/ThreadDump message on port 4445
summary =     22 in 00:00:02 =   10.2/s Avg:    70 Min:     2 Max:  1040 Err:     0 (0.00%)
Tidying up ...    @ Sat May 09 11:19:53 PDT 2020 (1589048393864)
... end of run
No errors present in the logfile F:\jenkins\jenkins-slave\workspace\JMeter Windows\bin\TEST_HTTP.log
(the file is empty)

> Task :src:dist-check:batchTEST_HTTPJava
Creating summariser <summary>
Created the tree successfully using F:\jenkins\jenkins-slave\workspace\JMeter Windows\bin\testfiles\TEST_HTTP.jmx
Starting standalone test @ Sat May 09 11:19:56 PDT 2020 (1589048396976)
Waiting for possible Shutdown/StopTestNow/HeapDump/ThreadDump message on port 4445
summary =     20 in 00:00:02 =    9.7/s Avg:    78 Min:     1 Max:  1056 Err:     0 (0.00%)
Tidying up ...    @ Sat May 09 11:19:59 PDT 2020 (1589048399396)
... end of run
WARNING: the task was configured to ignore errors in the output log
Logfile contents (errors during the test, see F:\jenkins\jenkins-slave\workspace\JMeter Windows\bin\TEST_HTTP.log):
2020-05-09 11:19:59,048 ERROR o.a.j.p.h.s.HTTPJavaImpl: readResponse: java.net.ProtocolException:
Server redirected too many  times (20)
2020-05-09 11:19:59,053 ERROR o.a.j.p.h.s.HTTPJavaImpl: Cause: java.net.ProtocolException:
Server redirected too many  times (20)
2020-05-09 11:19:59,054 ERROR o.a.j.p.h.c.HttpMirrorThread: Invalid request received:''

> Task :src:dist-check:batchTEST_HTTPS
Creating summariser <summary>
Created the tree successfully using F:\jenkins\jenkins-slave\workspace\JMeter Windows\bin\testfiles\TEST_HTTPS.jmx
Starting standalone test @ Sat May 09 11:20:02 PDT 2020 (1589048402243)
Waiting for possible Shutdown/StopTestNow/HeapDump/ThreadDump message on port 4445
summary +      1 in 00:00:02 =    0.5/s Avg:  1568 Min:  1568 Max:  1568 Err:     0 (0.00%)
Active: 1 Started: 1 Finished: 0
summary +      1 in 00:00:00 =    5.4/s Avg:   178 Min:   178 Max:   178 Err:     0 (0.00%)
Active: 0 Started: 1 Finished: 1
summary =      2 in 00:00:02 =    1.0/s Avg:   873 Min:   178 Max:  1568 Err:     0 (0.00%)
Tidying up ...    @ Sat May 09 11:20:04 PDT 2020 (1589048404792)
... end of run
No errors present in the logfile F:\jenkins\jenkins-slave\workspace\JMeter Windows\bin\TEST_HTTPS.log
(the file is empty)

> Task :src:dist-check:batchTestCookieManager
Creating summariser <summary>
Created the tree successfully using F:\jenkins\jenkins-slave\workspace\JMeter Windows\bin\testfiles\TestCookieManager.jmx
Starting standalone test @ Sat May 09 11:20:06 PDT 2020 (1589048406715)
Waiting for possible Shutdown/StopTestNow/HeapDump/ThreadDump message on port 4445
summary =     10 in 00:00:08 =    1.3/s Avg:   754 Min:     3 Max:  2013 Err:     0 (0.00%)
Tidying up ...    @ Sat May 09 11:20:15 PDT 2020 (1589048415370)
... end of run
No errors present in the logfile F:\jenkins\jenkins-slave\workspace\JMeter Windows\bin\TestCookieManager.log
(the file is empty)

> Task :src:dist-check:batchTestHeaderManagerHttpClient4
Creating summariser <summary>
Created the tree successfully using F:\jenkins\jenkins-slave\workspace\JMeter Windows\bin\testfiles\TestHeaderManager.jmx
Starting standalone test @ Sat May 09 11:20:18 PDT 2020 (1589048418274)
Waiting for possible Shutdown/StopTestNow/HeapDump/ThreadDump message on port 4445
summary =      3 in 00:00:06 =    0.5/s Avg:  2013 Min:  2002 Max:  2033 Err:     0 (0.00%)
Tidying up ...    @ Sat May 09 11:20:25 PDT 2020 (1589048425096)
... end of run
No errors present in the logfile F:\jenkins\jenkins-slave\workspace\JMeter Windows\bin\TestHeaderManager.log
(the file is empty)

> Task :src:dist-check:batchTestHeaderManagerJava
Creating summariser <summary>
Created the tree successfully using F:\jenkins\jenkins-slave\workspace\JMeter Windows\bin\testfiles\TestHeaderManager.jmx
Starting standalone test @ Sat May 09 11:20:27 PDT 2020 (1589048427072)
Waiting for possible Shutdown/StopTestNow/HeapDump/ThreadDump message on port 4445
summary +      3 in 00:00:03 =    0.9/s Avg:  1007 Min:  1002 Max:  1016 Err:     0 (0.00%)
Active: 1 Started: 2 Finished: 1
summary =      3 in 00:00:03 =    0.9/s Avg:  1007 Min:  1002 Max:  1016 Err:     0 (0.00%)
Tidying up ...    @ Sat May 09 11:20:30 PDT 2020 (1589048430751)
... end of run
No errors present in the logfile F:\jenkins\jenkins-slave\workspace\JMeter Windows\bin\TestHeaderManager.log
(the file is empty)

> Task :src:dist-check:batchTestKeepAlive SKIPPED
> Task :src:dist-check:batchTestRedirectionPolicies SKIPPED

> Task :src:dist-check:batchTestResultStatusAction
Creating summariser <summary>
Created the tree successfully using F:\jenkins\jenkins-slave\workspace\JMeter Windows\bin\testfiles\TestResultStatusAction.jmx
Starting standalone test @ Sat May 09 11:20:32 PDT 2020 (1589048432624)
Waiting for possible Shutdown/StopTestNow/HeapDump/ThreadDump message on port 4445
summary +      1 in 00:00:01 =    1.0/s Avg:     1 Min:     1 Max:     1 Err:     0 (0.00%)
Active: 1 Started: 1 Finished: 0
summary +    134 in 00:00:00 =  736.3/s Avg:     1 Min:     0 Max:   118 Err:    18 (13.43%)
Active: 0 Started: 4 Finished: 4
summary =    135 in 00:00:01 =  111.3/s Avg:     1 Min:     0 Max:   118 Err:    18 (13.33%)
Tidying up ...    @ Sat May 09 11:20:34 PDT 2020 (1589048434703)
... end of run
No errors present in the logfile F:\jenkins\jenkins-slave\workspace\JMeter Windows\bin\TestResultStatusAction.log
(the file is empty)

> Task :src:dist-check:batchTestSchedulerWithTimer
Creating summariser <summary>
Created the tree successfully using F:\jenkins\jenkins-slave\workspace\JMeter Windows\bin\testfiles\TestSchedulerWithTimer.jmx
Starting standalone test @ Sat May 09 11:20:36 PDT 2020 (1589048436570)
Waiting for possible Shutdown/StopTestNow/HeapDump/ThreadDump message on port 4445
summary =      5 in 00:00:06 =    0.8/s Avg:   253 Min:     1 Max:   953 Err:     0 (0.00%)
Tidying up ...    @ Sat May 09 11:20:43 PDT 2020 (1589048443756)
... end of run
No errors present in the logfile F:\jenkins\jenkins-slave\workspace\JMeter Windows\bin\TestSchedulerWithTimer.log
(the file is empty)

> Task :src:dist-check:batchTests

> Task :src:dist-check:test

Gradle Test Executor 20 STANDARD_OUT
    Setting JMeterHome: F:\jenkins\jenkins-slave\workspace\JMeter Windows\src\dist-check\..\..\.
    Initializing Properties: ../.././bin/jmeter.properties
    JMeterVersion=5.3-SNAPSHOT 740a206
    java.version=1.8.0_152
    java.vm.name=Java HotSpot(TM) 64-Bit Server VM
    java.vendor=Oracle Corporation
    java.home=F:\jenkins\tools\java\latest1.8\jre
    file.encoding=windows-1252
    default encoding=windows-1252
    user.home=C:\Windows\system32\config\systemprofile
    user.dir=F:\jenkins\jenkins-slave\workspace\JMeter Windows\src\dist-check
    user.language=en
    user.region=null
    user.country=US
    user.variant=
    Locale=en_US
    java.class.version=52.0
    java.awt.headless=null
    os.name=Windows Server 2016
    os.version=10.0
    os.arch=amd64
    o.a.j.junit.JMeterTest WARN: org.apache.jmeter.gui.JMeterGUIComponent: NoSuchMethodException
 org.apache.jmeter.gui.menu.StaticJMeterGUIComponent, missing empty Constructor or Constructor
with Object parameter
    Last class=org.apache.jmeter.protocol.smtp.sampler.gui.SmtpSamplerGui
    objects.size=77
    Last error=java.lang.InstantiationException: org.apache.jmeter.gui.menu.StaticJMeterGUIComponent
          0.1sec,    9 completed,   0 failed,   0 skipped, org.apache.jmeter.control.TestSwitchController
          0.0sec,    2 completed,   0 failed,   0 skipped, org.apache.jmeter.resources.TestPropertiesFiles
          1.2sec,    5 completed,   0 failed,   0 skipped, org.apache.jmeter.save.TestSaveService
          0.0sec,    1 completed,   0 failed,   0 skipped, org.apache.jmeter.threads.ThreadGroupLoad
          8.8sec, org.apache.jorphan.reflect.TestClassFinder > testFindClassesThatExtendStringArrayClassOfQArrayTrue()
          5.4sec, org.apache.jorphan.reflect.TestClassFinder > testFindAnnotatedClasses()
         16.3sec,    9 completed,   0 failed,   0 skipped, org.apache.jorphan.reflect.TestClassFinder
          0.1sec,    7 completed,   0 failed,   0 skipped, org.apache.jorphan.TestFunctorUsers
          0.1sec,  100 completed,   0 failed,   0 skipped, org.apache.jmeter.functions.ComponentReferenceFunctionTest
          1.0sec,   82 completed,   0 failed,   0 skipped, org.apache.jmeter.gui.action.TestLoad
FAILURE   0.0sec, org.apache.jmeter.junit.JMeterTest, initializationError
    java.lang.Exception: Error creating org.apache.jmeter.protocol.smtp.sampler.gui.SmtpSamplerGui
        at org.apache.jmeter.junit.JMeterTest.instantiateClass(JMeterTest.java:543)
        at org.apache.jmeter.junit.JMeterTest.getObjects(JMeterTest.java:473)
        at org.apache.jmeter.junit.JMeterTest.suiteGUIComponents(JMeterTest.java:270)
        at org.apache.jmeter.junit.JMeterTest.suite(JMeterTest.java:147)
        Caused by: java.lang.NullPointerException
            at sun.awt.shell.Win32ShellFolder2.access$200(Win32ShellFolder2.java:72)
            at sun.awt.shell.Win32ShellFolder2$1.call(Win32ShellFolder2.java:242)
            at sun.awt.shell.Win32ShellFolder2$1.call(Win32ShellFolder2.java:237)
            at java.util.concurrent.FutureTask.run(FutureTask.java:266)
            at java.util.concurrent.ThreadPoolExecutor.runWorker(ThreadPoolExecutor.java:1149)
            at java.util.concurrent.ThreadPoolExecutor$Worker.run(ThreadPoolExecutor.java:624)
            at sun.awt.shell.Win32ShellFolderManager2$ComInvoker$3.run(Win32ShellFolderManager2.java:547)
            at java.lang.Thread.run(Thread.java:748)

FAILURE   0.0sec,    1 completed,   1 failed,   0 skipped, org.apache.jmeter.junit.JMeterTest
          1.2sec,  374 completed,   0 failed,   0 skipped, org.apache.jmeter.testbeans.gui.PackageTest
          0.2sec,  140 completed,   0 failed,   0 skipped, org.apache.jmeter.testelement.TestElementTest
          0.5sec,   22 completed,   0 failed,   0 skipped, org.apache.jmeter.engine.util.PackageSpec
          3.0sec, org.apache.jmeter.gui.action.HtmlReportGeneratorSpec > check that report
generation succeeds and statistic are generated
          4.7sec,    7 completed,   0 failed,   0 skipped, org.apache.jmeter.gui.action.HtmlReportGeneratorSpec
          0.2sec,    2 completed,   0 failed,   0 skipped, org.apache.jmeter.gui.util.MenuFactorySpec
          0.6sec,    2 completed,   0 failed,   0 skipped, org.apache.jmeter.report.dashboard.ReportGeneratorSpec
FAILURE  33.3sec,  763 completed,   1 failed,   0 skipped, Gradle Test Run :src:dist-check:test

763 tests completed, 1 failed

> Task :src:dist-check:test FAILED
checksum-dependency elapsed time: 18262ms, configurations processed: 282 (add -PchecksumTimingsPrint
to print detailed timings)

FAILURE: Build failed with an exception.

* What went wrong:
Execution failed for task ':src:dist-check:test'.
> There were failing tests. See the report at: file:///F:/jenkins/jenkins-slave/workspace/JMeter%20Windows/src/dist-check/build/reports/tests/test/index.html

* Try:
Run with --stacktrace option to get the stack trace. Run with --info or --debug option to
get more log output. Run with --scan to get full insights.

* Get more help at https://help.gradle.org

Deprecated Gradle features were used in this build, making it incompatible with Gradle 7.0.
Use '--warning-mode all' to show the individual deprecation warnings.
See https://docs.gradle.org/6.3/userguide/command_line_interface.html#sec:command_line_warnings

BUILD FAILED in 7m 44s
287 actionable tasks: 287 executed
Build step 'Invoke Gradle script' changed build result to FAILURE
Build step 'Invoke Gradle script' marked build as failure

Mime
View raw message