jmeter-dev mailing list archives

Site index · List index
Message view « Date » · « Thread »
Top « Date » · « Thread »
From Apache Jenkins Server <jenk...@builds.apache.org>
Subject Build failed in Jenkins: JMeter Windows #1690
Date Thu, 28 May 2020 14:24:27 GMT
See <https://builds.apache.org/job/JMeter%20Windows/1690/display/redirect?page=changes>

Changes:

[felix.schumacher] Prepare next development round

[felix.schumacher] More precise error message, when no datasource value can be found in

[felix.schumacher] Log exeptions reported via JMeterUtils#reportToUser even when in GUI


------------------------------------------
[...truncated 222.62 KB...]
May 28, 2020 7:23:49 AM java.util.prefs.WindowsPreferences <init>
WARNING: Could not open/create prefs root node Software\JavaSoft\Prefs at root 0x80000002.
Windows RegCreateKeyEx(...) returned error code 5.
Creating summariser <summary>
Created the tree successfully using F:\jenkins\jenkins-slave\workspace\JMeter Windows\bin\testfiles\Bug55375.jmx
Starting standalone test @ Thu May 28 07:23:49 PDT 2020 (1590675829414)
Waiting for possible Shutdown/StopTestNow/HeapDump/ThreadDump message on port 4445
summary =      1 in 00:00:00 =   10.3/s Avg:     4 Min:     4 Max:     4 Err:     0 (0.00%)
Tidying up ...    @ Thu May 28 07:23:50 PDT 2020 (1590675830010)
... end of run

> Task :src:dist:distZip
> Task :src:dist:distZipSha512

> Task :src:dist-check:batchBug56243
May 28, 2020 7:23:51 AM java.util.prefs.WindowsPreferences <init>
WARNING: Could not open/create prefs root node Software\JavaSoft\Prefs at root 0x80000002.
Windows RegCreateKeyEx(...) returned error code 5.
Creating summariser <summary>
Created the tree successfully using F:\jenkins\jenkins-slave\workspace\JMeter Windows\bin\testfiles\Bug56243.jmx
Starting standalone test @ Thu May 28 07:23:51 PDT 2020 (1590675831729)
Waiting for possible Shutdown/StopTestNow/HeapDump/ThreadDump message on port 4445
summary =      9 in 00:00:00 =   53.3/s Avg:     1 Min:     0 Max:     7 Err:     0 (0.00%)
Tidying up ...    @ Thu May 28 07:23:52 PDT 2020 (1590675832464)
... end of run
No errors present in the logfile F:\jenkins\jenkins-slave\workspace\JMeter Windows\bin\Bug56243.log
(the file is empty)

> Task :src:dist-check:batchBug56811
May 28, 2020 7:23:54 AM java.util.prefs.WindowsPreferences <init>
WARNING: Could not open/create prefs root node Software\JavaSoft\Prefs at root 0x80000002.
Windows RegCreateKeyEx(...) returned error code 5.
Creating summariser <summary>
Created the tree successfully using F:\jenkins\jenkins-slave\workspace\JMeter Windows\bin\testfiles\Bug56811.jmx
Starting standalone test @ Thu May 28 07:23:54 PDT 2020 (1590675834724)
Waiting for possible Shutdown/StopTestNow/HeapDump/ThreadDump message on port 4445
summary =      9 in 00:00:00 =   20.8/s Avg:     3 Min:     0 Max:     6 Err:     3 (33.33%)
Tidying up ...    @ Thu May 28 07:23:55 PDT 2020 (1590675835650)
... end of run
No errors present in the logfile F:\jenkins\jenkins-slave\workspace\JMeter Windows\bin\Bug56811.log
(the file is empty)

> Task :src:dist-check:batchBug62239
May 28, 2020 7:23:58 AM java.util.prefs.WindowsPreferences <init>
WARNING: Could not open/create prefs root node Software\JavaSoft\Prefs at root 0x80000002.
Windows RegCreateKeyEx(...) returned error code 5.
Creating summariser <summary>
Created the tree successfully using F:\jenkins\jenkins-slave\workspace\JMeter Windows\bin\testfiles\Bug62239.jmx
Starting standalone test @ Thu May 28 07:23:58 PDT 2020 (1590675838131)
Waiting for possible Shutdown/StopTestNow/HeapDump/ThreadDump message on port 4445
summary =    108 in 00:00:00 =  255.9/s Avg:     0 Min:     0 Max:     1 Err:     0 (0.00%)
Tidying up ...    @ Thu May 28 07:23:58 PDT 2020 (1590675838724)
... end of run
No errors present in the logfile F:\jenkins\jenkins-slave\workspace\JMeter Windows\bin\Bug62239.log
(the file is empty)

> Task :src:dist-check:batchFTP_TESTS
May 28, 2020 7:24:00 AM java.util.prefs.WindowsPreferences <init>
WARNING: Could not open/create prefs root node Software\JavaSoft\Prefs at root 0x80000002.
Windows RegCreateKeyEx(...) returned error code 5.
Creating summariser <summary>
Created the tree successfully using F:\jenkins\jenkins-slave\workspace\JMeter Windows\bin\testfiles\FTP_TESTS.jmx
Starting standalone test @ Thu May 28 07:24:00 PDT 2020 (1590675840602)
Waiting for possible Shutdown/StopTestNow/HeapDump/ThreadDump message on port 4445
summary +      1 in 00:00:01 =    0.7/s Avg:  1458 Min:  1458 Max:  1458 Err:     0 (0.00%)
Active: 1 Started: 1 Finished: 0
summary +      5 in 00:00:02 =    3.2/s Avg:    37 Min:    10 Max:   107 Err:     0 (0.00%)
Active: 0 Started: 1 Finished: 1
summary =      6 in 00:00:03 =    2.0/s Avg:   274 Min:    10 Max:  1458 Err:     0 (0.00%)
Tidying up ...    @ Thu May 28 07:24:04 PDT 2020 (1590675844574)
... end of run
No errors present in the logfile F:\jenkins\jenkins-slave\workspace\JMeter Windows\bin\FTP_TESTS.log
(the file is empty)

> Task :src:dist-check:batchHTMLParserTestFile_2
May 28, 2020 7:24:06 AM java.util.prefs.WindowsPreferences <init>
WARNING: Could not open/create prefs root node Software\JavaSoft\Prefs at root 0x80000002.
Windows RegCreateKeyEx(...) returned error code 5.
Creating summariser <summary>
Created the tree successfully using F:\jenkins\jenkins-slave\workspace\JMeter Windows\bin\testfiles\HTMLParserTestFile_2.jmx
Starting standalone test @ Thu May 28 07:24:06 PDT 2020 (1590675846468)
Waiting for possible Shutdown/StopTestNow/HeapDump/ThreadDump message on port 4445
summary =      1 in 00:00:00 =    4.6/s Avg:   115 Min:   115 Max:   115 Err:     0 (0.00%)
Tidying up ...    @ Thu May 28 07:24:07 PDT 2020 (1590675847177)
... end of run
No errors present in the logfile F:\jenkins\jenkins-slave\workspace\JMeter Windows\bin\HTMLParserTestFile_2.log
(the file is empty)

> Task :src:dist-check:batchHttp4ImplDigestAuth SKIPPED

> Task :src:dist-check:batchHttp4ImplPreemptiveBasicAuth
May 28, 2020 7:24:09 AM java.util.prefs.WindowsPreferences <init>
WARNING: Could not open/create prefs root node Software\JavaSoft\Prefs at root 0x80000002.
Windows RegCreateKeyEx(...) returned error code 5.
Creating summariser <summary>
Created the tree successfully using F:\jenkins\jenkins-slave\workspace\JMeter Windows\bin\testfiles\Http4ImplPreemptiveBasicAuth.jmx
Starting standalone test @ Thu May 28 07:24:09 PDT 2020 (1590675849071)
Waiting for possible Shutdown/StopTestNow/HeapDump/ThreadDump message on port 4445
summary =     12 in 00:00:07 =    1.7/s Avg:   276 Min:    95 Max:   776 Err:     0 (0.00%)
Tidying up ...    @ Thu May 28 07:24:17 PDT 2020 (1590675857183)
... end of run
No errors present in the logfile F:\jenkins\jenkins-slave\workspace\JMeter Windows\bin\Http4ImplPreemptiveBasicAuth.log
(the file is empty)

> Task :src:dist-check:batchHttp4ImplPreemptiveBasicAuthJava SKIPPED

> Task :src:dist-check:batchJDBC_TESTS
May 28, 2020 7:24:19 AM java.util.prefs.WindowsPreferences <init>
WARNING: Could not open/create prefs root node Software\JavaSoft\Prefs at root 0x80000002.
Windows RegCreateKeyEx(...) returned error code 5.
Creating summariser <summary>
Created the tree successfully using F:\jenkins\jenkins-slave\workspace\JMeter Windows\bin\testfiles\JDBC_TESTS.jmx
Starting standalone test @ Thu May 28 07:24:19 PDT 2020 (1590675859217)
Waiting for possible Shutdown/StopTestNow/HeapDump/ThreadDump message on port 4445

> Task :src:dist:previewSite

> Task :src:dist-check:batchJDBC_TESTS FAILED
summary =     27 in 00:00:02 =   14.9/s Avg:    28 Min:     0 Max:   724 Err:     1 (3.70%)
Tidying up ...    @ Thu May 28 07:24:22 PDT 2020 (1590675862150)
... end of run
ERROR: unexpected output for JDBC_TESTS.csv:
  - expected 2035 bytes, F:\jenkins\jenkins-slave\workspace\JMeter Windows\bin\testfiles\JDBC_TESTS.csv
  + actual 2042 bytes, F:\jenkins\jenkins-slave\workspace\JMeter Windows\bin\JDBC_TESTS.csv
@@ -23,7 +23,7 @@
 JDBC_SELECT_LIMIT_RESULTSET_2,200,OK,TG-OK 1-1,text,true,1,1,1,0
 JDBC_SELECT_LIMIT_RESULTSET_3,200,OK,TG-OK 1-1,text,true,1,1,1,0
 JDBC_SELECT_LIMIT_RESULTSET_4,200,OK,TG-OK 1-1,text,true,1,1,1,0
-JDBC_NoConfig,000,java.lang.IllegalArgumentException: Variable Name must not be null in JDBC_NoConfig,TG-Errors
2-1,text,true,1,1,1,0
+JDBC_NoConfig,000,java.lang.IllegalArgumentException: Name for DataSoure must not be empty
in JDBC_NoConfig,TG-Errors 2-1,text,false,1,1,1,1
 JDBC_Wrong_Sql,42581 -5581,java.sql.SQLSyntaxErrorException: unexpected token: WHERE,TG-Errors
2-1,text,true,1,1,1,0
 JDBC_With_Failing_PreProcessor,200,OK,TG-Errors 2-1,text,true,1,1,1,0
 JDBC_With_Failing_PostProcessor,200,OK,TG-Errors 2-1,text,true,1,1,1,0
ERROR: unexpected output for JDBC_TESTS.xml:
  - expected 12663 bytes, F:\jenkins\jenkins-slave\workspace\JMeter Windows\bin\testfiles\JDBC_TESTS.xml
  + actual 12423 bytes, F:\jenkins\jenkins-slave\workspace\JMeter Windows\bin\JDBC_TESTS.xml
@@ -340,11 +340,12 @@
     <error>false</error>
   </assertionResult>
 </sample>
-<sample s="true" lb="JDBC_NoConfig" rc="000" rm="java.lang.IllegalArgumentException: Variable
Name must not be null in JDBC_NoConfig" tn="TG-Errors 2-1" dt="text" sc="1" ec="0" ng="1"
na="1">
+<sample s="false" lb="JDBC_NoConfig" rc="000" rm="java.lang.IllegalArgumentException:
Name for DataSoure must not be empty in JDBC_NoConfig" tn="TG-Errors 2-1" dt="text" sc="1"
ec="1" ng="1" na="1">
   <assertionResult>
     <name>Response Assertion</name>
-    <failure>false</failure>
+    <failure>true</failure>
     <error>false</error>
+    <failureMessage>Test failed: message expected to contain /Variable Name must not
be null in JDBC_NoConfig/</failureMessage>
   </assertionResult>
 </sample>
 <sample s="true" lb="JDBC_Wrong_Sql" rc="42581 -5581" rm="java.sql.SQLSyntaxErrorException:
unexpected token: WHERE" tn="TG-Errors 2-1" dt="text" sc="1" ec="0" ng="1" na="1">
WARNING: the task was configured to ignore errors in the output log
Logfile contents (errors during the test, see F:\jenkins\jenkins-slave\workspace\JMeter Windows\bin\JDBC_TESTS.log):
2020-05-28 07:24:22,137 ERROR o.a.j.t.JMeterThread: Error while processing sampler: 'JDBC_With_Failing_PreProcessor'.
java.lang.IllegalArgumentException: Name for DataSoure must not be empty in JDBC PreProcessor
	at org.apache.jmeter.protocol.jdbc.processor.AbstractJDBCProcessor.process(AbstractJDBCProcessor.java:44)
~[ApacheJMeter_jdbc.jar:5.3.1-SNAPSHOT]
	at org.apache.jmeter.protocol.jdbc.processor.JDBCPreProcessor.process(JDBCPreProcessor.java:34)
~[ApacheJMeter_jdbc.jar:5.3.1-SNAPSHOT]
	at org.apache.jmeter.threads.JMeterThread.runPreProcessors(JMeterThread.java:950) ~[ApacheJMeter_core.jar:5.3.1-SNAPSHOT]
	at org.apache.jmeter.threads.JMeterThread.executeSamplePackage(JMeterThread.java:549) ~[ApacheJMeter_core.jar:5.3.1-SNAPSHOT]
	at org.apache.jmeter.threads.JMeterThread.processSampler(JMeterThread.java:489) [ApacheJMeter_core.jar:5.3.1-SNAPSHOT]
	at org.apache.jmeter.threads.JMeterThread.run(JMeterThread.java:256) [ApacheJMeter_core.jar:5.3.1-SNAPSHOT]
	at java.lang.Thread.run(Thread.java:748) [?:1.8.0_152]
2020-05-28 07:24:22,143 ERROR o.a.j.t.JMeterThread: Error while processing sampler: 'JDBC_With_Failing_PostProcessor'.
java.lang.IllegalArgumentException: Name for DataSoure must not be empty in JDBC PostProcessor
	at org.apache.jmeter.protocol.jdbc.processor.AbstractJDBCProcessor.process(AbstractJDBCProcessor.java:44)
~[ApacheJMeter_jdbc.jar:5.3.1-SNAPSHOT]
	at org.apache.jmeter.protocol.jdbc.processor.JDBCPostProcessor.process(JDBCPostProcessor.java:34)
~[ApacheJMeter_jdbc.jar:5.3.1-SNAPSHOT]
	at org.apache.jmeter.threads.JMeterThread.runPostProcessors(JMeterThread.java:940) ~[ApacheJMeter_core.jar:5.3.1-SNAPSHOT]
	at org.apache.jmeter.threads.JMeterThread.executeSamplePackage(JMeterThread.java:572) ~[ApacheJMeter_core.jar:5.3.1-SNAPSHOT]
	at org.apache.jmeter.threads.JMeterThread.processSampler(JMeterThread.java:489) [ApacheJMeter_core.jar:5.3.1-SNAPSHOT]
	at org.apache.jmeter.threads.JMeterThread.run(JMeterThread.java:256) [ApacheJMeter_core.jar:5.3.1-SNAPSHOT]
	at java.lang.Thread.run(Thread.java:748) [?:1.8.0_152]
2020-05-28 07:24:22,143 WARN o.a.j.p.j.p.AbstractJDBCProcessor: SQL Problem in JDBC PreProcessor:
java.sql.SQLSyntaxErrorException: unexpected token: USERS
2020-05-28 07:24:22,148 WARN o.a.j.p.j.p.AbstractJDBCProcessor: SQL Problem in JDBC PostProcessor:
java.sql.SQLSyntaxErrorException: unexpected token: USERS
checksum-dependency elapsed time: 28049ms, configurations processed: 281
    SHA-512 computation time: 1247ms (goes in parallel, it might exceed wall-clock time),
files processed: 16, processed: 4MiB, skipped: 3113MiB
    PGP signature resolution time: 2319ms (wall-clock), resolution requests: 168, signatures
resolved: 247
    PGP key resolution time: 16000ms (wall-clock), resolution requests: 168, download time:
0ms (goes in parallel, it might exceed wall-clock time), keys downloaded: 0
        PGP signature verification time: 39164ms (goes in parallel, it might exceed wall-clock
time), files processed: 329, processed: 242MiB, skipped: 2849MiB

Build jmeter FAILURE reason:                                
    Execution failed for task ':src:dist-check:batchJDBC_TESTS':
        Failures detected while testing F:\jenkins\jenkins-slave\workspace\JMeter Windows\bin\testfiles\JDBC_TESTS.jmx:
[unexpected output JDBC_TESTS.csv, unexpected output JDBC_TESTS.xml]
            at org.apache.jmeter.buildtools.batchtest.BatchTest.exec(BatchTest.kt:184)
            at org.gradle.internal.reflect.JavaMethod.invoke(JavaMethod.java:104)
            at org.gradle.api.internal.project.taskfactory.StandardTaskAction.doExecute(StandardTaskAction.java:49)
            at org.gradle.api.internal.project.taskfactory.StandardTaskAction.execute(StandardTaskAction.java:42)
            at org.gradle.api.internal.project.taskfactory.StandardTaskAction.execute(StandardTaskAction.java:28)
            at org.gradle.api.internal.AbstractTask$TaskActionWrapper.execute(AbstractTask.java:727)
            at org.gradle.api.internal.AbstractTask$TaskActionWrapper.execute(AbstractTask.java:694)
            at org.gradle.api.internal.tasks.execution.ExecuteActionsTaskExecuter$3.run(ExecuteActionsTaskExecuter.java:568)
            at org.gradle.internal.operations.DefaultBuildOperationExecutor$RunnableBuildOperationWorker.execute(DefaultBuildOperationExecutor.java:402)
            at org.gradle.internal.operations.DefaultBuildOperationExecutor$RunnableBuildOperationWorker.execute(DefaultBuildOperationExecutor.java:394)
            at org.gradle.internal.operations.DefaultBuildOperationExecutor$1.execute(DefaultBuildOperationExecutor.java:165)
            at org.gradle.internal.operations.DefaultBuildOperationExecutor.execute(DefaultBuildOperationExecutor.java:250)
            at org.gradle.internal.operations.DefaultBuildOperationExecutor.execute(DefaultBuildOperationExecutor.java:158)
            at org.gradle.internal.operations.DefaultBuildOperationExecutor.run(DefaultBuildOperationExecutor.java:92)
            at org.gradle.internal.operations.DelegatingBuildOperationExecutor.run(DelegatingBuildOperationExecutor.java:31)
            at org.gradle.api.internal.tasks.execution.ExecuteActionsTaskExecuter.executeAction(ExecuteActionsTaskExecuter.java:553)
            at org.gradle.api.internal.tasks.execution.ExecuteActionsTaskExecuter.executeActions(ExecuteActionsTaskExecuter.java:536)
            at org.gradle.api.internal.tasks.execution.ExecuteActionsTaskExecuter.access$300(ExecuteActionsTaskExecuter.java:109)
            at org.gradle.api.internal.tasks.execution.ExecuteActionsTaskExecuter$TaskExecution.executeWithPreviousOutputFiles(ExecuteActionsTaskExecuter.java:276)
            at org.gradle.api.internal.tasks.execution.ExecuteActionsTaskExecuter$TaskExecution.execute(ExecuteActionsTaskExecuter.java:265)
            at org.gradle.internal.execution.steps.ExecuteStep.lambda$execute$1(ExecuteStep.java:33)
            at org.gradle.internal.execution.steps.ExecuteStep.execute(ExecuteStep.java:33)
            at org.gradle.internal.execution.steps.ExecuteStep.execute(ExecuteStep.java:26)
            at org.gradle.internal.execution.steps.CleanupOutputsStep.execute(CleanupOutputsStep.java:67)
            at org.gradle.internal.execution.steps.CleanupOutputsStep.execute(CleanupOutputsStep.java:36)
            at org.gradle.internal.execution.steps.ResolveInputChangesStep.execute(ResolveInputChangesStep.java:49)
            at org.gradle.internal.execution.steps.ResolveInputChangesStep.execute(ResolveInputChangesStep.java:34)
            at org.gradle.internal.execution.steps.CancelExecutionStep.execute(CancelExecutionStep.java:43)
            at org.gradle.internal.execution.steps.TimeoutStep.executeWithoutTimeout(TimeoutStep.java:73)
            at org.gradle.internal.execution.steps.TimeoutStep.execute(TimeoutStep.java:54)
            at org.gradle.internal.execution.steps.CatchExceptionStep.execute(CatchExceptionStep.java:34)
            at org.gradle.internal.execution.steps.CreateOutputsStep.execute(CreateOutputsStep.java:44)
            at org.gradle.internal.execution.steps.SnapshotOutputsStep.execute(SnapshotOutputsStep.java:54)
            at org.gradle.internal.execution.steps.SnapshotOutputsStep.execute(SnapshotOutputsStep.java:38)
            at org.gradle.internal.execution.steps.BroadcastChangingOutputsStep.execute(BroadcastChangingOutputsStep.java:49)
            at org.gradle.internal.execution.steps.CacheStep.executeWithoutCache(CacheStep.java:159)
            at org.gradle.internal.execution.steps.CacheStep.execute(CacheStep.java:72)
            at org.gradle.internal.execution.steps.CacheStep.execute(CacheStep.java:43)
            at org.gradle.internal.execution.steps.StoreExecutionStateStep.execute(StoreExecutionStateStep.java:44)
            at org.gradle.internal.execution.steps.StoreExecutionStateStep.execute(StoreExecutionStateStep.java:33)
            at org.gradle.internal.execution.steps.RecordOutputsStep.execute(RecordOutputsStep.java:38)
            at org.gradle.internal.execution.steps.RecordOutputsStep.execute(RecordOutputsStep.java:24)
            at org.gradle.internal.execution.steps.SkipUpToDateStep.executeBecause(SkipUpToDateStep.java:92)
            at org.gradle.internal.execution.steps.SkipUpToDateStep.lambda$execute$0(SkipUpToDateStep.java:85)
            at org.gradle.internal.execution.steps.SkipUpToDateStep.execute(SkipUpToDateStep.java:55)
            at org.gradle.internal.execution.steps.SkipUpToDateStep.execute(SkipUpToDateStep.java:39)
            at org.gradle.internal.execution.steps.ResolveChangesStep.execute(ResolveChangesStep.java:76)
            at org.gradle.internal.execution.steps.ResolveChangesStep.execute(ResolveChangesStep.java:37)
            at org.gradle.internal.execution.steps.legacy.MarkSnapshottingInputsFinishedStep.execute(MarkSnapshottingInputsFinishedStep.java:36)
            at org.gradle.internal.execution.steps.legacy.MarkSnapshottingInputsFinishedStep.execute(MarkSnapshottingInputsFinishedStep.java:26)
            at org.gradle.internal.execution.steps.ResolveCachingStateStep.execute(ResolveCachingStateStep.java:94)
            at org.gradle.internal.execution.steps.ResolveCachingStateStep.execute(ResolveCachingStateStep.java:49)
            at org.gradle.internal.execution.steps.CaptureStateBeforeExecutionStep.execute(CaptureStateBeforeExecutionStep.java:79)
            at org.gradle.internal.execution.steps.CaptureStateBeforeExecutionStep.execute(CaptureStateBeforeExecutionStep.java:53)
            at org.gradle.internal.execution.steps.ValidateStep.execute(ValidateStep.java:74)
            at org.gradle.internal.execution.steps.SkipEmptyWorkStep.lambda$execute$2(SkipEmptyWorkStep.java:78)
            at org.gradle.internal.execution.steps.SkipEmptyWorkStep.execute(SkipEmptyWorkStep.java:78)
            at org.gradle.internal.execution.steps.SkipEmptyWorkStep.execute(SkipEmptyWorkStep.java:34)
            at org.gradle.internal.execution.steps.legacy.MarkSnapshottingInputsStartedStep.execute(MarkSnapshottingInputsStartedStep.java:39)
            at org.gradle.internal.execution.steps.LoadExecutionStateStep.execute(LoadExecutionStateStep.java:40)
            at org.gradle.internal.execution.steps.LoadExecutionStateStep.execute(LoadExecutionStateStep.java:28)


FAILURE: Build failed with an exception.

* What went wrong:
Execution failed for task ':src:dist-check:batchJDBC_TESTS'.
> Failures detected while testing F:\jenkins\jenkins-slave\workspace\JMeter Windows\bin\testfiles\JDBC_TESTS.jmx:
[unexpected output JDBC_TESTS.csv, unexpected output JDBC_TESTS.xml]

* Try:
Run with --stacktrace option to get the stack trace. Run with --info or --debug option to
get more log output. Run with --scan to get full insights.

* Get more help at https://help.gradle.org

Deprecated Gradle features were used in this build, making it incompatible with Gradle 7.0.
Use '--warning-mode all' to show the individual deprecation warnings.
See https://docs.gradle.org/6.3/userguide/command_line_interface.html#sec:command_line_warnings

BUILD FAILED in 4m 51s
274 actionable tasks: 210 executed, 64 up-to-date
Could not open/create prefs root node Software\JavaSoft\Prefs at root 0x80000002. Windows
RegCreateKeyEx(...) returned error code 5.
Build step 'Invoke Gradle script' changed build result to FAILURE
Build step 'Invoke Gradle script' marked build as failure

Mime
View raw message