jmeter-dev mailing list archives

Site index · List index
Message view « Date » · « Thread »
Top « Date » · « Thread »
From Apache Jenkins Server <jenk...@builds.apache.org>
Subject Build failed in Jenkins: JMeter-trunk #7749
Date Sat, 09 May 2020 09:32:59 GMT
See <https://builds.apache.org/job/JMeter-trunk/7749/display/redirect?page=changes>

Changes:

[felix.schumacher] Construct an InheritableThreadLocal instead of a simple ThreadLocal


------------------------------------------
[...truncated 177.98 KB...]
PackageTest > checkI18n fr: messages STANDARD_OUT
    Ignoring missing junit_failure_default_code=0001 in org/apache/jmeter/resources/messages_fr.properties
    Ignoring missing aggregate_report_90=90% in org/apache/jmeter/resources/messages_fr.properties
    Ignoring missing junit_error_default_code=9999 in org/apache/jmeter/resources/messages_fr.properties
    Ignoring missing junit_success_default_code=1000 in org/apache/jmeter/resources/messages_fr.properties

FileServerSpec > setBaseDir doesn't error when no files are open STANDARD_OUT
    The JVM should have exited but did not.
    The following non-daemon threads are still running (DestroyJavaVM is OK):
    Thread[/127.0.0.1:53698 to /127.0.0.1:33443 workers Thread 2,5,main], stackTrace:sun.nio.ch.FileDispatcherImpl#write0
    sun.nio.ch.SocketDispatcher#write at line:47
    sun.nio.ch.IOUtil#writeFromNativeBuffer at line:93
    sun.nio.ch.IOUtil#write at line:51
    sun.nio.ch.SocketChannelImpl#write at line:471
    org.gradle.internal.remote.internal.inet.SocketConnection$SocketOutputStream#writeWithNonBlockingRetry
at line:279
    org.gradle.internal.remote.internal.inet.SocketConnection$SocketOutputStream#writeBufferToChannel
at line:267
    org.gradle.internal.remote.internal.inet.SocketConnection$SocketOutputStream#flush at
line:261
    org.gradle.internal.remote.internal.inet.SocketConnection#flush at line:138
    org.gradle.internal.remote.internal.hub.MessageHub$ConnectionDispatch#run at line:335
    org.gradle.internal.concurrent.ExecutorPolicy$CatchAndRecordFailures#onExecute at line:64
    org.gradle.internal.concurrent.ManagedExecutorImpl$1#run at line:48
    java.util.concurrent.ThreadPoolExecutor#runWorker at line:1149
    java.util.concurrent.ThreadPoolExecutor$Worker#run at line:624
    org.gradle.internal.concurrent.ThreadFactoryImpl$ManagedThreadRunnable#run at line:56
    java.lang.Thread#run at line:748

    Thread[/127.0.0.1:53698 to /127.0.0.1:33443 workers Thread 3,5,main], stackTrace:sun.nio.ch.EPollArrayWrapper#epollWait
    sun.nio.ch.EPollArrayWrapper#poll at line:269
    sun.nio.ch.EPollSelectorImpl#doSelect at line:93
    sun.nio.ch.SelectorImpl#lockAndDoSelect at line:86
    sun.nio.ch.SelectorImpl#select at line:97
    sun.nio.ch.SelectorImpl#select at line:101
    org.gradle.internal.remote.internal.inet.SocketConnection$SocketInputStream#read at line:185
    com.esotericsoftware.kryo.io.Input#fill at line:146
    com.esotericsoftware.kryo.io.Input#require at line:178
    com.esotericsoftware.kryo.io.Input#readByte at line:295
    org.gradle.internal.serialize.kryo.KryoBackedDecoder#readByte at line:81
    org.gradle.internal.remote.internal.hub.InterHubMessageSerializer$MessageReader#read at
line:64
    org.gradle.internal.remote.internal.hub.InterHubMessageSerializer$MessageReader#read at
line:52
    org.gradle.internal.remote.internal.inet.SocketConnection#receive at line:81
    org.gradle.internal.remote.internal.hub.MessageHub$ConnectionReceive#run at line:268
    org.gradle.internal.concurrent.ExecutorPolicy$CatchAndRecordFailures#onExecute at line:64
    org.gradle.internal.concurrent.ManagedExecutorImpl$1#run at line:48
    java.util.concurrent.ThreadPoolExecutor#runWorker at line:1149
    java.util.concurrent.ThreadPoolExecutor$Worker#run at line:624
    org.gradle.internal.concurrent.ThreadFactoryImpl$ManagedThreadRunnable#run at line:56
    java.lang.Thread#run at line:748

    Thread[Test worker,5,main], stackTrace:java.lang.StringBuilder#append at line:136
    java.io.UnixFileSystem#resolve at line:108
    java.io.File#<init> at line:367
    sun.misc.URLClassPath$FileLoader#getResource at line:1374
    sun.misc.URLClassPath#getResource at line:249
    java.net.URLClassLoader$1#run at line:366
    java.net.URLClassLoader$1#run at line:363
    java.security.AccessController#doPrivileged
    java.net.URLClassLoader#findClass at line:362
    java.lang.ClassLoader#loadClass at line:418
    sun.misc.Launcher$AppClassLoader#loadClass at line:355
    java.lang.ClassLoader#loadClass at line:351
    org.codehaus.groovy.reflection.GeneratedMetaMethod$Proxy#createProxy at line:101
    org.codehaus.groovy.reflection.GeneratedMetaMethod$Proxy#proxy at line:93
    org.codehaus.groovy.reflection.GeneratedMetaMethod$Proxy#isValidMethod at line:78
    groovy.lang.MetaClassImpl#chooseMethodInternal at line:3198
    groovy.lang.MetaClassImpl#chooseMethod at line:3160
    groovy.lang.MetaClassImpl#getNormalMethodWithCaching at line:1392
    groovy.lang.MetaClassImpl#getMethodWithCaching at line:1307
    groovy.lang.MetaClassImpl#invokeMethod at line:1072
    groovy.lang.MetaClassImpl#invokeMethod at line:1034
    org.codehaus.groovy.runtime.InvokerHelper#invokePojoMethod at line:935
    org.codehaus.groovy.runtime.InvokerHelper#invokeMethod at line:926
    org.codehaus.groovy.runtime.ScriptBytecodeAdapter#invokeMethodN at line:181
    org.apache.jmeter.services.FileServerSpec#$spock_feature_1_10 at line:132
    sun.reflect.NativeMethodAccessorImpl#invoke0
    sun.reflect.NativeMethodAccessorImpl#invoke at line:62
    sun.reflect.DelegatingMethodAccessorImpl#invoke at line:43
    java.lang.reflect.Method#invoke at line:498
    org.spockframework.util.ReflectionUtil#invokeMethod at line:200
    org.spockframework.runtime.model.MethodInfo#invoke at line:113
    org.spockframework.runtime.BaseSpecRunner#invokeRaw at line:484
    org.spockframework.runtime.BaseSpecRunner#invoke at line:467
    org.spockframework.runtime.BaseSpecRunner#runFeatureMethod at line:408
    org.spockframework.runtime.BaseSpecRunner#doRunIteration at line:322
    org.spockframework.runtime.BaseSpecRunner$6#invoke at line:306
    org.spockframework.runtime.BaseSpecRunner#invokeRaw at line:484
    org.spockframework.runtime.BaseSpecRunner#invoke at line:467
    org.spockframework.runtime.BaseSpecRunner#runIteration at line:285
    org.spockframework.runtime.BaseSpecRunner#initializeAndRunIteration at line:275
    org.spockframework.runtime.BaseSpecRunner#runSimpleFeature at line:266
    org.spockframework.runtime.BaseSpecRunner#doRunFeature at line:260
    org.spockframework.runtime.BaseSpecRunner$5#invoke at line:243
    org.spockframework.runtime.BaseSpecRunner#invokeRaw at line:484
    org.spockframework.runtime.BaseSpecRunner#invoke at line:467
    org.spockframework.runtime.BaseSpecRunner#runFeature at line:235
    org.spockframework.runtime.BaseSpecRunner#runFeatures at line:185
    org.spockframework.runtime.BaseSpecRunner#doRunSpec at line:95
    org.spockframework.runtime.BaseSpecRunner$1#invoke at line:81
    org.spockframework.runtime.BaseSpecRunner#invokeRaw at line:484
    org.spockframework.runtime.BaseSpecRunner#invoke at line:467
    org.spockframework.runtime.BaseSpecRunner#runSpec at line:73
    org.spockframework.runtime.BaseSpecRunner#run at line:64
    org.spockframework.runtime.Sputnik#run at line:63
    org.junit.runner.JUnitCore#run at line:137

FileServerSpec STANDARD_OUT
    org.junit.runner.JUnitCore#run at line:115
    org.junit.vintage.engine.execution.RunnerExecutor#execute at line:43
    org.junit.vintage.engine.VintageTestEngine$$Lambda$427/650092194#accept
    java.util.stream.ForEachOps$ForEachOp$OfRef#accept at line:184
    java.util.stream.ReferencePipeline$3$1#accept at line:193
    java.util.Iterator#forEachRemaining at line:116
    java.util.Spliterators$IteratorSpliterator#forEachRemaining at line:1801
    java.util.stream.AbstractPipeline#copyInto at line:482
    java.util.stream.AbstractPipeline#wrapAndCopyInto at line:472
    java.util.stream.ForEachOps$ForEachOp#evaluateSequential at line:151
    java.util.stream.ForEachOps$ForEachOp$OfRef#evaluateSequential at line:174

FileServerSpec > setBaseDir doesn't set base when passed a directory STANDARD_OUT
    java.util.stream.AbstractPipeline#evaluate at line:234
    java.util.stream.ReferencePipeline#forEach at line:418
    org.junit.vintage.engine.VintageTestEngine#executeAllChildren at line:82
    org.junit.vintage.engine.VintageTestEngine#execute at line:73
    org.junit.platform.launcher.core.DefaultLauncher#execute at line:220
    org.junit.platform.launcher.core.DefaultLauncher#lambda$execute$6 at line:188
    org.junit.platform.launcher.core.DefaultLauncher$$Lambda$172/1625781109#accept
    org.junit.platform.launcher.core.DefaultLauncher#withInterceptedStreams at line:202
    org.junit.platform.launcher.core.DefaultLauncher#execute at line:181
    org.junit.platform.launcher.core.DefaultLauncher#execute at line:128
    org.gradle.api.internal.tasks.testing.junitplatform.JUnitPlatformTestClassProcessor$CollectAllTestClassesExecutor#processAllTestClasses
at line:99
    org.gradle.api.internal.tasks.testing.junitplatform.JUnitPlatformTestClassProcessor$CollectAllTestClassesExecutor#access$000
at line:79
    org.gradle.api.internal.tasks.testing.junitplatform.JUnitPlatformTestClassProcessor#stop
at line:75
    org.gradle.api.internal.tasks.testing.SuiteTestClassProcessor#stop at line:61
    sun.reflect.NativeMethodAccessorImpl#invoke0
    sun.reflect.NativeMethodAccessorImpl#invoke at line:62
    sun.reflect.DelegatingMethodAccessorImpl#invoke at line:43
    java.lang.reflect.Method#invoke at line:498
    org.gradle.internal.dispatch.ReflectionDispatch#dispatch at line:36
    org.gradle.internal.dispatch.ReflectionDispatch#dispatch at line:24
    org.gradle.internal.dispatch.ContextClassLoaderDispatch#dispatch at line:33
    org.gradle.internal.dispatch.ProxyDispatchAdapter$DispatchingInvocationHandler#invoke
at line:94
    com.sun.proxy.$Proxy2#stop
    org.gradle.api.internal.tasks.testing.worker.TestWorker#stop at line:132
    sun.reflect.NativeMethodAccessorImpl#invoke0
    sun.reflect.NativeMethodAccessorImpl#invoke at line:62
    sun.reflect.DelegatingMethodAccessorImpl#invoke at line:43
    java.lang.reflect.Method#invoke at line:498
    org.gradle.internal.dispatch.ReflectionDispatch#dispatch at line:36
    org.gradle.internal.dispatch.ReflectionDispatch#dispatch at line:24
    org.gradle.internal.remote.internal.hub.MessageHubBackedObjectConnection$DispatchWrapper#dispatch
at line:182
    org.gradle.internal.remote.internal.hub.MessageHubBackedObjectConnection$DispatchWrapper#dispatch
at line:164
    org.gradle.internal.remote.internal.hub.MessageHub$Handler#run at line:412
    org.gradle.internal.concurrent.ExecutorPolicy$CatchAndRecordFailures#onExecute at line:64
    org.gradle.internal.concurrent.ManagedExecutorImpl$1#run at line:48
    java.util.concurrent.ThreadPoolExecutor#runWorker at line:1149
    java.util.concurrent.ThreadPoolExecutor$Worker#run at line:624
    org.gradle.internal.concurrent.ThreadFactoryImpl$ManagedThreadRunnable#run at line:56
    java.lang.Thread#run at line:748

FileServerSpec STANDARD_OUT


FileServerSpec > cannot set baseDir when files are open STANDARD_OUT
    Thread[main,5,main], stackTrace:sun.misc.Unsafe#park
    java.util.concurrent.locks.LockSupport#park at line:175
    java.util.concurrent.locks.AbstractQueuedSynchronizer#parkAndCheckInterrupt at line:836
    java.util.concurrent.locks.AbstractQueuedSynchronizer#doAcquireSharedInterruptibly at
line:997
    java.util.concurrent.locks.AbstractQueuedSynchronizer#acquireSharedInterruptibly at line:1304
    java.util.concurrent.CountDownLatch#await at line:231
    org.gradle.api.internal.tasks.testing.worker.TestWorker#execute at line:72
    org.gradle.api.internal.tasks.testing.worker.TestWorker#execute at line:46
    org.gradle.process.internal.worker.child.ActionExecutionWorker#execute at line:91
    org.gradle.process.internal.worker.child.ActionExecutionWorker#execute at line:34
    org.gradle.process.internal.worker.child.SystemApplicationClassLoaderWorker#call at line:137
    org.gradle.process.internal.worker.child.SystemApplicationClassLoaderWorker#call at line:69
    worker.org.gradle.process.internal.worker.GradleWorkerMain#run at line:68
    worker.org.gradle.process.internal.worker.GradleWorkerMain#main at line:73


> Task :src:protocol:http:compileJava
> Task :src:protocol:http:compileGroovy NO-SOURCE
> Task :src:protocol:http:classes
> Task :src:dist:compileJava NO-SOURCE
> Task :src:dist:classes UP-TO-DATE
> Task :src:dist:checkstyleMain NO-SOURCE
> Task :src:dist:jar UP-TO-DATE
> Task :src:protocol:http:jar
> Task :src:dist-check:compileJava NO-SOURCE
> Task :src:dist-check:compileGroovy NO-SOURCE
> Task :src:dist-check:classes UP-TO-DATE
> Task :src:dist-check:checkstyleMain NO-SOURCE
> Task :src:dist-check:spotbugsMain NO-SOURCE
> Task :src:dist-check:jar UP-TO-DATE
> Task :src:dist-check:assemble UP-TO-DATE
> Task :src:protocol:http:compileTestJava UP-TO-DATE
> Task :src:core:check
> Task :src:core:assemble
> Task :src:protocol:http:compileTestGroovy
> Task :src:protocol:http:testClasses
> Task :src:protocol:http:testJar UP-TO-DATE
> Task :src:dist-check:compileTestJava UP-TO-DATE
> Task :src:dist-check:compileTestGroovy
> Task :src:dist-check:testClasses

> Task :src:licenses:gatherBinaryLicenses
License overrides were declared but unused for the following dependencies: [com.thoughtworks.xstream:xstream:1.4.11,
net.sf.saxon:Saxon-HE:9.9.1-5, org.exparity:hamcrest-date:2.0.4]

> Task :src:protocol:http:checkstyleMain FAILED
[ant:checkstyle] [ERROR] <https://builds.apache.org/job/JMeter-trunk/ws/src/protocol/http/src/main/java/org/apache/jmeter/protocol/http/sampler/HTTPHC4Impl.java>:441:
Line is longer than 160 characters (found 321). [LineLength]

> Task :src:licenses:renderLicenseForBinary UP-TO-DATE
> Task :src:dist-check:checkstyleTest
> Task :src:generator:spotbugsMain
> Task :src:examples:spotbugsMain

> Task :src:functions:spotbugsMain
SpotBugs rule violations were found. See the report at: file://<https://builds.apache.org/job/JMeter-trunk/ws/src/functions/build/reports/spotbugs/main.xml>

> Task :src:dist:javadocAggregate
checksum-dependency elapsed time: 10317ms, configurations processed: 331 (add -PchecksumTimingsPrint
to print detailed timings)

FAILURE: Build failed with an exception.

* What went wrong:
Execution failed for task ':src:protocol:http:checkstyleMain'.
> Checkstyle rule violations were found. See the report at: file://<https://builds.apache.org/job/JMeter-trunk/ws/src/protocol/http/build/reports/checkstyle/main.html>
  Checkstyle files with violations: 1
  Checkstyle violations by severity: [error:1]


* Try:
Run with --stacktrace option to get the stack trace. Run with --info or --debug option to
get more log output. Run with --scan to get full insights.

* Get more help at https://help.gradle.org

Deprecated Gradle features were used in this build, making it incompatible with Gradle 7.0.
Use '--warning-mode all' to show the individual deprecation warnings.
See https://docs.gradle.org/6.3/userguide/command_line_interface.html#sec:command_line_warnings

BUILD FAILED in 4m 42s
313 actionable tasks: 179 executed, 134 up-to-date

See the profiling report at: file://<https://builds.apache.org/job/JMeter-trunk/ws/build/reports/profile/profile-2020-05-09-09-28-08.html>
A fine-grained performance profile is available: use the --scan option.
Build step 'Invoke Gradle script' changed build result to FAILURE
Build step 'Invoke Gradle script' marked build as failure
Xvfb stopping
Archiving artifacts
[Fast Archiver] Compressed 33.11 MB of artifacts by 62.7% relative to #7748
Recording test results

Mime
View raw message