jmeter-dev mailing list archives

Site index · List index
Message view « Date » · « Thread »
Top « Date » · « Thread »
From Apache Jenkins Server <jenk...@builds.apache.org>
Subject Build failed in Jenkins: JMeter-trunk #7750
Date Sat, 09 May 2020 09:43:12 GMT
See <https://builds.apache.org/job/JMeter-trunk/7750/display/redirect?page=changes>

Changes:

[felix.schumacher] Update Groovy to 3.0.3 and switch from groovy-all to single jars


------------------------------------------
[...truncated 110.37 KB...]
> Task :src:core:autostyleKotlinGradleCheck
> Task :src:core:autostyleMarkdownCheck NO-SOURCE
> Task :src:core:autostyleCheck
> Task :src:protocol:jdbc:compileJava UP-TO-DATE
> Task :src:protocol:jdbc:compileGroovy NO-SOURCE
> Task :src:protocol:jdbc:classes UP-TO-DATE
> Task :src:protocol:jdbc:jar UP-TO-DATE
> Task :src:protocol:bolt:compileJava UP-TO-DATE
> Task :src:protocol:bolt:compileGroovy NO-SOURCE
> Task :src:protocol:bolt:classes UP-TO-DATE
> Task :src:protocol:bolt:jar UP-TO-DATE
> Task :src:components:compileJava UP-TO-DATE
> Task :src:components:compileGroovy NO-SOURCE
> Task :src:components:classes UP-TO-DATE
> Task :rat
> Task :check
> Task :src:generator:compileJava UP-TO-DATE
> Task :src:examples:compileJava UP-TO-DATE
> Task :src:generator:classes UP-TO-DATE
> Task :src:examples:classes UP-TO-DATE
> Task :src:generator:jar UP-TO-DATE
> Task :src:generator:checkstyleMain
> Task :src:protocol:junit:checkstyleMain
> Task :src:protocol:tcp:checkstyleMain
> Task :src:protocol:bolt:checkstyleMain
> Task :src:protocol:java:checkstyleMain
> Task :src:examples:checkstyleMain
> Task :src:core:checkstyleMain
> Task :src:protocol:native:checkstyleMain
> Task :src:protocol:jdbc:checkstyleMain
> Task :src:protocol:jms:checkstyleMain
> Task :src:protocol:ldap:checkstyleMain
> Task :src:components:checkstyleMain
> Task :src:protocol:mongodb:checkstyleMain
> Task :src:protocol:junit-sample:checkstyleMain
> Task :src:protocol:ftp:checkstyleMain
> Task :src:generator:compileTestJava NO-SOURCE
> Task :src:generator:testClasses UP-TO-DATE
> Task :src:examples:compileTestJava NO-SOURCE
> Task :src:examples:testClasses UP-TO-DATE
> Task :src:examples:checkstyleTest NO-SOURCE
> Task :src:generator:checkstyleTest NO-SOURCE
> Task :src:generator:assemble UP-TO-DATE
> Task :src:examples:jar UP-TO-DATE
> Task :src:examples:assemble UP-TO-DATE
> Task :src:protocol:mail:checkstyleMain
> Task :src:dist:distTarSource
> Task :src:dist:distTarSourceSha512
> Task :src:jorphan:compileTestJava
> Task :src:dist:distZipSource
> Task :src:dist:distZipSourceSha512
> Task :src:dist:processSiteXslt
> Task :src:jorphan:compileTestGroovy
> Task :src:jorphan:processTestResources NO-SOURCE
> Task :src:jorphan:testClasses
> Task :src:jorphan:testJar
> Task :src:jorphan:autostyleConfigsCheck NO-SOURCE
> Task :src:jorphan:autostyleGroovyCheck

> Task :src:protocol:junit-sample:spotbugsMain
SpotBugs rule violations were found. See the report at: file://<https://builds.apache.org/job/JMeter-trunk/ws/src/protocol/junit-sample/build/reports/spotbugs/main.xml>

> Task :src:protocol:junit-sample:assemble UP-TO-DATE
> Task :src:jorphan:autostyleJavaCheck
> Task :src:jorphan:autostyleKotlinGradleCheck
> Task :src:jorphan:autostyleMarkdownCheck NO-SOURCE
> Task :src:jorphan:autostyleCheck
> Task :src:jorphan:checkstyleMain UP-TO-DATE
> Task :src:core:spotbugsMain
> Task :src:protocol:junit:spotbugsMain
> Task :src:protocol:jdbc:spotbugsMain
> Task :src:protocol:java:spotbugsMain
> Task :src:protocol:bolt:spotbugsMain
> Task :src:protocol:tcp:spotbugsMain
> Task :src:protocol:jms:spotbugsMain
> Task :src:protocol:ldap:spotbugsMain
> Task :src:components:spotbugsMain
> Task :src:protocol:native:spotbugsMain
> Task :src:protocol:mongodb:spotbugsMain
> Task :src:protocol:ftp:spotbugsMain
> Task :src:protocol:mail:spotbugsMain
> Task :src:jorphan:checkstyleTest
> Task :src:jorphan:spotbugsMain UP-TO-DATE

> Task :src:protocol:bolt:spotbugsMain
SpotBugs rule violations were found. See the report at: file://<https://builds.apache.org/job/JMeter-trunk/ws/src/protocol/bolt/build/reports/spotbugs/main.xml>

> Task :src:protocol:bolt:assemble UP-TO-DATE

> Task :src:protocol:mongodb:spotbugsMain
SpotBugs rule violations were found. See the report at: file://<https://builds.apache.org/job/JMeter-trunk/ws/src/protocol/mongodb/build/reports/spotbugs/main.xml>

> Task :src:protocol:mongodb:assemble UP-TO-DATE

> Task :src:protocol:jdbc:spotbugsMain
SpotBugs rule violations were found. See the report at: file://<https://builds.apache.org/job/JMeter-trunk/ws/src/protocol/jdbc/build/reports/spotbugs/main.xml>

> Task :src:protocol:jdbc:assemble UP-TO-DATE

> Task :src:protocol:ftp:spotbugsMain
SpotBugs rule violations were found. See the report at: file://<https://builds.apache.org/job/JMeter-trunk/ws/src/protocol/ftp/build/reports/spotbugs/main.xml>

> Task :src:protocol:ftp:assemble UP-TO-DATE

> Task :src:protocol:tcp:spotbugsMain
SpotBugs rule violations were found. See the report at: file://<https://builds.apache.org/job/JMeter-trunk/ws/src/protocol/tcp/build/reports/spotbugs/main.xml>

> Task :src:protocol:tcp:assemble UP-TO-DATE

> Task :src:protocol:native:spotbugsMain
SpotBugs rule violations were found. See the report at: file://<https://builds.apache.org/job/JMeter-trunk/ws/src/protocol/native/build/reports/spotbugs/main.xml>

> Task :src:protocol:native:assemble UP-TO-DATE

> Task :src:protocol:junit:spotbugsMain
SpotBugs rule violations were found. See the report at: file://<https://builds.apache.org/job/JMeter-trunk/ws/src/protocol/junit/build/reports/spotbugs/main.xml>

> Task :src:protocol:junit:assemble UP-TO-DATE
> Task :src:protocol:ldap:assemble UP-TO-DATE
> Task :src:protocol:java:assemble UP-TO-DATE

> Task :src:protocol:mail:spotbugsMain
SpotBugs rule violations were found. See the report at: file://<https://builds.apache.org/job/JMeter-trunk/ws/src/protocol/mail/build/reports/spotbugs/main.xml>

> Task :src:protocol:mail:assemble UP-TO-DATE

> Task :src:protocol:jms:spotbugsMain
SpotBugs rule violations were found. See the report at: file://<https://builds.apache.org/job/JMeter-trunk/ws/src/protocol/jms/build/reports/spotbugs/main.xml>

> Task :src:protocol:jms:assemble UP-TO-DATE
> Task :src:jorphan:spotbugsTest
SpotBugs rule violations were found. See the report at: file://<https://builds.apache.org/job/JMeter-trunk/ws/src/jorphan/build/reports/spotbugs/test.xml>

> Task :src:jorphan:test

PackageTest STANDARD_ERROR
    SLF4J: Failed to load class "org.slf4j.impl.StaticLoggerBinder".
    SLF4J: Defaulting to no-operation (NOP) logger implementation
    SLF4J: See http://www.slf4j.org/codes.html#StaticLoggerBinder for further details.
          0.1sec,    5 completed,   0 failed,   0 skipped, org.apache.jorphan.collections.PackageTest
          0.2sec,   50 completed,   0 failed,   0 skipped, org.apache.jorphan.util.TestJorphanUtils
          0.1sec,    8 completed,   0 failed,   0 skipped, org.apache.jorphan.util.TestConverter
WARNING   0.0sec,   10 completed,   0 failed,   2 skipped, org.apache.jorphan.math.TestStatCalculator
          0.0sec,    6 completed,   0 failed,   0 skipped, org.apache.jorphan.gui.ObjectTableModelTest
          0.1sec,   26 completed,   0 failed,   0 skipped, org.apache.jorphan.gui.ObjectTableSorterTest

> Task :src:components:spotbugsMain
The following classes needed for analysis were missing:
  org.bouncycastle.asn1.x500.style.BCStyle
  org.bouncycastle.asn1.ASN1ObjectIdentifier
  org.bouncycastle.asn1.ASN1Encodable
  org.bouncycastle.asn1.x509.Extension
  org.bouncycastle.operator.DigestCalculatorProvider
  org.bouncycastle.util.Selector
  org.bouncycastle.cert.X509CertificateHolder
  org.bouncycastle.cms.SignerInformationVerifier
  org.bouncycastle.mail.smime.SMIMESignedParser
  org.bouncycastle.operator.bc.BcDigestCalculatorProvider
  org.bouncycastle.cms.CMSException
  org.bouncycastle.mail.smime.SMIMEException
  org.bouncycastle.cms.SignerInformationStore
  org.bouncycastle.cms.SignerInformation
  org.bouncycastle.util.Store
  org.bouncycastle.cms.jcajce.JcaSimpleSignerInfoVerifierBuilder
  org.bouncycastle.asn1.x500.X500Name
  org.bouncycastle.cert.jcajce.JcaX509CertificateHolder
  org.bouncycastle.asn1.x500.RDN
  org.bouncycastle.asn1.x500.AttributeTypeAndValue
  org.bouncycastle.asn1.x500.style.IETFUtils
  org.bouncycastle.asn1.x509.GeneralNames
  org.bouncycastle.asn1.x509.GeneralName
  org.bouncycastle.jce.provider.BouncyCastleProvider
  org.bouncycastle.operator.OperatorCreationException
SpotBugs rule violations were found. See the report at: file://<https://builds.apache.org/job/JMeter-trunk/ws/src/components/build/reports/spotbugs/main.xml>

> Task :src:components:jar UP-TO-DATE
> Task :src:components:assemble UP-TO-DATE
> Task :src:functions:compileJava UP-TO-DATE
> Task :src:functions:compileGroovy NO-SOURCE
> Task :src:functions:classes UP-TO-DATE
> Task :src:functions:jar UP-TO-DATE
> Task :src:protocol:http:compileJava UP-TO-DATE
> Task :src:protocol:http:compileGroovy NO-SOURCE
> Task :src:protocol:http:classes UP-TO-DATE
> Task :src:dist:compileJava NO-SOURCE
> Task :src:dist:classes UP-TO-DATE
> Task :src:dist:checkstyleMain NO-SOURCE
> Task :src:dist:jar UP-TO-DATE
> Task :src:protocol:http:jar UP-TO-DATE
> Task :src:dist-check:compileJava NO-SOURCE
> Task :src:dist-check:compileGroovy NO-SOURCE
> Task :src:dist-check:classes UP-TO-DATE
> Task :src:dist-check:checkstyleMain NO-SOURCE
> Task :src:dist-check:spotbugsMain NO-SOURCE
> Task :src:dist-check:jar UP-TO-DATE
> Task :src:dist-check:assemble UP-TO-DATE
> Task :src:functions:checkstyleMain

> Task :src:protocol:http:checkstyleMain FAILED
[ant:checkstyle] [ERROR] <https://builds.apache.org/job/JMeter-trunk/ws/src/protocol/http/src/main/java/org/apache/jmeter/protocol/http/sampler/HTTPHC4Impl.java>:441:
Line is longer than 160 characters (found 321). [LineLength]

> Task :src:licenses:gatherBinaryLicenses
License overrides were declared but unused for the following dependencies: [com.thoughtworks.xstream:xstream:1.4.11,
net.sf.saxon:Saxon-HE:9.9.1-5, org.exparity:hamcrest-date:2.0.4]

> Task :src:generator:spotbugsMain
> Task :src:examples:spotbugsMain

> Task :src:core:spotbugsMain
SpotBugs rule violations were found. See the report at: file://<https://builds.apache.org/job/JMeter-trunk/ws/src/core/build/reports/spotbugs/main.xml>

> Task :src:functions:spotbugsMain
SpotBugs rule violations were found. See the report at: file://<https://builds.apache.org/job/JMeter-trunk/ws/src/functions/build/reports/spotbugs/main.xml>

> Task :src:dist:javadocAggregate
checksum-dependency elapsed time: 20616ms, configurations processed: 264
    SHA-512 computation time: 120ms (goes in parallel, it might exceed wall-clock time), files
processed: 39, processed: 6MiB, skipped: 2591MiB
    PGP signature resolution time: 5511ms (wall-clock), resolution requests: 155, signatures
resolved: 253
    PGP key resolution time: 12331ms (wall-clock), resolution requests: 155, download time:
2108ms (goes in parallel, it might exceed wall-clock time), keys downloaded: 2
        PGP signature verification time: 15109ms (goes in parallel, it might exceed wall-clock
time), files processed: 597, processed: 575MiB, skipped: 1993MiB

FAILURE: Build failed with an exception.

* What went wrong:
Execution failed for task ':src:protocol:http:checkstyleMain'.
> Checkstyle rule violations were found. See the report at: file://<https://builds.apache.org/job/JMeter-trunk/ws/src/protocol/http/build/reports/checkstyle/main.html>
  Checkstyle files with violations: 1
  Checkstyle violations by severity: [error:1]


* Try:
Run with --stacktrace option to get the stack trace. Run with --info or --debug option to
get more log output. Run with --scan to get full insights.

* Get more help at https://help.gradle.org

Deprecated Gradle features were used in this build, making it incompatible with Gradle 7.0.
Use '--warning-mode all' to show the individual deprecation warnings.
See https://docs.gradle.org/6.3/userguide/command_line_interface.html#sec:command_line_warnings

BUILD FAILED in 4m 2s
233 actionable tasks: 133 executed, 100 up-to-date

See the profiling report at: file://<https://builds.apache.org/job/JMeter-trunk/ws/build/reports/profile/profile-2020-05-09-09-38-59.html>
A fine-grained performance profile is available: use the --scan option.
Build step 'Invoke Gradle script' changed build result to FAILURE
Build step 'Invoke Gradle script' marked build as failure
Xvfb stopping
Archiving artifacts
[Fast Archiver] Compressed 33.11 MB of artifacts by 51.1% relative to #7748
Recording test results

Mime
View raw message