jmeter-dev mailing list archives

Site index · List index
Message view « Date » · « Thread »
Top « Date » · « Thread »
From Apache Jenkins Server <jenk...@builds.apache.org>
Subject Build failed in Jenkins: JMeter-trunk #7790
Date Thu, 09 Jul 2020 07:24:24 GMT
See <https://builds.apache.org/job/JMeter-trunk/7790/display/redirect>

Changes:


------------------------------------------
[...truncated 19.13 KB...]
> Task :src:protocol:mongodb:cleanTest UP-TO-DATE
> Task :src:protocol:native:cleanTest UP-TO-DATE
> Task :src:protocol:tcp:cleanTest UP-TO-DATE
> Task :src:bom:autostyleConfigsCheck NO-SOURCE
> Task :src:bshclient:autostyleConfigsCheck NO-SOURCE
> Task :src:config:autostyleConfigsCheck NO-SOURCE
> Task :src:dist:autostyleConfigsCheck NO-SOURCE
> Task :src:dist:autostyleJavaCheck NO-SOURCE
> Task :src:core:versionClass UP-TO-DATE
> Task :src:config:autostyleJavaCheck NO-SOURCE
> Task :src:protocol:junit:processResources NO-SOURCE
> Task :src:protocol:ftp:processResources NO-SOURCE
> Task :src:protocol:jms:processResources NO-SOURCE
> Task :src:protocol:ldap:processResources NO-SOURCE
> Task :src:functions:processResources UP-TO-DATE
> Task :src:protocol:mail:processResources UP-TO-DATE
> Task :src:protocol:native:processResources NO-SOURCE
> Task :src:protocol:java:processResources UP-TO-DATE
> Task :src:protocol:junit:processTestResources NO-SOURCE
> Task :src:protocol:ftp:processTestResources NO-SOURCE
> Task :src:protocol:http:processResources UP-TO-DATE
> Task :src:protocol:jms:processTestResources NO-SOURCE
> Task :src:protocol:ldap:processTestResources NO-SOURCE
> Task :src:protocol:mail:processTestResources NO-SOURCE
> Task :src:protocol:bolt:processResources UP-TO-DATE
> Task :src:protocol:native:processTestResources NO-SOURCE
> Task :src:protocol:tcp:processResources NO-SOURCE
> Task :src:protocol:java:processTestResources NO-SOURCE
> Task :src:protocol:mongodb:processResources UP-TO-DATE
> Task :src:generator:processResources NO-SOURCE
> Task :src:protocol:junit-sample:processResources NO-SOURCE
> Task :src:protocol:bolt:processTestResources NO-SOURCE
> Task :src:launcher:compileJava UP-TO-DATE
> Task :src:testkit:compileJava UP-TO-DATE
> Task :src:protocol:tcp:processTestResources NO-SOURCE
> Task :src:protocol:mongodb:processTestResources NO-SOURCE
> Task :src:generator:autostyleConfigsCheck NO-SOURCE
> Task :src:protocol:autostyleConfigsCheck NO-SOURCE
> Task :src:release:autostyleConfigsCheck NO-SOURCE
> Task :src:dist-check:autostyleConfigsCheck NO-SOURCE
> Task :src:functions:processTestResources UP-TO-DATE
> Task :src:protocol:jdbc:processResources UP-TO-DATE
> Task :src:protocol:ftp:autostyleConfigsCheck NO-SOURCE
> Task :src:licenses:autostyleConfigsCheck NO-SOURCE
> Task :src:testkit:processResources NO-SOURCE
> Task :src:protocol:autostyleJavaCheck NO-SOURCE
> Task :src:release:autostyleJavaCheck NO-SOURCE
> Task :src:testkit:classes UP-TO-DATE
> Task :src:licenses:autostyleJavaCheck NO-SOURCE
> Task :src:launcher:processResources UP-TO-DATE
> Task :src:launcher:classes UP-TO-DATE
> Task :src:protocol:jdbc:processTestResources NO-SOURCE
> Task :src:launcher:jar UP-TO-DATE
> Task :src:testkit:jar UP-TO-DATE
> Task :src:protocol:http:processTestResources UP-TO-DATE
> Task :src:testkit:compileTestFixturesJava NO-SOURCE
> Task :src:testkit:processTestFixturesResources NO-SOURCE
> Task :src:testkit:testFixturesClasses UP-TO-DATE
> Task :src:launcher:autostyleConfigsCheck NO-SOURCE
> Task :src:testkit:testFixturesJar UP-TO-DATE
> Task :src:testkit:autostyleConfigsCheck NO-SOURCE
> Task :src:jorphan:compileJava UP-TO-DATE
> Task :src:protocol:bolt:autostyleConfigsCheck
> Task :src:jorphan:compileGroovy NO-SOURCE
> Task :src:protocol:http:autostyleConfigsCheck
> Task :src:functions:autostyleConfigsCheck
> Task :src:autostyleConfigsCheck
> Task :src:examples:autostyleConfigsCheck
> Task :src:protocol:java:autostyleConfigsCheck
> Task :src:protocol:jdbc:autostyleConfigsCheck
> Task :src:jorphan:processResources UP-TO-DATE
> Task :src:jorphan:classes UP-TO-DATE
> Task :src:protocol:bolt:autostyleGroovyCheck
> Task :src:jorphan:jar UP-TO-DATE
> Task :src:functions:autostyleGroovyCheck
> Task :src:protocol:jdbc:autostyleGroovyCheck
> Task :src:dist-check:autostyleGroovyCheck
> Task :src:protocol:http:autostyleGroovyCheck
> Task :src:core:processResources UP-TO-DATE
> Task :src:testkit-wiremock:compileJava UP-TO-DATE
> Task :src:testkit-wiremock:processResources NO-SOURCE
> Task :src:testkit-wiremock:classes UP-TO-DATE
> Task :src:testkit-wiremock:jar UP-TO-DATE
> Task :src:testkit-wiremock:compileTestFixturesJava NO-SOURCE
> Task :src:testkit-wiremock:processTestFixturesResources NO-SOURCE
> Task :src:testkit-wiremock:testFixturesClasses UP-TO-DATE
> Task :src:testkit-wiremock:testFixturesJar UP-TO-DATE
> Task :src:testkit-wiremock:autostyleConfigsCheck NO-SOURCE
> Task :src:components:autostyleConfigsCheck
> Task :src:components:autostyleGroovyCheck
> Task :src:jorphan:compileTestJava UP-TO-DATE
> Task :src:jorphan:compileTestGroovy UP-TO-DATE
> Task :src:jorphan:processTestResources NO-SOURCE
> Task :src:jorphan:testClasses UP-TO-DATE
> Task :src:jorphan:testJar UP-TO-DATE
> Task :src:jorphan:autostyleConfigsCheck NO-SOURCE
> Task :autostyleConfigsCheck
> Task :autostyleJavaCheck NO-SOURCE
> Task :src:jorphan:autostyleGroovyCheck
> Task :src:testkit-wiremock:autostyleJavaCheck
> Task :src:bshclient:autostyleJavaCheck
> Task :src:testkit:autostyleJavaCheck
> Task :src:generator:autostyleJavaCheck
> Task :src:protocol:bolt:autostyleJavaCheck
> Task :src:protocol:bolt:autostyleKotlinGradleCheck NO-SOURCE
> Task :src:protocol:bolt:autostyleMarkdownCheck NO-SOURCE
> Task :src:protocol:bolt:autostyleCheck
> Task :src:protocol:jms:autostyleConfigsCheck NO-SOURCE
> Task :src:launcher:autostyleJavaCheck
> Task :src:protocol:ftp:autostyleJavaCheck
> Task :src:protocol:ftp:autostyleKotlinGradleCheck NO-SOURCE
> Task :src:protocol:ftp:autostyleMarkdownCheck NO-SOURCE
> Task :src:protocol:ftp:autostyleCheck
> Task :src:examples:autostyleJavaCheck
> Task :src:protocol:junit:autostyleConfigsCheck NO-SOURCE
> Task :src:dist-check:autostyleJavaCheck
> Task :src:protocol:jdbc:autostyleJavaCheck
> Task :src:protocol:jdbc:autostyleKotlinGradleCheck NO-SOURCE
> Task :src:protocol:jdbc:autostyleMarkdownCheck NO-SOURCE
> Task :src:protocol:jdbc:autostyleCheck
> Task :src:protocol:junit-sample:autostyleConfigsCheck NO-SOURCE
> Task :src:protocol:junit:autostyleJavaCheck
> Task :src:protocol:junit:autostyleKotlinGradleCheck NO-SOURCE
> Task :src:protocol:junit:autostyleMarkdownCheck NO-SOURCE
> Task :src:protocol:junit:autostyleCheck
> Task :src:protocol:ldap:autostyleConfigsCheck NO-SOURCE
> Task :src:protocol:java:autostyleJavaCheck
> Task :src:protocol:java:autostyleKotlinGradleCheck NO-SOURCE
> Task :src:protocol:java:autostyleMarkdownCheck NO-SOURCE
> Task :src:protocol:java:autostyleCheck
> Task :src:protocol:mail:autostyleConfigsCheck NO-SOURCE
> Task :src:protocol:junit-sample:autostyleJavaCheck
> Task :src:protocol:junit-sample:autostyleKotlinGradleCheck NO-SOURCE
> Task :src:protocol:junit-sample:autostyleMarkdownCheck NO-SOURCE
> Task :src:protocol:junit-sample:autostyleCheck
> Task :src:protocol:junit-sample:processTestResources NO-SOURCE
> Task :src:protocol:mongodb:autostyleConfigsCheck
> Task :src:protocol:mongodb:autostyleJavaCheck
> Task :src:protocol:mongodb:autostyleKotlinGradleCheck NO-SOURCE
> Task :src:protocol:mongodb:autostyleMarkdownCheck NO-SOURCE
> Task :src:protocol:mongodb:autostyleCheck
> Task :src:protocol:native:autostyleConfigsCheck NO-SOURCE
> Task :src:protocol:native:autostyleJavaCheck
> Task :src:protocol:native:autostyleKotlinGradleCheck NO-SOURCE
> Task :src:protocol:native:autostyleMarkdownCheck NO-SOURCE
> Task :src:protocol:native:autostyleCheck
> Task :src:protocol:ldap:autostyleJavaCheck
> Task :src:protocol:tcp:autostyleConfigsCheck NO-SOURCE
> Task :src:protocol:ldap:autostyleKotlinGradleCheck NO-SOURCE
> Task :src:protocol:ldap:autostyleMarkdownCheck NO-SOURCE
> Task :src:protocol:ldap:autostyleCheck
> Task :src:protocol:mail:autostyleJavaCheck
> Task :src:protocol:mail:autostyleKotlinGradleCheck NO-SOURCE
> Task :src:protocol:mail:autostyleMarkdownCheck NO-SOURCE
> Task :src:protocol:mail:autostyleCheck
> Task :src:protocol:jms:autostyleJavaCheck
> Task :src:protocol:jms:autostyleKotlinGradleCheck NO-SOURCE
> Task :src:protocol:jms:autostyleMarkdownCheck NO-SOURCE
> Task :src:protocol:jms:autostyleCheck
> Task :src:protocol:tcp:autostyleJavaCheck
> Task :src:protocol:tcp:autostyleKotlinGradleCheck NO-SOURCE
> Task :src:protocol:tcp:autostyleMarkdownCheck NO-SOURCE
> Task :src:protocol:tcp:autostyleCheck
> Task :src:functions:autostyleJavaCheck
> Task :src:jorphan:autostyleJavaCheck
> Task :src:core:compileJava FAILED
> Task :src:protocol:http:autostyleJavaCheck
> Task :src:testkit:autostyleKotlinGradleCheck
> Task :src:examples:autostyleKotlinGradleCheck
> Task :src:testkit-wiremock:autostyleKotlinGradleCheck
> Task :src:generator:autostyleKotlinGradleCheck
> Task :src:bshclient:autostyleKotlinGradleCheck
> Task :src:components:autostyleJavaCheck
> Task :src:jorphan:autostyleKotlinGradleCheck
> Task :src:functions:autostyleKotlinGradleCheck
> Task :src:launcher:autostyleKotlinGradleCheck
> Task :src:config:autostyleKotlinGradleCheck
> Task :src:release:autostyleKotlinGradleCheck
> Task :src:protocol:autostyleKotlinGradleCheck
> Task :src:bom:autostyleKotlinGradleCheck
> Task :src:autostyleKotlinGradleCheck
> Task :src:dist-check:autostyleKotlinGradleCheck
> Task :src:licenses:autostyleKotlinGradleCheck
> Task :src:dist:autostyleKotlinGradleCheck
> Task :autostyleKotlinGradleCheck
checksum-dependency elapsed time: 8871ms, configurations processed: 97 (add -PchecksumTimingsPrint
to print detailed timings)

FAILURE: Build failed with an exception.

* What went wrong:
Execution failed for task ':src:core:compileJava'.
> Could not resolve all files for configuration ':src:core:compileClasspath'.
   > Could not find com.github.weisj:darklaf-core:2.4.0.
     Searched in the following locations:
       - https://repo.maven.apache.org/maven2/com/github/weisj/darklaf-core/2.4.0/darklaf-core-2.4.0.pom
       - https://jcenter.bintray.com/com/github/weisj/darklaf-core/2.4.0/darklaf-core-2.4.0.pom
     Required by:
         project :src:core
   > Could not find com.github.weisj:darklaf-theme:2.4.0.
     Searched in the following locations:
       - https://repo.maven.apache.org/maven2/com/github/weisj/darklaf-theme/2.4.0/darklaf-theme-2.4.0.pom
       - https://jcenter.bintray.com/com/github/weisj/darklaf-theme/2.4.0/darklaf-theme-2.4.0.pom
     Required by:
         project :src:core
   > Could not find com.github.weisj:darklaf-property-loader:2.4.0.
     Searched in the following locations:
       - https://repo.maven.apache.org/maven2/com/github/weisj/darklaf-property-loader/2.4.0/darklaf-property-loader-2.4.0.pom
       - https://jcenter.bintray.com/com/github/weisj/darklaf-property-loader/2.4.0/darklaf-property-loader-2.4.0.pom
     Required by:
         project :src:core
   > Could not find com.github.weisj:darklaf-core:2.4.0.
     Searched in the following locations:
       - https://repo.maven.apache.org/maven2/com/github/weisj/darklaf-core/2.4.0/darklaf-core-2.4.0.pom
       - https://jcenter.bintray.com/com/github/weisj/darklaf-core/2.4.0/darklaf-core-2.4.0.pom
     Required by:
         project :src:core > project :src:bom
   > Could not find com.github.weisj:darklaf-theme:2.4.0.
     Searched in the following locations:
       - https://repo.maven.apache.org/maven2/com/github/weisj/darklaf-theme/2.4.0/darklaf-theme-2.4.0.pom
       - https://jcenter.bintray.com/com/github/weisj/darklaf-theme/2.4.0/darklaf-theme-2.4.0.pom
     Required by:
         project :src:core > project :src:bom
   > Could not find com.github.weisj:darklaf-property-loader:2.4.0.
     Searched in the following locations:
       - https://repo.maven.apache.org/maven2/com/github/weisj/darklaf-property-loader/2.4.0/darklaf-property-loader-2.4.0.pom
       - https://jcenter.bintray.com/com/github/weisj/darklaf-property-loader/2.4.0/darklaf-property-loader-2.4.0.pom
     Required by:
         project :src:core > project :src:bom

* Try:
Run with --stacktrace option to get the stack trace. Run with --info or --debug option to
get more log output. Run with --scan to get full insights.

* Get more help at https://help.gradle.org

Deprecated Gradle features were used in this build, making it incompatible with Gradle 7.0.
Use '--warning-mode all' to show the individual deprecation warnings.
See https://docs.gradle.org/6.3/userguide/command_line_interface.html#sec:command_line_warnings

BUILD FAILED in 32s
114 actionable tasks: 58 executed, 56 up-to-date

See the profiling report at: file://<https://builds.apache.org/job/JMeter-trunk/ws/build/reports/profile/profile-2020-07-09-07-23-49.html>
A fine-grained performance profile is available: use the --scan option.
Build step 'Invoke Gradle script' changed build result to FAILURE
Build step 'Invoke Gradle script' marked build as failure
Xvfb stopping
Archiving artifacts
Recording test results
ERROR: Step ?Publish JUnit test result report? failed: No test report files were found. Configuration
error?

Mime
View raw message