jmeter-dev mailing list archives

Site index · List index
Message view « Date » · « Thread »
Top « Date » · « Thread »
From Apache Jenkins Server <jenk...@builds.apache.org>
Subject Build failed in Jenkins: JMeter-trunk #7789
Date Thu, 09 Jul 2020 07:23:40 GMT
See <https://builds.apache.org/job/JMeter-trunk/7789/display/redirect?page=changes>

Changes:

[pmouawad] Upgrade Darklaf to 2.4.0 from 2.3.0


------------------------------------------
[...truncated 59.37 KB...]
> Task :src:release:spotbugsMain NO-SOURCE
> Task :src:protocol:processResources NO-SOURCE
> Task :src:licenses:compileJava NO-SOURCE
> Task :src:config:checkstyleTest NO-SOURCE
> Task :src:dist-check:processResources NO-SOURCE
> Task :src:assemble UP-TO-DATE
> Task :src:config:spotbugsMain NO-SOURCE
> Task :src:bom:assemble UP-TO-DATE
> Task :src:licenses:processResources NO-SOURCE
> Task :src:config:spotbugsTest NO-SOURCE
> Task :src:protocol:mongodb:autostyleConfigsCheck
> Task :src:bshclient:compileJava UP-TO-DATE
> Task :src:dist:autostyleKotlinGradleCheck
> Task :autostyleKotlinGradleCheck
> Task :src:dist-check:processTestResources UP-TO-DATE
> Task :src:protocol:native:autostyleJavaCheck
> Task :src:examples:processResources UP-TO-DATE
> Task :src:protocol:classes UP-TO-DATE
> Task :src:release:spotbugsTest NO-SOURCE
> Task :src:examples:processTestResources NO-SOURCE
> Task :src:licenses:classes UP-TO-DATE
> Task :src:protocol:checkstyleMain NO-SOURCE
> Task :src:dist:autostyleMarkdownCheck NO-SOURCE
> Task :src:protocol:native:autostyleKotlinGradleCheck NO-SOURCE
> Task :src:bshclient:processResources NO-SOURCE
> Task :src:config:test NO-SOURCE
> Task :src:protocol:mail:autostyleJavaCheck
> Task :src:config:check
> Task :src:bshclient:classes UP-TO-DATE
> Task :src:release:test NO-SOURCE
> Task :src:protocol:native:autostyleMarkdownCheck NO-SOURCE
> Task :src:protocol:mail:autostyleKotlinGradleCheck NO-SOURCE
> Task :src:protocol:ldap:autostyleJavaCheck
> Task :src:dist:autostyleCheck
> Task :src:licenses:checkstyleMain NO-SOURCE
> Task :src:release:check
> Task :src:protocol:native:autostyleCheck
> Task :src:protocol:compileTestJava NO-SOURCE
> Task :src:protocol:ldap:autostyleKotlinGradleCheck NO-SOURCE
> Task :src:protocol:mail:autostyleMarkdownCheck NO-SOURCE
> Task :src:protocol:tcp:autostyleJavaCheck
> Task :src:protocol:mail:autostyleCheck
> Task :src:protocol:processTestResources NO-SOURCE
> Task :src:protocol:testClasses UP-TO-DATE
> Task :src:licenses:compileTestJava NO-SOURCE
> Task :src:protocol:tcp:autostyleKotlinGradleCheck NO-SOURCE
> Task :src:dist:processResources NO-SOURCE
> Task :src:protocol:ldap:autostyleMarkdownCheck NO-SOURCE
> Task :src:protocol:checkstyleTest NO-SOURCE
> Task :src:protocol:ldap:autostyleCheck
> Task :src:protocol:spotbugsMain NO-SOURCE
> Task :src:dist:processTestResources NO-SOURCE
> Task :src:licenses:processTestResources NO-SOURCE
> Task :src:licenses:testClasses UP-TO-DATE
> Task :src:protocol:spotbugsTest NO-SOURCE
> Task :src:protocol:tcp:autostyleMarkdownCheck NO-SOURCE
> Task :src:licenses:checkstyleTest NO-SOURCE
> Task :src:protocol:tcp:autostyleCheck
> Task :src:licenses:spotbugsMain NO-SOURCE
> Task :src:protocol:test NO-SOURCE
> Task :src:licenses:spotbugsTest NO-SOURCE
> Task :src:protocol:check
> Task :src:licenses:test NO-SOURCE
> Task :src:licenses:check
> Task :src:dist:preparePropertiesbuildPrintableDoc UP-TO-DATE
> Task :src:protocol:jar UP-TO-DATE
> Task :src:protocol:assemble UP-TO-DATE
> Task :src:functions:autostyleJavaCheck
> Task :src:functions:autostyleKotlinGradleCheck
> Task :src:functions:autostyleMarkdownCheck NO-SOURCE
> Task :src:functions:autostyleCheck
> Task :src:testkit-wiremock:compileJava UP-TO-DATE
> Task :src:testkit-wiremock:processResources NO-SOURCE
> Task :src:testkit-wiremock:classes UP-TO-DATE
> Task :src:protocol:jms:autostyleJavaCheck
> Task :src:protocol:jms:autostyleKotlinGradleCheck NO-SOURCE
> Task :src:protocol:jms:autostyleMarkdownCheck NO-SOURCE
> Task :src:protocol:jms:autostyleCheck
> Task :src:protocol:mongodb:autostyleJavaCheck
> Task :src:protocol:mongodb:autostyleKotlinGradleCheck NO-SOURCE
> Task :src:protocol:mongodb:autostyleMarkdownCheck NO-SOURCE
> Task :src:protocol:mongodb:autostyleCheck
> Task :autostyleMarkdownCheck
> Task :autostyleCheck
> Task :compileJava NO-SOURCE
> Task :processResources NO-SOURCE
> Task :classes UP-TO-DATE
> Task :checkstyleMain NO-SOURCE
> Task :compileTestJava NO-SOURCE
> Task :processTestResources NO-SOURCE
> Task :testClasses UP-TO-DATE
> Task :checkstyleTest NO-SOURCE
> Task :gitProps
> Task :src:licenses:gatherSourceLicenses UP-TO-DATE
> Task :src:jorphan:compileJava UP-TO-DATE
> Task :src:jorphan:compileGroovy NO-SOURCE
> Task :src:jorphan:processResources UP-TO-DATE
> Task :src:jorphan:classes UP-TO-DATE
> Task :src:release:jar UP-TO-DATE
> Task :src:release:assemble UP-TO-DATE
> Task :src:licenses:renderLicenseForSource UP-TO-DATE
> Task :src:licenses:renderLicenseForSourceCopySpec
> Task :src:jorphan:jar UP-TO-DATE
> Task :src:dist-check:populateLibs
> Task :src:testkit:checkstyleMain UP-TO-DATE
> Task :src:bshclient:checkstyleMain UP-TO-DATE
> Task :src:launcher:checkstyleMain UP-TO-DATE
> Task :src:testkit:compileTestJava NO-SOURCE
> Task :src:bshclient:compileTestJava NO-SOURCE
> Task :src:launcher:compileTestJava NO-SOURCE
> Task :src:testkit:processTestResources NO-SOURCE
> Task :src:bshclient:processTestResources NO-SOURCE
> Task :src:bshclient:testClasses UP-TO-DATE
> Task :src:testkit:testClasses UP-TO-DATE
> Task :src:launcher:processTestResources NO-SOURCE
> Task :src:bshclient:checkstyleTest NO-SOURCE
> Task :src:testkit:checkstyleTest NO-SOURCE
> Task :src:launcher:testClasses UP-TO-DATE
> Task :src:testkit:checkstyleTestFixtures NO-SOURCE
> Task :src:launcher:checkstyleTest NO-SOURCE
> Task :src:licenses:srcLicenseDir UP-TO-DATE
> Task :src:licenses:jar UP-TO-DATE
> Task :src:protocol:http:autostyleJavaCheck
> Task :src:protocol:http:autostyleKotlinGradleCheck NO-SOURCE
> Task :src:protocol:http:autostyleMarkdownCheck NO-SOURCE
> Task :src:protocol:http:autostyleCheck
> Task :src:bshclient:spotbugsMain UP-TO-DATE
> Task :src:testkit:spotbugsMain UP-TO-DATE
> Task :src:launcher:spotbugsMain UP-TO-DATE
> Task :src:bshclient:spotbugsTest NO-SOURCE
> Task :src:testkit:spotbugsTest NO-SOURCE
> Task :src:launcher:spotbugsTest NO-SOURCE
> Task :src:testkit:spotbugsTestFixtures NO-SOURCE
> Task :src:bshclient:test NO-SOURCE
> Task :src:bshclient:check
> Task :src:launcher:test NO-SOURCE
> Task :src:launcher:check
> Task :src:testkit:test NO-SOURCE
> Task :src:launcher:assemble UP-TO-DATE
> Task :src:testkit:check
> Task :src:testkit:assemble UP-TO-DATE
> Task :src:bshclient:jar UP-TO-DATE
> Task :src:bshclient:assemble UP-TO-DATE
> Task :src:core:processResources
> Task :src:dist:buildPrintableDoc
> Task :src:testkit-wiremock:jar UP-TO-DATE
> Task :src:testkit-wiremock:compileTestFixturesJava NO-SOURCE
> Task :src:testkit-wiremock:processTestFixturesResources NO-SOURCE
> Task :src:testkit-wiremock:testFixturesClasses UP-TO-DATE
> Task :src:testkit-wiremock:testFixturesJar UP-TO-DATE
> Task :src:testkit-wiremock:autostyleConfigsCheck NO-SOURCE
> Task :src:testkit-wiremock:autostyleJavaCheck
> Task :src:testkit-wiremock:autostyleKotlinGradleCheck
> Task :src:testkit-wiremock:autostyleMarkdownCheck NO-SOURCE
> Task :src:testkit-wiremock:autostyleCheck
> Task :src:testkit-wiremock:checkstyleMain UP-TO-DATE
> Task :src:testkit-wiremock:compileTestJava NO-SOURCE
> Task :src:testkit-wiremock:processTestResources NO-SOURCE
> Task :src:testkit-wiremock:testClasses UP-TO-DATE
> Task :src:testkit-wiremock:checkstyleTest NO-SOURCE
> Task :src:testkit-wiremock:checkstyleTestFixtures NO-SOURCE
> Task :src:core:processResources UP-TO-DATE
> Task :src:config:jar UP-TO-DATE
> Task :src:config:assemble UP-TO-DATE
> Task :src:components:autostyleJavaCheck
> Task :src:testkit-wiremock:spotbugsMain UP-TO-DATE
> Task :src:testkit-wiremock:spotbugsTest NO-SOURCE
> Task :src:testkit-wiremock:spotbugsTestFixtures NO-SOURCE
> Task :src:testkit-wiremock:test NO-SOURCE
> Task :src:testkit-wiremock:check
> Task :src:testkit-wiremock:assemble UP-TO-DATE
> Task :rat
> Task :src:jorphan:compileTestJava
> Task :spotbugsMain NO-SOURCE
> Task :spotbugsTest NO-SOURCE
> Task :test NO-SOURCE
> Task :jar UP-TO-DATE
> Task :assemble UP-TO-DATE
> Task :src:core:compileJava FAILED
> Task :src:jorphan:compileTestJava UP-TO-DATE
> Task :src:dist:distTarSource
checksum-dependency elapsed time: 156470ms, configurations processed: 122
    SHA-512 computation time: 7726ms (goes in parallel, it might exceed wall-clock time),
files processed: 33, processed: 5MiB, skipped: 1078MiB
    PGP signature resolution time: 17460ms (wall-clock), resolution requests: 72, signatures
resolved: 202
    PGP key resolution time: 90407ms (wall-clock), resolution requests: 72, download time:
0ms (goes in parallel, it might exceed wall-clock time), keys downloaded: 0
        PGP signature verification time: 190244ms (goes in parallel, it might exceed wall-clock
time), files processed: 490, processed: 593MiB, skipped: 484MiB

FAILURE: Build failed with an exception.

* What went wrong:
Execution failed for task ':src:core:compileJava'.
> Could not resolve all files for configuration ':src:core:compileClasspath'.
   > Could not find com.github.weisj:darklaf-core:2.4.0.
     Searched in the following locations:
       - https://repo.maven.apache.org/maven2/com/github/weisj/darklaf-core/2.4.0/darklaf-core-2.4.0.pom
       - https://jcenter.bintray.com/com/github/weisj/darklaf-core/2.4.0/darklaf-core-2.4.0.pom
     Required by:
         project :src:core
   > Could not find com.github.weisj:darklaf-theme:2.4.0.
     Searched in the following locations:
       - https://repo.maven.apache.org/maven2/com/github/weisj/darklaf-theme/2.4.0/darklaf-theme-2.4.0.pom
       - https://jcenter.bintray.com/com/github/weisj/darklaf-theme/2.4.0/darklaf-theme-2.4.0.pom
     Required by:
         project :src:core
   > Could not find com.github.weisj:darklaf-property-loader:2.4.0.
     Searched in the following locations:
       - https://repo.maven.apache.org/maven2/com/github/weisj/darklaf-property-loader/2.4.0/darklaf-property-loader-2.4.0.pom
       - https://jcenter.bintray.com/com/github/weisj/darklaf-property-loader/2.4.0/darklaf-property-loader-2.4.0.pom
     Required by:
         project :src:core
   > Could not find com.github.weisj:darklaf-core:2.4.0.
     Searched in the following locations:
       - https://repo.maven.apache.org/maven2/com/github/weisj/darklaf-core/2.4.0/darklaf-core-2.4.0.pom
       - https://jcenter.bintray.com/com/github/weisj/darklaf-core/2.4.0/darklaf-core-2.4.0.pom
     Required by:
         project :src:core > project :src:bom
   > Could not find com.github.weisj:darklaf-theme:2.4.0.
     Searched in the following locations:
       - https://repo.maven.apache.org/maven2/com/github/weisj/darklaf-theme/2.4.0/darklaf-theme-2.4.0.pom
       - https://jcenter.bintray.com/com/github/weisj/darklaf-theme/2.4.0/darklaf-theme-2.4.0.pom
     Required by:
         project :src:core > project :src:bom
   > Could not find com.github.weisj:darklaf-property-loader:2.4.0.
     Searched in the following locations:
       - https://repo.maven.apache.org/maven2/com/github/weisj/darklaf-property-loader/2.4.0/darklaf-property-loader-2.4.0.pom
       - https://jcenter.bintray.com/com/github/weisj/darklaf-property-loader/2.4.0/darklaf-property-loader-2.4.0.pom
     Required by:
         project :src:core > project :src:bom

* Try:
Run with --stacktrace option to get the stack trace. Run with --info or --debug option to
get more log output. Run with --scan to get full insights.

* Get more help at https://help.gradle.org

Deprecated Gradle features were used in this build, making it incompatible with Gradle 7.0.
Use '--warning-mode all' to show the individual deprecation warnings.
See https://docs.gradle.org/6.3/userguide/command_line_interface.html#sec:command_line_warnings

BUILD FAILED in 2m 31s
137 actionable tasks: 80 executed, 57 up-to-date

See the profiling report at: file://<https://builds.apache.org/job/JMeter-trunk/ws/build/reports/profile/profile-2020-07-09-07-20-54.html>
A fine-grained performance profile is available: use the --scan option.
Build step 'Invoke Gradle script' changed build result to FAILURE
Build step 'Invoke Gradle script' marked build as failure
Xvfb stopping
Archiving artifacts
Recording test results
ERROR: Step ?Publish JUnit test result report? failed: No test report files were found. Configuration
error?

Mime
View raw message