jmeter-dev mailing list archives

Site index · List index
Message view « Date » · « Thread »
Top « Date » · « Thread »
From Apache Jenkins Server <jenk...@builds.apache.org>
Subject Build failed in Jenkins: JMeter » JMeter-trunk #81
Date Wed, 09 Sep 2020 16:13:56 GMT
See <https://ci-builds.apache.org/job/JMeter/job/JMeter-trunk/81/display/redirect?page=changes>

Changes:

[github] Use theme from darklaf extensions for RSyntaxTextArea. (#617)


------------------------------------------
[...truncated 262.70 KB...]
    java.util.concurrent.ThreadPoolExecutor$Worker#run at line:624
    org.gradle.internal.concurrent.ThreadFactoryImpl$ManagedThreadRunnable#run at line:56
    java.lang.Thread#run at line:748

    Thread[Test worker,5,main], stackTrace:java.lang.Object#wait
    java.util.concurrent.ForkJoinTask#externalInterruptibleAwaitDone at line:367
    java.util.concurrent.ForkJoinTask#get at line:1001
    org.junit.platform.engine.support.hierarchical.HierarchicalTestEngine#execute at line:51
    org.junit.platform.launcher.core.DefaultLauncher#execute at line:248
    org.junit.platform.launcher.core.DefaultLauncher#lambda$execute$5 at line:211
    org.junit.platform.launcher.core.DefaultLauncher$$Lambda$243/1105059158#accept
    org.junit.platform.launcher.core.DefaultLauncher#withInterceptedStreams at line:226
    org.junit.platform.launcher.core.DefaultLauncher#execute at line:199
    org.junit.platform.launcher.core.DefaultLauncher#execute at line:132
    org.gradle.api.internal.tasks.testing.junitplatform.JUnitPlatformTestClassProcessor$CollectAllTestClassesExecutor#processAllTestClasses
at line:99
    org.gradle.api.internal.tasks.testing.junitplatform.JUnitPlatformTestClassProcessor$CollectAllTestClassesExecutor#access$000
at line:79
    org.gradle.api.internal.tasks.testing.junitplatform.JUnitPlatformTestClassProcessor#stop
at line:75
    org.gradle.api.internal.tasks.testing.SuiteTestClassProcessor#stop at line:61
    sun.reflect.NativeMethodAccessorImpl#invoke0
    sun.reflect.NativeMethodAccessorImpl#invoke at line:62
    sun.reflect.DelegatingMethodAccessorImpl#invoke at line:43
    java.lang.reflect.Method#invoke at line:498
    org.gradle.internal.dispatch.ReflectionDispatch#dispatch at line:36
    org.gradle.internal.dispatch.ReflectionDispatch#dispatch at line:24
    org.gradle.internal.dispatch.ContextClassLoaderDispatch#dispatch at line:33
    org.gradle.internal.dispatch.ProxyDispatchAdapter$DispatchingInvocationHandler#invoke
at line:94
    com.sun.proxy.$Proxy2#stop
    org.gradle.api.internal.tasks.testing.worker.TestWorker#stop at line:133
    sun.reflect.NativeMethodAccessorImpl#invoke0
    sun.reflect.NativeMethodAccessorImpl#invoke at line:62
    sun.reflect.DelegatingMethodAccessorImpl#invoke at line:43
    java.lang.reflect.Method#invoke at line:498
    org.gradle.internal.dispatch.ReflectionDispatch#dispatch at line:36
    org.gradle.internal.dispatch.ReflectionDispatch#dispatch at line:24
    org.gradle.internal.remote.internal.hub.MessageHubBackedObjectConnection$DispatchWrapper#dispatch
at line:182
    org.gradle.internal.remote.internal.hub.MessageHubBackedObjectConnection$DispatchWrapper#dispatch
at line:164
    org.gradle.internal.remote.internal.hub.MessageHub$Handler#run at line:414
    org.gradle.internal.concurrent.ExecutorPolicy$CatchAndRecordFailures#onExecute at line:64
    org.gradle.internal.concurrent.ManagedExecutorImpl$1#run at line:48
    java.util.concurrent.ThreadPoolExecutor#runWorker at line:1149
    java.util.concurrent.ThreadPoolExecutor$Worker#run at line:624
    org.gradle.internal.concurrent.ThreadFactoryImpl$ManagedThreadRunnable#run at line:56
    java.lang.Thread#run at line:748

    Thread[main,5,main], stackTrace:sun.misc.Unsafe#park
    java.util.concurrent.locks.LockSupport#park at line:175
    java.util.concurrent.locks.AbstractQueuedSynchronizer#parkAndCheckInterrupt at line:836
    java.util.concurrent.locks.AbstractQueuedSynchronizer#doAcquireSharedInterruptibly at
line:997
    java.util.concurrent.locks.AbstractQueuedSynchronizer#acquireSharedInterruptibly at line:1304
    java.util.concurrent.CountDownLatch#await at line:231
    org.gradle.api.internal.tasks.testing.worker.TestWorker#execute at line:73
    org.gradle.api.internal.tasks.testing.worker.TestWorker#execute at line:47
    org.gradle.process.internal.worker.child.ActionExecutionWorker#execute at line:56
    org.gradle.process.internal.worker.child.SystemApplicationClassLoaderWorker#call at line:133
    org.gradle.process.internal.worker.child.SystemApplicationClassLoaderWorker#call at line:71
    worker.org.gradle.process.internal.worker.GradleWorkerMain#run at line:69
    worker.org.gradle.process.internal.worker.GradleWorkerMain#main at line:74

          1.4sec,    2 completed,   0 failed,   0 skipped, org.apache.jmeter.gui.util.JSyntaxTextAreaTest
          0.1sec,    1 completed,   0 failed,   0 skipped, org.apache.jmeter.gui.logging.TestGuiLogEventAppender
          0.2sec,    2 completed,   0 failed,   0 skipped, org.apache.jmeter.testbeans.gui.TestComboStringEditor
          0.1sec,    2 completed,   0 failed,   0 skipped, org.apache.jmeter.testbeans.gui.TestFieldStringEditor
          0.0sec,    2 completed,   0 failed,   0 skipped, org.apache.jmeter.testbeans.gui.TestBooleanPropertyEditor
          0.0sec,   11 completed,   0 failed,   0 skipped, org.apache.jmeter.save.TestCSVSaveService
          0.7sec,    1 completed,   0 failed,   0 skipped, org.apache.jmeter.resources.ResourceKeyUsageTest
          0.0sec,    7 completed,   0 failed,   0 skipped, org.apache.jmeter.samplers.TestSampleSaveConfiguration

> Task :src:components:spotbugsTest
47 SpotBugs violations were found. See the report at: file://<https://ci-builds.apache.org/job/JMeter/job/JMeter-trunk/ws/src/components/build/reports/spotbugs/test.xml>

org.gradle.api.GradleException: 47 SpotBugs violations were found. See the report at: file://<https://ci-builds.apache.org/job/JMeter/job/JMeter-trunk/ws/src/components/build/reports/spotbugs/test.xml>
	at com.github.spotbugs.snom.internal.SpotBugsRunnerForWorker$SpotBugsExecutor.execute(SpotBugsRunnerForWorker.java:115)
	at org.gradle.workers.internal.DefaultWorkerServer.execute(DefaultWorkerServer.java:63)
	at org.gradle.workers.internal.AbstractClassLoaderWorker$1.create(AbstractClassLoaderWorker.java:49)
	at org.gradle.workers.internal.AbstractClassLoaderWorker$1.create(AbstractClassLoaderWorker.java:43)
	at org.gradle.internal.classloader.ClassLoaderUtils.executeInClassloader(ClassLoaderUtils.java:97)
	at org.gradle.workers.internal.AbstractClassLoaderWorker.executeInClassLoader(AbstractClassLoaderWorker.java:43)
	at org.gradle.workers.internal.IsolatedClassloaderWorker.run(IsolatedClassloaderWorker.java:49)
	at org.gradle.workers.internal.IsolatedClassloaderWorker.run(IsolatedClassloaderWorker.java:30)
	at org.gradle.workers.internal.WorkerDaemonServer.run(WorkerDaemonServer.java:85)
	at org.gradle.workers.internal.WorkerDaemonServer.run(WorkerDaemonServer.java:55)
	at org.gradle.process.internal.worker.request.WorkerAction$1.call(WorkerAction.java:138)
	at org.gradle.process.internal.worker.child.WorkerLogEventListener.withWorkerLoggingProtocol(WorkerLogEventListener.java:41)
	at org.gradle.process.internal.worker.request.WorkerAction.run(WorkerAction.java:135)
	at sun.reflect.NativeMethodAccessorImpl.invoke0(Native Method)
	at sun.reflect.NativeMethodAccessorImpl.invoke(NativeMethodAccessorImpl.java:62)
	at sun.reflect.DelegatingMethodAccessorImpl.invoke(DelegatingMethodAccessorImpl.java:43)
	at java.lang.reflect.Method.invoke(Method.java:498)
	at org.gradle.internal.dispatch.ReflectionDispatch.dispatch(ReflectionDispatch.java:36)
	at org.gradle.internal.dispatch.ReflectionDispatch.dispatch(ReflectionDispatch.java:24)
	at org.gradle.internal.remote.internal.hub.MessageHubBackedObjectConnection$DispatchWrapper.dispatch(MessageHubBackedObjectConnection.java:182)
	at org.gradle.internal.remote.internal.hub.MessageHubBackedObjectConnection$DispatchWrapper.dispatch(MessageHubBackedObjectConnection.java:164)
	at org.gradle.internal.remote.internal.hub.MessageHub$Handler.run(MessageHub.java:414)
	at org.gradle.internal.concurrent.ExecutorPolicy$CatchAndRecordFailures.onExecute(ExecutorPolicy.java:64)
	at org.gradle.internal.concurrent.ManagedExecutorImpl$1.run(ManagedExecutorImpl.java:48)
	at java.util.concurrent.ThreadPoolExecutor.runWorker(ThreadPoolExecutor.java:1149)
	at java.util.concurrent.ThreadPoolExecutor$Worker.run(ThreadPoolExecutor.java:624)
	at org.gradle.internal.concurrent.ThreadFactoryImpl$ManagedThreadRunnable.run(ThreadFactoryImpl.java:56)
	at java.lang.Thread.run(Thread.java:748)

> Task :src:components:test
          2.3sec,    7 completed,   0 failed,   0 skipped, org.apache.jmeter.gui.action.template.TestTemplateManager
          0.0sec,    1 completed,   0 failed,   0 skipped, org.apache.jmeter.gui.action.TestSave
          0.3sec,    1 completed,   0 failed,   0 skipped, org.apache.jmeter.resources.ResourceKeyUsageTestComponents
          0.0sec,    5 completed,   0 failed,   0 skipped, org.apache.jmeter.reporters.TestResultSaver
          0.6sec,    4 completed,   0 failed,   0 skipped, org.apache.jmeter.timers.SyncTimerTest
          0.3sec,    6 completed,   0 failed,   0 skipped, org.apache.jmeter.timers.poissonarrivals.PreciseThroughputTimerTest
          1.5sec,    9 completed,   0 failed,   0 skipped, org.apache.jmeter.timers.ConstantThroughputTimerTest
          0.0sec,    4 completed,   0 failed,   0 skipped, org.apache.jmeter.timers.TimerServiceTest
          0.1sec,   14 completed,   0 failed,   0 skipped, org.apache.jmeter.extractor.TestHtmlExtractorJodd
          0.0sec,    4 completed,   0 failed,   0 skipped, org.apache.jmeter.extractor.TestBoundaryExtractor
          0.1sec,   14 completed,   0 failed,   0 skipped, org.apache.jmeter.extractor.TestHtmlExtractorJSoup
          0.3sec,    6 completed,   0 failed,   0 skipped, org.apache.jmeter.extractor.TestXPathExtractor
          0.6sec,    7 completed,   0 failed,   0 skipped, org.apache.jmeter.extractor.TestXPath2Extractor
          0.0sec,    9 completed,   0 failed,   0 skipped, org.apache.jmeter.extractor.TestJSONPostProcessor
          0.0sec,   25 completed,   0 failed,   0 skipped, org.apache.jmeter.extractor.TestRegexExtractor
          0.0sec,   25 completed,   0 failed,   0 skipped, org.apache.jmeter.assertions.TestJSONPathAssertion
          0.2sec,   10 completed,   0 failed,   0 skipped, org.apache.jmeter.assertions.ResponseAssertionTest
          0.1sec,   14 completed,   0 failed,   0 skipped, org.apache.jmeter.assertions.XPath2AssertionTest
          0.0sec,    4 completed,   0 failed,   0 skipped, org.apache.jmeter.assertions.XmlAssertionTest
          0.0sec,    4 completed,   0 failed,   0 skipped, org.apache.jmeter.assertions.DurationAssertionTest
          0.2sec,   29 completed,   0 failed,   0 skipped, org.apache.jmeter.assertions.XPathAssertionTest
          0.9sec,    6 completed,   0 failed,   0 skipped, org.apache.jmeter.assertions.SMIMEAssertionTest
          0.5sec,    7 completed,   0 failed,   0 skipped, org.apache.jmeter.assertions.gui.TestJSONPathAssertionGui
          0.2sec,    9 completed,   0 failed,   0 skipped, org.apache.jmeter.assertions.XMLSchemaAssertionTest

> Task :src:core:test
          3.8sec,   18 completed,   0 failed,   0 skipped, org.apache.jmeter.samplers.TestSampleResult

org.apache.jmeter.resources.PackageTest > checkI18n fr: messages STANDARD_OUT
    Ignoring missing junit_failure_default_code=0001 in org/apache/jmeter/resources/messages_fr.properties
    Ignoring missing aggregate_report_90=90% in org/apache/jmeter/resources/messages_fr.properties
    Ignoring missing junit_error_default_code=9999 in org/apache/jmeter/resources/messages_fr.properties
    Ignoring missing junit_success_default_code=1000 in org/apache/jmeter/resources/messages_fr.properties
          0.1sec,   12 completed,   0 failed,   0 skipped, org.apache.jmeter.resources.PackageTest
          0.0sec,    4 completed,   0 failed,   0 skipped, org.apache.jmeter.samplers.TestDataStrippingSampleSender
          0.1sec,    3 completed,   0 failed,   0 skipped, org.apache.jmeter.util.keystore.JmeterKeyStoreSpec
          0.1sec,    4 completed,   0 failed,   0 skipped, org.apache.jmeter.report.processor.ListResultDataSpec
          0.1sec,    1 completed,   0 failed,   0 skipped, org.apache.jmeter.report.processor.ApdexSummaryConsumerSpec
          0.1sec,    2 completed,   0 failed,   0 skipped, org.apache.jmeter.report.processor.graph.impl.ResponseTimePercentilesOverTimeGraphConsumerSpec
          0.3sec,    4 completed,   0 failed,   0 skipped, org.apache.jmeter.report.processor.Top5ErrorsBySamplerConsumerSpec
          0.0sec,    3 completed,   0 failed,   0 skipped, org.apache.jmeter.report.processor.FieldSampleComparatorSpec
          0.0sec,    5 completed,   0 failed,   0 skipped, org.apache.jmeter.report.processor.Top5ErrorsSummaryDataSpec
          0.0sec,    6 completed,   0 failed,   0 skipped, org.apache.jmeter.report.core.SampleMetadataParserSpec
          0.0sec,   14 completed,   0 failed,   0 skipped, org.apache.jmeter.report.core.ConvertersSpec
          0.1sec,   23 completed,   0 failed,   0 skipped, org.apache.jmeter.services.FileServerSpec
          0.0sec,    4 completed,   0 failed,   0 skipped, org.apache.jmeter.engine.util.FunctionParserSpec
          0.8sec,    1 completed,   0 failed,   0 skipped, org.apache.jmeter.gui.HtmlReportGUISpec
         29.5sec,  264 completed,   0 failed,   0 skipped, Gradle Test Run :src:core:test

> Task :src:core:assemble
> Task :src:core:spotbugsMain

> Task :src:components:test FAILED
          0.0sec,    6 completed,   0 failed,   0 skipped, org.apache.jmeter.assertions.SizeAssertionTest
          0.1sec,    7 completed,   0 failed,   0 skipped, org.apache.jmeter.assertions.jmespath.gui.JMESPathAssertionGuiTest
          0.0sec,    9 completed,   0 failed,   0 skipped, org.apache.jmeter.visualizers.TestSampleCompareTo
          0.2sec,   10 completed,   0 failed,   0 skipped, org.apache.jmeter.extractor.json.jmespath.TestJMESPathExtractor$SourceVarOrResponse
          0.0sec,   10 completed,   0 failed,   0 skipped, org.apache.jmeter.extractor.json.jmespath.TestJMESPathExtractor$MatchNumberMoreThanZeroOn1ExtractedValue
          0.0sec,    6 completed,   0 failed,   0 skipped, org.apache.jmeter.extractor.json.jmespath.TestJMESPathExtractor$MultipleMatchesOnAllExtractedValues
          0.0sec,    6 completed,   0 failed,   0 skipped, org.apache.jmeter.extractor.json.jmespath.TestJMESPathExtractor$OneMatchOnAllExtractedValues
          0.2sec,   32 completed,   0 failed,   0 skipped, org.apache.jmeter.extractor.json.jmespath.TestJMESPathExtractor
          0.0sec,   27 completed,   0 failed,   0 skipped, org.apache.jmeter.assertions.jmespath.TestJMESPathAssertion$TestAssertion
          0.0sec,   27 completed,   0 failed,   0 skipped, org.apache.jmeter.assertions.jmespath.TestJMESPathAssertion
          0.1sec,    3 completed,   0 failed,   0 skipped, org.apache.jmeter.visualizers.backend.influxdb.InfluxdbBackendListenerClientSpec
          0.3sec,    7 completed,   0 failed,   0 skipped, org.apache.jmeter.visualizers.backend.graphite.PickleGraphiteMetricsSenderSpec
          0.0sec,    5 completed,   0 failed,   0 skipped, org.apache.jmeter.visualizers.backend.graphite.TextGraphiteMetricsSenderSpec
WARNING   0.0sec,    5 completed,   0 failed,   1 skipped, org.apache.jmeter.control.RunTimeSpec
          0.1sec,    4 completed,   0 failed,   0 skipped, org.apache.jmeter.control.RandomOrderControllerSpec
          0.0sec,    8 completed,   0 failed,   0 skipped, org.apache.jmeter.control.ThroughputControllerSpec
          0.0sec,    6 completed,   0 failed,   0 skipped, org.apache.jmeter.timers.UniformRandomTimerSpec
          0.1sec,   43 completed,   0 failed,   0 skipped, org.apache.jmeter.extractor.BoundaryExtractorSpec
          0.3sec,   11 completed,   0 failed,   0 skipped, org.apache.jmeter.extractor.json.render.RenderAsJmesPathRendererSpec
          0.1sec,   11 completed,   0 failed,   0 skipped, org.apache.jmeter.extractor.json.render.RenderAsJsonRendererSpec
          0.0sec,    4 completed,   0 failed,   0 skipped, org.apache.jmeter.extractor.JoddExtractorSpec
          0.1sec,    7 completed,   0 failed,   0 skipped, org.apache.jmeter.assertions.CompareAssertionSpec
          0.2sec,    5 completed,   0 failed,   0 skipped, org.apache.jmeter.assertions.gui.AssertionGuiSpec
          0.1sec,    7 completed,   0 failed,   0 skipped, org.apache.jmeter.assertions.MD5HexAssertionSpec
FAILURE  34.1sec,  503 completed,   1 failed,   2 skipped,
Gradle Test Run :src:components:test

503 tests completed, 1 failed, 2 skipped

> Task :src:core:spotbugsMain
46 SpotBugs violations were found. See the report at: file://<https://ci-builds.apache.org/job/JMeter/job/JMeter-trunk/ws/src/core/build/reports/spotbugs/main.xml>

org.gradle.api.GradleException: 46 SpotBugs violations were found. See the report at: file://<https://ci-builds.apache.org/job/JMeter/job/JMeter-trunk/ws/src/core/build/reports/spotbugs/main.xml>
	at com.github.spotbugs.snom.internal.SpotBugsRunnerForWorker$SpotBugsExecutor.execute(SpotBugsRunnerForWorker.java:115)
	at org.gradle.workers.internal.DefaultWorkerServer.execute(DefaultWorkerServer.java:63)
	at org.gradle.workers.internal.AbstractClassLoaderWorker$1.create(AbstractClassLoaderWorker.java:49)
	at org.gradle.workers.internal.AbstractClassLoaderWorker$1.create(AbstractClassLoaderWorker.java:43)
	at org.gradle.internal.classloader.ClassLoaderUtils.executeInClassloader(ClassLoaderUtils.java:97)
	at org.gradle.workers.internal.AbstractClassLoaderWorker.executeInClassLoader(AbstractClassLoaderWorker.java:43)
	at org.gradle.workers.internal.IsolatedClassloaderWorker.run(IsolatedClassloaderWorker.java:49)
	at org.gradle.workers.internal.IsolatedClassloaderWorker.run(IsolatedClassloaderWorker.java:30)
	at org.gradle.workers.internal.WorkerDaemonServer.run(WorkerDaemonServer.java:85)
	at org.gradle.workers.internal.WorkerDaemonServer.run(WorkerDaemonServer.java:55)
	at org.gradle.process.internal.worker.request.WorkerAction$1.call(WorkerAction.java:138)
	at org.gradle.process.internal.worker.child.WorkerLogEventListener.withWorkerLoggingProtocol(WorkerLogEventListener.java:41)
	at org.gradle.process.internal.worker.request.WorkerAction.run(WorkerAction.java:135)
	at sun.reflect.NativeMethodAccessorImpl.invoke0(Native Method)
	at sun.reflect.NativeMethodAccessorImpl.invoke(NativeMethodAccessorImpl.java:62)
	at sun.reflect.DelegatingMethodAccessorImpl.invoke(DelegatingMethodAccessorImpl.java:43)
	at java.lang.reflect.Method.invoke(Method.java:498)
	at org.gradle.internal.dispatch.ReflectionDispatch.dispatch(ReflectionDispatch.java:36)
	at org.gradle.internal.dispatch.ReflectionDispatch.dispatch(ReflectionDispatch.java:24)
	at org.gradle.internal.remote.internal.hub.MessageHubBackedObjectConnection$DispatchWrapper.dispatch(MessageHubBackedObjectConnection.java:182)
	at org.gradle.internal.remote.internal.hub.MessageHubBackedObjectConnection$DispatchWrapper.dispatch(MessageHubBackedObjectConnection.java:164)
	at org.gradle.internal.remote.internal.hub.MessageHub$Handler.run(MessageHub.java:414)
	at org.gradle.internal.concurrent.ExecutorPolicy$CatchAndRecordFailures.onExecute(ExecutorPolicy.java:64)
	at org.gradle.internal.concurrent.ManagedExecutorImpl$1.run(ManagedExecutorImpl.java:48)
	at java.util.concurrent.ThreadPoolExecutor.runWorker(ThreadPoolExecutor.java:1149)
	at java.util.concurrent.ThreadPoolExecutor$Worker.run(ThreadPoolExecutor.java:624)
	at org.gradle.internal.concurrent.ThreadFactoryImpl$ManagedThreadRunnable.run(ThreadFactoryImpl.java:56)
	at java.lang.Thread.run(Thread.java:748)

> Task :src:dist:javadocAggregate
9 warnings
checksum-dependency elapsed time: 71056ms, configurations processed: 359
    SHA-512 computation time: 1340ms (goes in parallel, it might exceed wall-clock time),
files processed: 33, processed: 8MiB, skipped: 3133MiB
    PGP signature resolution time: 11995ms (wall-clock), resolution requests: 213, signatures
resolved: 265
    PGP key resolution time: 37347ms (wall-clock), resolution requests: 213, download time:
46466ms (goes in parallel, it might exceed wall-clock time), keys downloaded: 104
        PGP signature verification time: 46124ms (goes in parallel, it might exceed wall-clock
time), files processed: 704, processed: 760MiB, skipped: 2357MiB

FAILURE: Build failed with an exception.

* What went wrong:
Execution failed for task ':src:components:test'.
> There were failing tests. See the report at: file://<https://ci-builds.apache.org/job/JMeter/job/JMeter-trunk/ws/src/components/build/reports/tests/test/index.html>

* Try:
Run with --stacktrace option to get the stack trace. Run with --info or --debug option to
get more log output. Run with --scan to get full insights.

* Get more help at https://help.gradle.org

Deprecated Gradle features were used in this build, making it incompatible with Gradle 7.0.
Use '--warning-mode all' to show the individual deprecation warnings.
See https://docs.gradle.org/6.6/userguide/command_line_interface.html#sec:command_line_warnings

BUILD FAILED in 4m 7s
313 actionable tasks: 276 executed, 7 from cache, 30 up-to-date

See the profiling report at: file://<https://ci-builds.apache.org/job/JMeter/job/JMeter-trunk/ws/build/reports/profile/profile-2020-09-09-16-09-43.html>
A fine-grained performance profile is available: use the --scan option.
Build step 'Invoke Gradle script' changed build result to FAILURE
Build step 'Invoke Gradle script' marked build as failure
Xvfb stopping
Archiving artifacts
[Fast Archiver] Compressed 33.21 MB of artifacts by 51.3% relative to #80
Recording test results

Mime
View raw message