jmeter-dev mailing list archives

Site index · List index
Message view « Date » · « Thread »
Top « Date » · « Thread »
From Apache Jenkins Server <jenk...@builds.apache.org>
Subject Build failed in Jenkins: JMeter » JMeter Ubuntu #54
Date Wed, 30 Sep 2020 19:46:19 GMT
See <https://ci-builds.apache.org/job/JMeter/job/JMeter%20Ubuntu/54/display/redirect?page=changes>

Changes:

[Philippe Mouawad] Update darklaf to 2.4.10 from 2.4.8


------------------------------------------
[...truncated 152.84 KB...]
    java.awt.headless=true
    os.name=Linux
    os.version=4.15.0-76-generic
    os.arch=amd64

> Task :src:protocol:bolt:test
          2.2sec,    4 completed,   0 failed,   0 skipped, org.apache.jmeter.protocol.bolt.sampler.BoltSamplerSpec
          6.2sec,    5 completed,   0 failed,   0 skipped, Gradle Test Run :src:protocol:bolt:test

> Task :src:components:compileTestGroovy

> Task :src:core:test
          0.1sec,    3 completed,   0 failed,   0 skipped, org.apache.jmeter.threads.TestJMeterThread
          0.0sec,   17 completed,   0 failed,   0 skipped, org.apache.jmeter.threads.TestUnmodifiableJMeterVariables
          0.0sec,    1 completed,   0 failed,   0 skipped, org.apache.jmeter.threads.TestJMeterContextService
          0.0sec,    1 completed,   0 failed,   0 skipped, org.apache.jmeter.threads.TestTestCompiler
          0.2sec,    2 completed,   0 failed,   0 skipped, org.apache.jmeter.testbeans.gui.TestFieldStringEditor
          0.0sec,    2 completed,   0 failed,   0 skipped, org.apache.jmeter.testbeans.gui.TestBooleanPropertyEditor
          0.0sec,    2 completed,   0 failed,   0 skipped, org.apache.jmeter.testbeans.gui.TestComboStringEditor
          0.1sec,   11 completed,   0 failed,   0 skipped, org.apache.jmeter.save.TestCSVSaveService
          0.3sec,    1 completed,   0 failed,   0 skipped, org.apache.jmeter.resources.ResourceKeyUsageTest
          0.0sec,    1 completed,   0 failed,   0 skipped, org.apache.jmeter.gui.logging.TestGuiLogEventAppender
          3.2sec, org.apache.jmeter.gui.util.JSyntaxTextAreaTest >
testSetLanguage()
          3.2sec,    2 completed,   0 failed,   0 skipped, org.apache.jmeter.gui.util.JSyntaxTextAreaTest
          0.0sec,    1 completed,   0 failed,   0 skipped, org.apache.jmeter.util.PackageTest
          0.0sec,    3 completed,   0 failed,   0 skipped, org.apache.jmeter.util.TestJMeterUtils
          0.5sec,    2 completed,   0 failed,   0 skipped, org.apache.jmeter.util.JSR223TestElementTest
          0.9sec,   11 completed,   0 failed,   0 skipped, org.apache.jmeter.util.XPathUtilTest
          0.0sec,    5 completed,   0 failed,   0 skipped, org.apache.jmeter.util.StringUtilitiesTest
          3.9sec,   18 completed,   0 failed,   0 skipped, org.apache.jmeter.samplers.TestSampleResult
          0.0sec,    7 completed,   0 failed,   0 skipped, org.apache.jmeter.samplers.TestSampleSaveConfiguration
          0.0sec,    2 completed,   0 failed,   0 skipped, org.apache.jmeter.testelement.PackageTest
          0.0sec,   11 completed,   0 failed,   0 skipped, org.apache.jmeter.testelement.property.PackageTest
          0.0sec,    2 completed,   0 failed,   0 skipped, org.apache.jmeter.testelement.property.MapPropertyTest
          0.0sec,    6 completed,   0 failed,   0 skipped, org.apache.jmeter.testelement.property.AbstractPropertyTest
          0.0sec,    5 completed,   0 failed,   0 skipped, org.apache.jmeter.testelement.TestNumberProperty
          0.0sec,    1 completed,   0 failed,   0 skipped, org.apache.jmeter.report.core.SampleMetadataTest
          0.2sec,    5 completed,   0 failed,   0 skipped, org.apache.jmeter.report.core.TestCsvSampleWriter
          0.0sec,    6 completed,   0 failed,   0 skipped, org.apache.jmeter.report.core.CsvSampleReaderTest
          0.0sec,    2 completed,   0 failed,   0 skipped, org.apache.jmeter.report.processor.ErrorsSummaryConsumerTest
          0.0sec,    6 completed,   0 failed,   0 skipped, org.apache.jmeter.report.processor.graph.impl.CustomGraphConsumerTest
          0.0sec,    7 completed,   0 failed,   0 skipped, org.apache.jmeter.report.dashboard.ApdexPerTransactionTest
          0.0sec,    5 completed,   0 failed,   0 skipped, org.apache.jmeter.listeners.TestResultAction

org.apache.jmeter.engine.LocalHostTest > testLocalHost() STANDARD_ERROR
    java.rmi.server.hostname=null
    asf939.gq1.ygridcore.net/67.195.81.174
    isSiteLocalAddress:false
    isAnyLocalAddress:false
    isLinkLocalAddress:false
    isLoopbackAddress:false
    isMulticastAddress:false
    localhost/127.0.0.1
    isSiteLocalAddress:false
    isAnyLocalAddress:false
    isLinkLocalAddress:false
    isLoopbackAddress:true
    isMulticastAddress:false
    ====================
    asf939.gq1.ygridcore.net/67.195.81.174
    isSiteLocalAddress:false
    isAnyLocalAddress:false
    isLinkLocalAddress:false
    isLoopbackAddress:false
    isMulticastAddress:false

org.apache.jmeter.engine.LocalHostTest > testInterfaces() STANDARD_ERROR
    Interfaces: {name:docker0 (docker0) => [/fe80:0:0:0:42:25ff:fe95:c066%docker0/64 [null],
/172.17.0.1/16 [/172.17.255.255]], name:eno1 (eno1) => [/fe80:0:0:0:f292:1cff:fe12:59e8%eno1/64
[null], /67.195.81.174/26 [/67.195.81.191]], name:lo (lo) => [/0:0:0:0:0:0:0:1%lo/128 [null],
/127.0.0.1/8 [null]]}
    Choose 172.17.0.1 to talk to external services
    java.rmi.server.hostname=null
          0.0sec,    2 completed,   0 failed,   0 skipped, org.apache.jmeter.engine.LocalHostTest
          0.0sec,    4 completed,   0 failed,   0 skipped, org.apache.jmeter.engine.DistributedRunnerTest
          0.0sec,    1 completed,   0 failed,   0 skipped, org.apache.jmeter.engine.TestTreeCloner
          0.5sec,   10 completed,   0 failed,   0 skipped, org.apache.jmeter.engine.util.TestValueReplacer

org.apache.jmeter.JMeterTest > testSuccessWhenJmxExists() STANDARD_OUT
    Created the tree successfully using /tmp/testPlan5631272191414223956.jmx
    Starting standalone test @ Wed Sep 30 19:46:15 UTC 2020 (1601495175730)

org.apache.jmeter.JMeterTest STANDARD_OUT
    Waiting for possible Shutdown/StopTestNow/HeapDump/ThreadDump message on port 4445

org.apache.jmeter.JMeterTest > testFailureWithMissingPlugin() STANDARD_OUT
    Tidying up ...    @ Wed Sep 30 19:46:15 UTC 2020 (1601495175972)
    ... end of run
    Error in NonGUIDriver java.lang.IllegalArgumentException: Problem loading XML from:'/tmp/testPlan7862151548757577318.jmx'.

    Cause:
    CannotResolveClassException: kg.apc.jmeter.samplers.DummySampler

     Detail:com.thoughtworks.xstream.converters.ConversionException: 
    ---- Debugging information ----
    cause-exception     : com.thoughtworks.xstream.converters.ConversionException
    cause-message       : 
    first-jmeter-class  : org.apache.jmeter.save.converters.HashTreeConverter.unmarshal(HashTreeConverter.java:66)
    class               : org.apache.jmeter.save.ScriptWrapper
    required-type       : org.apache.jmeter.save.ScriptWrapper
    converter-type      : org.apache.jmeter.save.ScriptWrapperConverter
    path                : /jmeterTestPlan/hashTree/hashTree/hashTree/kg.apc.jmeter.samplers.DummySampler
    line number         : 16
    version             : not available
    -------------------------------
          0.3sec,    3 completed,   0 failed,   0 skipped, org.apache.jmeter.JMeterTest
          0.0sec,    4 completed,   0 failed,   0 skipped, org.apache.jorphan.TestXMLBuffer
          0.0sec,    6 completed,   0 failed,   0 skipped, org.apache.jorphan.reflect.TestFunctor

org.apache.jmeter.resources.PackageTest > checkI18n fr: messages STANDARD_OUT
    Ignoring missing junit_failure_default_code=0001 in org/apache/jmeter/resources/messages_fr.properties
    Ignoring missing aggregate_report_90=90% in org/apache/jmeter/resources/messages_fr.properties
    Ignoring missing junit_error_default_code=9999 in org/apache/jmeter/resources/messages_fr.properties
    Ignoring missing junit_success_default_code=1000 in org/apache/jmeter/resources/messages_fr.properties
          0.1sec,   12 completed,   0 failed,   0 skipped, org.apache.jmeter.resources.PackageTest
          0.0sec,    4 completed,   0 failed,   0 skipped, org.apache.jmeter.samplers.TestDataStrippingSampleSender
WARNING   0.0sec,    1 completed,   0 failed,   1 skipped, org.apache.jmeter.gui.HtmlReportGUISpec
          0.1sec,    3 completed,   0 failed,   0 skipped, org.apache.jmeter.util.keystore.JmeterKeyStoreSpec
          0.1sec,   14 completed,   0 failed,   0 skipped, org.apache.jmeter.report.core.ConvertersSpec
          0.0sec,    6 completed,   0 failed,   0 skipped, org.apache.jmeter.report.core.SampleMetadataParserSpec
          0.3sec,    4 completed,   0 failed,   0 skipped, org.apache.jmeter.report.processor.Top5ErrorsBySamplerConsumerSpec
          0.0sec,    5 completed,   0 failed,   0 skipped, org.apache.jmeter.report.processor.Top5ErrorsSummaryDataSpec
          0.0sec,    3 completed,   0 failed,   0 skipped, org.apache.jmeter.report.processor.FieldSampleComparatorSpec
          0.0sec,    4 completed,   0 failed,   0 skipped, org.apache.jmeter.report.processor.ListResultDataSpec
          0.1sec,    2 completed,   0 failed,   0 skipped, org.apache.jmeter.report.processor.graph.impl.ResponseTimePercentilesOverTimeGraphConsumerSpec
          0.0sec,    1 completed,   0 failed,   0 skipped, org.apache.jmeter.report.processor.ApdexSummaryConsumerSpec
          0.1sec,   23 completed,   0 failed,   0 skipped, org.apache.jmeter.services.FileServerSpec
          0.0sec,    4 completed,   0 failed,   0 skipped, org.apache.jmeter.engine.util.FunctionParserSpec
WARNING  18.2sec,  264 completed,   0 failed,   1 skipped, Gradle
Test Run :src:core:test
checksum-dependency elapsed time: 93801ms, configurations processed: 247
    SHA-512 computation time: 11629ms (goes in parallel, it might exceed wall-clock time),
files processed: 37, processed: 12MiB, skipped: 2709MiB
    PGP signature resolution time: 11102ms (wall-clock), resolution requests: 146, signatures
resolved: 248
    PGP key resolution time: 62427ms (wall-clock), resolution requests: 146, download time:
0ms (goes in parallel, it might exceed wall-clock time), keys downloaded: 0
        PGP signature verification time: 107337ms (goes in parallel, it might exceed wall-clock
time), files processed: 824, processed: 846MiB, skipped: 1852MiB

Build jmeter FAILURE reason:                                
    Execution failed for task ':src:dist:verifyReleaseDependencies':
        External dependencies differ (you could update src/dist/src/dist/expected_release_jars.csv
if you add -PupdateExpectedJars):
          55489873 => 55496539 bytes (+6666 bytes)
        
        + 1447270 darklaf-core-2.4.10.jar
        - 1440723 darklaf-core-2.4.8.jar
        +   32009 darklaf-macos-2.4.10.jar
        -   32010 darklaf-macos-2.4.8.jar
        +    6277 darklaf-native-utils-2.4.10.jar
        -    6277 darklaf-native-utils-2.4.8.jar
        +    3245 darklaf-platform-base-2.4.10.jar
        -    3246 darklaf-platform-base-2.4.8.jar
        +   62676 darklaf-property-loader-2.4.10.jar
        -   62676 darklaf-property-loader-2.4.8.jar
        +   83381 darklaf-theme-2.4.10.jar
        -   83382 darklaf-theme-2.4.8.jar
        +   44186 darklaf-utils-2.4.10.jar
        -   43966 darklaf-utils-2.4.8.jar
        +  335848 darklaf-windows-2.4.10.jar
        -  335946 darklaf-windows-2.4.8.jar
            at Build_gradle$verifyReleaseDependencies$2$1.execute(build.gradle.kts:228)
            at Build_gradle$verifyReleaseDependencies$2$1.execute(build.gradle.kts:24)
            at org.gradle.api.internal.AbstractTask$TaskActionWrapper.execute(AbstractTask.java:731)
            at org.gradle.api.internal.AbstractTask$TaskActionWrapper.execute(AbstractTask.java:704)
            at org.gradle.api.internal.tasks.execution.ExecuteActionsTaskExecuter$3.run(ExecuteActionsTaskExecuter.java:570)
            at org.gradle.internal.operations.DefaultBuildOperationExecutor$RunnableBuildOperationWorker.execute(DefaultBuildOperationExecutor.java:395)
            at org.gradle.internal.operations.DefaultBuildOperationExecutor$RunnableBuildOperationWorker.execute(DefaultBuildOperationExecutor.java:387)
            at org.gradle.internal.operations.DefaultBuildOperationExecutor$1.execute(DefaultBuildOperationExecutor.java:157)
            at org.gradle.internal.operations.DefaultBuildOperationExecutor.execute(DefaultBuildOperationExecutor.java:242)
            at org.gradle.internal.operations.DefaultBuildOperationExecutor.execute(DefaultBuildOperationExecutor.java:150)
            at org.gradle.internal.operations.DefaultBuildOperationExecutor.run(DefaultBuildOperationExecutor.java:84)
            at org.gradle.internal.operations.DelegatingBuildOperationExecutor.run(DelegatingBuildOperationExecutor.java:31)
            at org.gradle.api.internal.tasks.execution.ExecuteActionsTaskExecuter.executeAction(ExecuteActionsTaskExecuter.java:555)
            at org.gradle.api.internal.tasks.execution.ExecuteActionsTaskExecuter.executeActions(ExecuteActionsTaskExecuter.java:538)
            at org.gradle.api.internal.tasks.execution.ExecuteActionsTaskExecuter.access$300(ExecuteActionsTaskExecuter.java:109)
            at org.gradle.api.internal.tasks.execution.ExecuteActionsTaskExecuter$TaskExecution.executeWithPreviousOutputFiles(ExecuteActionsTaskExecuter.java:279)
            at org.gradle.api.internal.tasks.execution.ExecuteActionsTaskExecuter$TaskExecution.execute(ExecuteActionsTaskExecuter.java:268)
            at org.gradle.internal.execution.steps.ExecuteStep.lambda$execute$1(ExecuteStep.java:33)
            at org.gradle.internal.execution.steps.ExecuteStep.execute(ExecuteStep.java:33)
            at org.gradle.internal.execution.steps.ExecuteStep.execute(ExecuteStep.java:26)
            at org.gradle.internal.execution.steps.CleanupOutputsStep.execute(CleanupOutputsStep.java:67)
            at org.gradle.internal.execution.steps.CleanupOutputsStep.execute(CleanupOutputsStep.java:36)
            at org.gradle.internal.execution.steps.ResolveInputChangesStep.execute(ResolveInputChangesStep.java:49)
            at org.gradle.internal.execution.steps.ResolveInputChangesStep.execute(ResolveInputChangesStep.java:34)
            at org.gradle.internal.execution.steps.CancelExecutionStep.execute(CancelExecutionStep.java:43)
            at org.gradle.internal.execution.steps.TimeoutStep.executeWithoutTimeout(TimeoutStep.java:73)
            at org.gradle.internal.execution.steps.TimeoutStep.execute(TimeoutStep.java:54)
            at org.gradle.internal.execution.steps.CatchExceptionStep.execute(CatchExceptionStep.java:34)
            at org.gradle.internal.execution.steps.CreateOutputsStep.execute(CreateOutputsStep.java:44)
            at org.gradle.internal.execution.steps.SnapshotOutputsStep.execute(SnapshotOutputsStep.java:54)
            at org.gradle.internal.execution.steps.SnapshotOutputsStep.execute(SnapshotOutputsStep.java:38)
            at org.gradle.internal.execution.steps.BroadcastChangingOutputsStep.execute(BroadcastChangingOutputsStep.java:49)
            at org.gradle.internal.execution.steps.CacheStep.executeWithoutCache(CacheStep.java:159)
            at org.gradle.internal.execution.steps.CacheStep.execute(CacheStep.java:72)
            at org.gradle.internal.execution.steps.CacheStep.execute(CacheStep.java:43)
            at org.gradle.internal.execution.steps.StoreExecutionStateStep.execute(StoreExecutionStateStep.java:44)
            at org.gradle.internal.execution.steps.StoreExecutionStateStep.execute(StoreExecutionStateStep.java:33)
            at org.gradle.internal.execution.steps.RecordOutputsStep.execute(RecordOutputsStep.java:38)
            at org.gradle.internal.execution.steps.RecordOutputsStep.execute(RecordOutputsStep.java:24)
            at org.gradle.internal.execution.steps.SkipUpToDateStep.executeBecause(SkipUpToDateStep.java:92)
            at org.gradle.internal.execution.steps.SkipUpToDateStep.lambda$execute$0(SkipUpToDateStep.java:85)
            at org.gradle.internal.execution.steps.SkipUpToDateStep.execute(SkipUpToDateStep.java:55)
            at org.gradle.internal.execution.steps.SkipUpToDateStep.execute(SkipUpToDateStep.java:39)
            at org.gradle.internal.execution.steps.ResolveChangesStep.execute(ResolveChangesStep.java:76)
            at org.gradle.internal.execution.steps.ResolveChangesStep.execute(ResolveChangesStep.java:37)
            at org.gradle.internal.execution.steps.legacy.MarkSnapshottingInputsFinishedStep.execute(MarkSnapshottingInputsFinishedStep.java:36)
            at org.gradle.internal.execution.steps.legacy.MarkSnapshottingInputsFinishedStep.execute(MarkSnapshottingInputsFinishedStep.java:26)
            at org.gradle.internal.execution.steps.ResolveCachingStateStep.execute(ResolveCachingStateStep.java:94)
            at org.gradle.internal.execution.steps.ResolveCachingStateStep.execute(ResolveCachingStateStep.java:49)
            at org.gradle.internal.execution.steps.CaptureStateBeforeExecutionStep.execute(CaptureStateBeforeExecutionStep.java:79)
            at org.gradle.internal.execution.steps.CaptureStateBeforeExecutionStep.execute(CaptureStateBeforeExecutionStep.java:53)
            at org.gradle.internal.execution.steps.ValidateStep.execute(ValidateStep.java:74)
            at org.gradle.internal.execution.steps.SkipEmptyWorkStep.lambda$execute$2(SkipEmptyWorkStep.java:78)
            at org.gradle.internal.execution.steps.SkipEmptyWorkStep.execute(SkipEmptyWorkStep.java:78)
            at org.gradle.internal.execution.steps.SkipEmptyWorkStep.execute(SkipEmptyWorkStep.java:34)
            at org.gradle.internal.execution.steps.legacy.MarkSnapshottingInputsStartedStep.execute(MarkSnapshottingInputsStartedStep.java:39)
            at org.gradle.internal.execution.steps.LoadExecutionStateStep.execute(LoadExecutionStateStep.java:40)
            at org.gradle.internal.execution.steps.LoadExecutionStateStep.execute(LoadExecutionStateStep.java:28)


FAILURE: Build failed with an exception.

* What went wrong:
Execution failed for task ':src:dist:verifyReleaseDependencies'.
> External dependencies differ (you could update src/dist/src/dist/expected_release_jars.csv
if you add -PupdateExpectedJars):
    55489873 => 55496539 bytes (+6666 bytes)
  
  + 1447270 darklaf-core-2.4.10.jar
  - 1440723 darklaf-core-2.4.8.jar
  +   32009 darklaf-macos-2.4.10.jar
  -   32010 darklaf-macos-2.4.8.jar
  +    6277 darklaf-native-utils-2.4.10.jar
  -    6277 darklaf-native-utils-2.4.8.jar
  +    3245 darklaf-platform-base-2.4.10.jar
  -    3246 darklaf-platform-base-2.4.8.jar
  +   62676 darklaf-property-loader-2.4.10.jar
  -   62676 darklaf-property-loader-2.4.8.jar
  +   83381 darklaf-theme-2.4.10.jar
  -   83382 darklaf-theme-2.4.8.jar
  +   44186 darklaf-utils-2.4.10.jar
  -   43966 darklaf-utils-2.4.8.jar
  +  335848 darklaf-windows-2.4.10.jar
  -  335946 darklaf-windows-2.4.8.jar

* Try:
Run with --stacktrace option to get the stack trace. Run with --info or --debug option to
get more log output. Run with --scan to get full insights.

* Get more help at https://help.gradle.org

Deprecated Gradle features were used in this build, making it incompatible with Gradle 7.0.
Use '--warning-mode all' to show the individual deprecation warnings.
See https://docs.gradle.org/6.6/userguide/command_line_interface.html#sec:command_line_warnings

BUILD FAILED in 1m 34s
218 actionable tasks: 109 executed, 27 from cache, 82 up-to-date
Build step 'Invoke Gradle script' changed build result to FAILURE
Build step 'Invoke Gradle script' marked build as failure

Mime
View raw message