jmeter-dev mailing list archives

Site index · List index
Message view « Date » · « Thread »
Top « Date » · « Thread »
From Apache Jenkins Server <jenk...@builds.apache.org>
Subject Build failed in Jenkins: JMeter » JMeter-trunk #76
Date Tue, 01 Sep 2020 18:59:12 GMT
See <https://ci-builds.apache.org/job/JMeter/job/JMeter-trunk/76/display/redirect?page=changes>

Changes:

[Felix Schumacher] Add the debug info in the right assert method


------------------------------------------
[...truncated 296.08 KB...]
Created the tree successfully using <https://ci-builds.apache.org/job/JMeter/job/JMeter-trunk/ws/bin/testfiles/Bug56811.jmx>
Starting standalone test @ Tue Sep 01 18:58:15 UTC 2020 (1598986695676)
Waiting for possible Shutdown/StopTestNow/HeapDump/ThreadDump message on port 4445
summary =      9 in 00:00:01 =    7.4/s Avg:     6 Min:     2 Max:    14 Err:     3 (33.33%)
Tidying up ...    @ Tue Sep 01 18:58:18 UTC 2020 (1598986698672)
... end of run
No errors present in the logfile <https://ci-builds.apache.org/job/JMeter/job/JMeter-trunk/ws/bin/Bug56811.log>
(the file is empty)

> Task :src:protocol:http:test
          5.5sec, org.apache.jmeter.protocol.http.proxy.TestHttpRequestHdr
> testPostRequestEncodings()
          5.8sec, org.apache.jmeter.protocol.http.proxy.TestHttpRequestHdr
> testPostMultipartFormData()
          5.9sec, org.apache.jmeter.protocol.http.sampler.TestHTTPHC4Impl
> testNotifyFirstSampleAfterLoopRestartWhenThreadIterationIsANewUser()
          5.8sec, org.apache.jmeter.protocol.http.sampler.TestHTTPHC4Impl
> testNotifyFirstSampleAfterLoopRestartWhenThreadIterationIsSameUser()
          6.1sec,    2 completed,   0 failed,   0 skipped, org.apache.jmeter.protocol.http.sampler.TestHTTPHC4Impl
          5.7sec, org.apache.jmeter.protocol.http.proxy.TestHttpRequestHdr
> testEncodedArguments()
          5.2sec, org.apache.jmeter.protocol.http.proxy.TestHttpRequestHdr
> testEncodedArgumentsIPv6()
          4.0sec, org.apache.jmeter.protocol.http.control.TestCacheManagerHC4
> testNoCacheControlNoMaxAgeNoExpire()
          2.8sec,   18 completed,   0 failed,   0 skipped, org.apache.jmeter.protocol.http.modifier.TestAnchorModifier
          6.0sec, org.apache.jmeter.protocol.http.proxy.TestHttpRequestHdr
> testRepeatedArguments()
          6.3sec,   10 completed,   0 failed,   0 skipped, org.apache.jmeter.protocol.http.proxy.TestHttpRequestHdr
          4.0sec, org.apache.jmeter.protocol.http.control.TestCacheManagerHC4
> testPrivateCacheNoMaxAgeNoExpire()
FAILURE   6.3sec,   25 completed,   1 failed,   0 skipped, org.apache.jmeter.protocol.http.control.TestCacheManagerHC4
          0.1sec,   17 completed,   0 failed,   0 skipped, org.apache.jmeter.protocol.http.modifier.TestURLRewritingModifier
          0.0sec,    7 completed,   0 failed,   0 skipped, org.apache.jmeter.protocol.http.visualizers.RequestViewHTTPTest
          0.8sec,    7 completed,   0 failed,   0 skipped, org.apache.jmeter.protocol.http.proxy.TestProxyControl
          0.3sec,    1 completed,   0 failed,   0 skipped, org.apache.jmeter.protocol.http.sampler.PackageTest
          0.0sec,    2 completed,   0 failed,   0 skipped, org.apache.jmeter.protocol.http.sampler.PutWriterTest
          0.0sec,    2 completed,   0 failed,   0 skipped, org.apache.jmeter.protocol.http.sampler.TestHttpWebdav

> Task :src:dist-check:spotbugsTest
12 SpotBugs violations were found. See the report at: file://<https://ci-builds.apache.org/job/JMeter/job/JMeter-trunk/ws/src/dist-check/build/reports/spotbugs/test.xml>

org.gradle.api.GradleException: 12 SpotBugs violations were found. See the report at: file://<https://ci-builds.apache.org/job/JMeter/job/JMeter-trunk/ws/src/dist-check/build/reports/spotbugs/test.xml>
	at com.github.spotbugs.snom.internal.SpotBugsRunnerForWorker$SpotBugsExecutor.execute(SpotBugsRunnerForWorker.java:115)
	at org.gradle.workers.internal.DefaultWorkerServer.execute(DefaultWorkerServer.java:63)
	at org.gradle.workers.internal.AbstractClassLoaderWorker$1.create(AbstractClassLoaderWorker.java:49)
	at org.gradle.workers.internal.AbstractClassLoaderWorker$1.create(AbstractClassLoaderWorker.java:43)
	at org.gradle.internal.classloader.ClassLoaderUtils.executeInClassloader(ClassLoaderUtils.java:97)
	at org.gradle.workers.internal.AbstractClassLoaderWorker.executeInClassLoader(AbstractClassLoaderWorker.java:43)
	at org.gradle.workers.internal.IsolatedClassloaderWorker.run(IsolatedClassloaderWorker.java:49)
	at org.gradle.workers.internal.IsolatedClassloaderWorker.run(IsolatedClassloaderWorker.java:30)
	at org.gradle.workers.internal.WorkerDaemonServer.run(WorkerDaemonServer.java:85)
	at org.gradle.workers.internal.WorkerDaemonServer.run(WorkerDaemonServer.java:55)
	at org.gradle.process.internal.worker.request.WorkerAction$1.call(WorkerAction.java:138)
	at org.gradle.process.internal.worker.child.WorkerLogEventListener.withWorkerLoggingProtocol(WorkerLogEventListener.java:41)
	at org.gradle.process.internal.worker.request.WorkerAction.run(WorkerAction.java:135)
	at sun.reflect.NativeMethodAccessorImpl.invoke0(Native Method)
	at sun.reflect.NativeMethodAccessorImpl.invoke(NativeMethodAccessorImpl.java:62)
	at sun.reflect.DelegatingMethodAccessorImpl.invoke(DelegatingMethodAccessorImpl.java:43)
	at java.lang.reflect.Method.invoke(Method.java:498)
	at org.gradle.internal.dispatch.ReflectionDispatch.dispatch(ReflectionDispatch.java:36)
	at org.gradle.internal.dispatch.ReflectionDispatch.dispatch(ReflectionDispatch.java:24)
	at org.gradle.internal.remote.internal.hub.MessageHubBackedObjectConnection$DispatchWrapper.dispatch(MessageHubBackedObjectConnection.java:182)
	at org.gradle.internal.remote.internal.hub.MessageHubBackedObjectConnection$DispatchWrapper.dispatch(MessageHubBackedObjectConnection.java:164)
	at org.gradle.internal.remote.internal.hub.MessageHub$Handler.run(MessageHub.java:414)
	at org.gradle.internal.concurrent.ExecutorPolicy$CatchAndRecordFailures.onExecute(ExecutorPolicy.java:64)
	at org.gradle.internal.concurrent.ManagedExecutorImpl$1.run(ManagedExecutorImpl.java:48)
	at java.util.concurrent.ThreadPoolExecutor.runWorker(ThreadPoolExecutor.java:1149)
	at java.util.concurrent.ThreadPoolExecutor$Worker.run(ThreadPoolExecutor.java:624)
	at org.gradle.internal.concurrent.ThreadFactoryImpl$ManagedThreadRunnable.run(ThreadFactoryImpl.java:56)
	at java.lang.Thread.run(Thread.java:748)

> Task :src:core:spotbugsMain
46 SpotBugs violations were found. See the report at: file://<https://ci-builds.apache.org/job/JMeter/job/JMeter-trunk/ws/src/core/build/reports/spotbugs/main.xml>

org.gradle.api.GradleException: 46 SpotBugs violations were found. See the report at: file://<https://ci-builds.apache.org/job/JMeter/job/JMeter-trunk/ws/src/core/build/reports/spotbugs/main.xml>
	at com.github.spotbugs.snom.internal.SpotBugsRunnerForWorker$SpotBugsExecutor.execute(SpotBugsRunnerForWorker.java:115)
	at org.gradle.workers.internal.DefaultWorkerServer.execute(DefaultWorkerServer.java:63)
	at org.gradle.workers.internal.AbstractClassLoaderWorker$1.create(AbstractClassLoaderWorker.java:49)
	at org.gradle.workers.internal.AbstractClassLoaderWorker$1.create(AbstractClassLoaderWorker.java:43)
	at org.gradle.internal.classloader.ClassLoaderUtils.executeInClassloader(ClassLoaderUtils.java:97)
	at org.gradle.workers.internal.AbstractClassLoaderWorker.executeInClassLoader(AbstractClassLoaderWorker.java:43)
	at org.gradle.workers.internal.IsolatedClassloaderWorker.run(IsolatedClassloaderWorker.java:49)
	at org.gradle.workers.internal.IsolatedClassloaderWorker.run(IsolatedClassloaderWorker.java:30)
	at org.gradle.workers.internal.WorkerDaemonServer.run(WorkerDaemonServer.java:85)
	at org.gradle.workers.internal.WorkerDaemonServer.run(WorkerDaemonServer.java:55)
	at org.gradle.process.internal.worker.request.WorkerAction$1.call(WorkerAction.java:138)
	at org.gradle.process.internal.worker.child.WorkerLogEventListener.withWorkerLoggingProtocol(WorkerLogEventListener.java:41)
	at org.gradle.process.internal.worker.request.WorkerAction.run(WorkerAction.java:135)
	at sun.reflect.NativeMethodAccessorImpl.invoke0(Native Method)
	at sun.reflect.NativeMethodAccessorImpl.invoke(NativeMethodAccessorImpl.java:62)
	at sun.reflect.DelegatingMethodAccessorImpl.invoke(DelegatingMethodAccessorImpl.java:43)
	at java.lang.reflect.Method.invoke(Method.java:498)
	at org.gradle.internal.dispatch.ReflectionDispatch.dispatch(ReflectionDispatch.java:36)
	at org.gradle.internal.dispatch.ReflectionDispatch.dispatch(ReflectionDispatch.java:24)
	at org.gradle.internal.remote.internal.hub.MessageHubBackedObjectConnection$DispatchWrapper.dispatch(MessageHubBackedObjectConnection.java:182)
	at org.gradle.internal.remote.internal.hub.MessageHubBackedObjectConnection$DispatchWrapper.dispatch(MessageHubBackedObjectConnection.java:164)
	at org.gradle.internal.remote.internal.hub.MessageHub$Handler.run(MessageHub.java:414)
	at org.gradle.internal.concurrent.ExecutorPolicy$CatchAndRecordFailures.onExecute(ExecutorPolicy.java:64)
	at org.gradle.internal.concurrent.ManagedExecutorImpl$1.run(ManagedExecutorImpl.java:48)
	at java.util.concurrent.ThreadPoolExecutor.runWorker(ThreadPoolExecutor.java:1149)
	at java.util.concurrent.ThreadPoolExecutor$Worker.run(ThreadPoolExecutor.java:624)
	at org.gradle.internal.concurrent.ThreadFactoryImpl$ManagedThreadRunnable.run(ThreadFactoryImpl.java:56)
	at java.lang.Thread.run(Thread.java:748)

> Task :src:core:check

> Task :src:protocol:http:spotbugsTest
20 SpotBugs violations were found. See the report at: file://<https://ci-builds.apache.org/job/JMeter/job/JMeter-trunk/ws/src/protocol/http/build/reports/spotbugs/test.xml>

org.gradle.api.GradleException: 20 SpotBugs violations were found. See the report at: file://<https://ci-builds.apache.org/job/JMeter/job/JMeter-trunk/ws/src/protocol/http/build/reports/spotbugs/test.xml>
	at com.github.spotbugs.snom.internal.SpotBugsRunnerForWorker$SpotBugsExecutor.execute(SpotBugsRunnerForWorker.java:115)
	at org.gradle.workers.internal.DefaultWorkerServer.execute(DefaultWorkerServer.java:63)
	at org.gradle.workers.internal.AbstractClassLoaderWorker$1.create(AbstractClassLoaderWorker.java:49)
	at org.gradle.workers.internal.AbstractClassLoaderWorker$1.create(AbstractClassLoaderWorker.java:43)
	at org.gradle.internal.classloader.ClassLoaderUtils.executeInClassloader(ClassLoaderUtils.java:97)
	at org.gradle.workers.internal.AbstractClassLoaderWorker.executeInClassLoader(AbstractClassLoaderWorker.java:43)
	at org.gradle.workers.internal.IsolatedClassloaderWorker.run(IsolatedClassloaderWorker.java:49)
	at org.gradle.workers.internal.IsolatedClassloaderWorker.run(IsolatedClassloaderWorker.java:30)
	at org.gradle.workers.internal.WorkerDaemonServer.run(WorkerDaemonServer.java:85)
	at org.gradle.workers.internal.WorkerDaemonServer.run(WorkerDaemonServer.java:55)
	at org.gradle.process.internal.worker.request.WorkerAction$1.call(WorkerAction.java:138)
	at org.gradle.process.internal.worker.child.WorkerLogEventListener.withWorkerLoggingProtocol(WorkerLogEventListener.java:41)
	at org.gradle.process.internal.worker.request.WorkerAction.run(WorkerAction.java:135)
	at sun.reflect.NativeMethodAccessorImpl.invoke0(Native Method)
	at sun.reflect.NativeMethodAccessorImpl.invoke(NativeMethodAccessorImpl.java:62)
	at sun.reflect.DelegatingMethodAccessorImpl.invoke(DelegatingMethodAccessorImpl.java:43)
	at java.lang.reflect.Method.invoke(Method.java:498)
	at org.gradle.internal.dispatch.ReflectionDispatch.dispatch(ReflectionDispatch.java:36)
	at org.gradle.internal.dispatch.ReflectionDispatch.dispatch(ReflectionDispatch.java:24)
	at org.gradle.internal.remote.internal.hub.MessageHubBackedObjectConnection$DispatchWrapper.dispatch(MessageHubBackedObjectConnection.java:182)
	at org.gradle.internal.remote.internal.hub.MessageHubBackedObjectConnection$DispatchWrapper.dispatch(MessageHubBackedObjectConnection.java:164)
	at org.gradle.internal.remote.internal.hub.MessageHub$Handler.run(MessageHub.java:414)
	at org.gradle.internal.concurrent.ExecutorPolicy$CatchAndRecordFailures.onExecute(ExecutorPolicy.java:64)
	at org.gradle.internal.concurrent.ManagedExecutorImpl$1.run(ManagedExecutorImpl.java:48)
	at java.util.concurrent.ThreadPoolExecutor.runWorker(ThreadPoolExecutor.java:1149)
	at java.util.concurrent.ThreadPoolExecutor$Worker.run(ThreadPoolExecutor.java:624)
	at org.gradle.internal.concurrent.ThreadFactoryImpl$ManagedThreadRunnable.run(ThreadFactoryImpl.java:56)
	at java.lang.Thread.run(Thread.java:748)

> Task :src:dist-check:batchBug62239
Creating summariser <summary>
Created the tree successfully using <https://ci-builds.apache.org/job/JMeter/job/JMeter-trunk/ws/bin/testfiles/Bug62239.jmx>
Starting standalone test @ Tue Sep 01 18:58:24 UTC 2020 (1598986704578)
Waiting for possible Shutdown/StopTestNow/HeapDump/ThreadDump message on port 4445
summary =    108 in 00:00:01 =  205.7/s Avg:     0 Min:     0 Max:     2 Err:     0 (0.00%)
Tidying up ...    @ Tue Sep 01 18:58:25 UTC 2020 (1598986705335)
... end of run
No errors present in the logfile <https://ci-builds.apache.org/job/JMeter/job/JMeter-trunk/ws/bin/Bug62239.log>
(the file is empty)

> Task :src:protocol:http:test
          4.3sec,   16 completed,   0 failed,   0 skipped, org.apache.jmeter.protocol.http.sampler.ParallelResourcesAndIpSource
          0.3sec,    8 completed,   0 failed,   0 skipped, org.apache.jmeter.protocol.http.sampler.TestDecompression
          0.0sec,    8 completed,   0 failed,   0 skipped, org.apache.jmeter.protocol.http.sampler.PostWriterTest
          0.0sec,   18 completed,   0 failed,   0 skipped, org.apache.jmeter.protocol.http.sampler.TestHTTPSamplers
          0.5sec,    1 completed,   0 failed,   0 skipped, org.apache.jmeter.protocol.http.sampler.TestSerializedHTTPSampler
          0.0sec,    1 completed,   0 failed,   0 skipped, org.apache.jmeter.protocol.http.control.TestAuthorization
          0.0sec,    1 completed,   0 failed,   0 skipped, org.apache.jmeter.protocol.http.control.gui.TestHttpTestSampleGui
          0.1sec,    4 completed,   0 failed,   0 skipped, org.apache.jmeter.protocol.http.control.TestCookieManagerThreadIteration
          0.0sec,    2 completed,   0 failed,   0 skipped, org.apache.jmeter.protocol.http.control.TestAuthManagerThreadIteration
          0.1sec,    5 completed,   0 failed,   0 skipped, org.apache.jmeter.protocol.http.control.TestCacheManagerThreadIteration
          0.0sec,    6 completed,   0 failed,   0 skipped, org.apache.jmeter.protocol.http.control.TestAuthManager
          0.1sec,   33 completed,   0 failed,   0 skipped, org.apache.jmeter.protocol.http.control.TestHC4CookieManager

> Task :src:dist-check:batchFTP_TESTS
Creating summariser <summary>
Created the tree successfully using <https://ci-builds.apache.org/job/JMeter/job/JMeter-trunk/ws/bin/testfiles/FTP_TESTS.jmx>
Starting standalone test @ Tue Sep 01 18:58:27 UTC 2020 (1598986707693)
Waiting for possible Shutdown/StopTestNow/HeapDump/ThreadDump message on port 4445
summary +      1 in 00:00:02 =    0.7/s Avg:  1488 Min:  1488 Max:  1488 Err:     0 (0.00%)
Active: 1 Started: 1 Finished: 0
summary +      5 in 00:00:01 =    3.6/s Avg:    42 Min:     9 Max:    69 Err:     0 (0.00%)
Active: 0 Started: 1 Finished: 1
summary =      6 in 00:00:03 =    2.0/s Avg:   283 Min:     9 Max:  1488 Err:     0 (0.00%)
Tidying up ...    @ Tue Sep 01 18:58:31 UTC 2020 (1598986711409)
... end of run
No errors present in the logfile <https://ci-builds.apache.org/job/JMeter/job/JMeter-trunk/ws/bin/FTP_TESTS.log>
(the file is empty)

> Task :src:protocol:http:test
          6.1sec, org.apache.jmeter.protocol.http.control.DnsManagerTest
> badDnsInCustomResolverShouldFailHttpSampler(String, WireMockServer)[1], [1]
HttpClient4
WARNING   6.1sec,    2 completed,   0 failed,   1 skipped, org.apache.jmeter.protocol.http.control.DnsManagerTest
          0.0sec,    6 completed,   0 failed,   0 skipped, org.apache.jmeter.protocol.http.parser.TestHtmlParsingUtils
          0.2sec,    4 completed,   0 failed,   0 skipped, org.apache.jmeter.protocol.http.parser.TestCssParser
          0.0sec,    2 completed,   0 failed,   0 skipped, org.apache.jmeter.protocol.http.parser.TestBaseParser
          0.0sec,    2 completed,   0 failed,   0 skipped, org.apache.jmeter.protocol.http.config.UrlConfigTest
          0.0sec,    3 completed,   0 failed,   0 skipped, org.apache.jmeter.protocol.http.config.MultipartUrlConfigTest
          0.0sec,    6 completed,   0 failed,   0 skipped, org.apache.jmeter.protocol.http.util.accesslog.TestLogFilter
          0.0sec,    4 completed,   0 failed,   0 skipped, org.apache.jmeter.protocol.http.util.accesslog.TestTCLogParser
          0.0sec,    3 completed,   0 failed,   0 skipped, org.apache.jmeter.protocol.http.util.accesslog.TestSessionFilter
          0.0sec,    5 completed,   0 failed,   0 skipped, org.apache.jmeter.protocol.http.util.TestHTTPFileArgs
          0.0sec,    3 completed,   0 failed,   0 skipped, org.apache.jmeter.protocol.http.util.TestHTTPArgument
          0.0sec,    3 completed,   0 failed,   0 skipped, org.apache.jmeter.protocol.http.util.TestHTTPFileArg
          0.2sec,    1 completed,   0 failed,   0 skipped, org.apache.jmeter.resources.ResourceKeyUsageTestHttp
          0.0sec,    2 completed,   0 failed,   0 skipped, org.apache.jmeter.testelement.TestHeaderManager
          0.1sec,   57 completed,   0 failed,   0 skipped, org.apache.jmeter.curl.BasicCurlParserTest
          0.0sec,    7 completed,   0 failed,   0 skipped, org.apache.jmeter.protocol.http.visualizers.RequestViewHTTPTest
          0.3sec,   53 completed,   0 failed,   0 skipped, org.apache.jmeter.protocol.http.sampler.TestHTTPSamplersAgainstHttpMirrorServer
WARNING   0.0sec,    2 completed,   0 failed,   2 skipped, org.apache.jmeter.protocol.http.sampler.SamplingNamingTest
          0.9sec,    9 completed,   0 failed,   0 skipped, org.apache.jmeter.protocol.http.control.TestHTTPMirrorThread
          0.4sec,  103 completed,   0 failed,   0 skipped, org.apache.jmeter.protocol.http.parser.TestHTMLParser
          0.0sec,   46 completed,   0 failed,   0 skipped, org.apache.jmeter.protocol.http.parser.TestBug60842HtmlParser

> Task :src:dist-check:batchHTMLParserTestFile_2
Creating summariser <summary>
Created the tree successfully using <https://ci-builds.apache.org/job/JMeter/job/JMeter-trunk/ws/bin/testfiles/HTMLParserTestFile_2.jmx>
Starting standalone test @ Tue Sep 01 18:58:33 UTC 2020 (1598986713591)
Waiting for possible Shutdown/StopTestNow/HeapDump/ThreadDump message on port 4445
summary +      1 in 00:00:00 =    2.6/s Avg:   209 Min:   209 Max:   209 Err:     0 (0.00%)
Active: 1 Started: 1 Finished: 0
summary =      1 in 00:00:00 =    2.6/s Avg:   209 Min:   209 Max:   209 Err:     0 (0.00%)
Tidying up ...    @ Tue Sep 01 18:58:34 UTC 2020 (1598986714516)
... end of run
No errors present in the logfile <https://ci-builds.apache.org/job/JMeter/job/JMeter-trunk/ws/bin/HTMLParserTestFile_2.log>
(the file is empty)

> Task :src:dist-check:batchHttp4ImplDigestAuth SKIPPED

> Task :src:protocol:http:test FAILED
          0.3sec,   58 completed,   0 failed,   0 skipped, org.apache.jmeter.protocol.http.util.HTTPUtilsSpec
FAILURE  29.0sec,  620 completed,   2 failed,   3 skipped,
Gradle Test Run :src:protocol:http:test

620 tests completed, 2 failed, 3 skipped

> Task :src:dist-check:batchHttp4ImplPreemptiveBasicAuth
Creating summariser <summary>
Created the tree successfully using <https://ci-builds.apache.org/job/JMeter/job/JMeter-trunk/ws/bin/testfiles/Http4ImplPreemptiveBasicAuth.jmx>
Starting standalone test @ Tue Sep 01 18:58:36 UTC 2020 (1598986716785)
Waiting for possible Shutdown/StopTestNow/HeapDump/ThreadDump message on port 4445
summary =     12 in 00:00:09 =    1.3/s Avg:   470 Min:   168 Max:  1143 Err:     0 (0.00%)
Tidying up ...    @ Tue Sep 01 18:58:47 UTC 2020 (1598986727061)
... end of run
No errors present in the logfile <https://ci-builds.apache.org/job/JMeter/job/JMeter-trunk/ws/bin/Http4ImplPreemptiveBasicAuth.log>
(the file is empty)

> Task :src:dist:javadocAggregate
9 warnings
checksum-dependency elapsed time: 12808ms, configurations processed: 367 (add -PchecksumTimingsPrint
to print detailed timings)

FAILURE: Build failed with an exception.

* What went wrong:
Execution failed for task ':src:protocol:http:test'.
> There were failing tests. See the report at: file://<https://ci-builds.apache.org/job/JMeter/job/JMeter-trunk/ws/src/protocol/http/build/reports/tests/test/index.html>

* Try:
Run with --stacktrace option to get the stack trace. Run with --info or --debug option to
get more log output. Run with --scan to get full insights.

* Get more help at https://help.gradle.org

Deprecated Gradle features were used in this build, making it incompatible with Gradle 7.0.
Use '--warning-mode all' to show the individual deprecation warnings.
See https://docs.gradle.org/6.6/userguide/command_line_interface.html#sec:command_line_warnings

BUILD FAILED in 3m 57s
334 actionable tasks: 166 executed, 168 up-to-date

See the profiling report at: file://<https://ci-builds.apache.org/job/JMeter/job/JMeter-trunk/ws/build/reports/profile/profile-2020-09-01-18-55-08.html>
A fine-grained performance profile is available: use the --scan option.
Build step 'Invoke Gradle script' changed build result to FAILURE
Build step 'Invoke Gradle script' marked build as failure
Xvfb stopping
Archiving artifacts
[Fast Archiver] Compressed 15.49 MB of artifacts by 11.9% relative to #74
Recording test results

Mime
View raw message