jmeter-dev mailing list archives

Site index · List index
Message view « Date » · « Thread »
Top « Date » · « Thread »
From Apache Jenkins Server <jenk...@builds.apache.org>
Subject Build failed in Jenkins: JMeter » JMeter-trunk #68
Date Tue, 01 Sep 2020 16:03:55 GMT
See <https://ci-builds.apache.org/job/JMeter/job/JMeter-trunk/68/display/redirect?page=changes>

Changes:

[Felix Schumacher] Give a bit mor time for flaky test and add debug info


------------------------------------------
[...truncated 35.34 KB...]
> Task :src:protocol:jdbc:autostyleConfigsCheck
> Task :src:protocol:bolt:autostyleGroovyCheck
> Task :src:dist-check:autostyleGroovyCheck
> Task :src:functions:autostyleGroovyCheck
> Task :src:protocol:jdbc:autostyleGroovyCheck
> Task :src:jorphan:compileJava UP-TO-DATE
> Task :src:jorphan:compileGroovy NO-SOURCE
> Task :src:protocol:http:autostyleGroovyCheck
> Task :src:jorphan:processResources UP-TO-DATE
> Task :src:jorphan:classes UP-TO-DATE
> Task :src:components:autostyleConfigsCheck
> Task :src:jorphan:jar UP-TO-DATE
> Task :src:core:processResources UP-TO-DATE
> Task :src:testkit-wiremock:compileJava UP-TO-DATE
> Task :src:testkit-wiremock:processResources NO-SOURCE
> Task :src:testkit-wiremock:classes UP-TO-DATE
> Task :src:testkit-wiremock:jar UP-TO-DATE
> Task :src:testkit-wiremock:compileTestFixturesJava NO-SOURCE
> Task :src:components:autostyleGroovyCheck
> Task :src:testkit-wiremock:processTestFixturesResources NO-SOURCE
> Task :src:testkit-wiremock:testFixturesClasses UP-TO-DATE
> Task :src:testkit-wiremock:testFixturesJar UP-TO-DATE
> Task :src:testkit-wiremock:autostyleConfigsCheck NO-SOURCE
> Task :autostyleConfigsCheck
> Task :autostyleJavaCheck NO-SOURCE
> Task :src:jorphan:compileTestJava UP-TO-DATE
> Task :src:jorphan:compileTestGroovy UP-TO-DATE
> Task :src:jorphan:processTestResources NO-SOURCE
> Task :src:jorphan:testClasses UP-TO-DATE
> Task :src:jorphan:testJar UP-TO-DATE
> Task :src:jorphan:autostyleConfigsCheck NO-SOURCE
> Task :src:jorphan:autostyleGroovyCheck
> Task :src:bshclient:autostyleJavaCheck
> Task :src:generator:autostyleJavaCheck
> Task :src:testkit:autostyleJavaCheck
> Task :src:testkit-wiremock:autostyleJavaCheck
> Task :src:protocol:bolt:autostyleJavaCheck
> Task :src:protocol:ftp:autostyleJavaCheck
> Task :src:examples:autostyleJavaCheck
> Task :src:protocol:bolt:autostyleKotlinGradleCheck NO-SOURCE
> Task :src:protocol:ftp:autostyleKotlinGradleCheck NO-SOURCE
> Task :src:protocol:bolt:autostyleMarkdownCheck NO-SOURCE
> Task :src:protocol:bolt:autostyleCheck
> Task :src:protocol:ftp:autostyleMarkdownCheck NO-SOURCE
> Task :src:protocol:ftp:autostyleCheck
> Task :src:launcher:autostyleJavaCheck
> Task :src:protocol:bolt:checkstyleMain UP-TO-DATE
> Task :src:dist-check:autostyleJavaCheck
> Task :src:protocol:ftp:checkstyleMain UP-TO-DATE
> Task :src:protocol:ftp:checkstyleTest UP-TO-DATE
> Task :src:protocol:bolt:checkstyleTest UP-TO-DATE
> Task :src:protocol:junit:autostyleConfigsCheck NO-SOURCE
> Task :src:protocol:jms:autostyleConfigsCheck NO-SOURCE
> Task :src:protocol:jdbc:autostyleJavaCheck
> Task :src:protocol:jdbc:autostyleKotlinGradleCheck NO-SOURCE
> Task :src:protocol:jdbc:autostyleMarkdownCheck NO-SOURCE
> Task :src:protocol:jdbc:autostyleCheck
> Task :src:protocol:jdbc:checkstyleMain UP-TO-DATE
> Task :src:protocol:jdbc:checkstyleTest UP-TO-DATE
> Task :src:protocol:junit-sample:autostyleConfigsCheck NO-SOURCE
> Task :src:protocol:java:autostyleJavaCheck
> Task :src:protocol:java:autostyleKotlinGradleCheck NO-SOURCE
> Task :src:protocol:java:autostyleMarkdownCheck NO-SOURCE
> Task :src:protocol:java:autostyleCheck
> Task :src:protocol:java:checkstyleMain UP-TO-DATE
> Task :src:protocol:java:checkstyleTest UP-TO-DATE
> Task :src:protocol:junit:autostyleJavaCheck
> Task :src:protocol:ldap:autostyleConfigsCheck NO-SOURCE
> Task :src:protocol:junit:autostyleKotlinGradleCheck NO-SOURCE
> Task :src:protocol:junit:autostyleMarkdownCheck NO-SOURCE
> Task :src:protocol:junit:autostyleCheck
> Task :src:protocol:junit:checkstyleMain UP-TO-DATE
> Task :src:protocol:junit:checkstyleTest UP-TO-DATE
> Task :src:protocol:mail:autostyleConfigsCheck NO-SOURCE
> Task :src:protocol:junit-sample:autostyleJavaCheck
> Task :src:protocol:junit-sample:autostyleKotlinGradleCheck NO-SOURCE
> Task :src:protocol:junit-sample:autostyleMarkdownCheck NO-SOURCE
> Task :src:protocol:junit-sample:autostyleCheck
> Task :src:protocol:junit-sample:checkstyleMain UP-TO-DATE
> Task :src:protocol:junit-sample:checkstyleTest NO-SOURCE
> Task :src:protocol:junit-sample:processTestResources NO-SOURCE
> Task :src:protocol:mongodb:autostyleConfigsCheck
> Task :src:protocol:mongodb:autostyleJavaCheck
> Task :src:protocol:mongodb:autostyleKotlinGradleCheck NO-SOURCE
> Task :src:protocol:mongodb:autostyleMarkdownCheck NO-SOURCE
> Task :src:protocol:mongodb:autostyleCheck
> Task :src:protocol:mongodb:checkstyleMain UP-TO-DATE
> Task :src:protocol:mongodb:checkstyleTest UP-TO-DATE
> Task :src:protocol:native:autostyleConfigsCheck NO-SOURCE
> Task :src:protocol:ldap:autostyleJavaCheck
> Task :src:protocol:ldap:autostyleKotlinGradleCheck NO-SOURCE
> Task :src:protocol:ldap:autostyleMarkdownCheck NO-SOURCE
> Task :src:protocol:ldap:autostyleCheck
> Task :src:protocol:mail:autostyleJavaCheck
> Task :src:protocol:mail:autostyleKotlinGradleCheck NO-SOURCE
> Task :src:protocol:mail:autostyleMarkdownCheck NO-SOURCE
> Task :src:protocol:mail:autostyleCheck
> Task :src:protocol:ldap:checkstyleMain UP-TO-DATE
> Task :src:protocol:native:autostyleJavaCheck
> Task :src:protocol:native:autostyleKotlinGradleCheck NO-SOURCE
> Task :src:protocol:native:autostyleMarkdownCheck NO-SOURCE
> Task :src:protocol:native:autostyleCheck
> Task :src:protocol:mail:checkstyleMain UP-TO-DATE
> Task :src:protocol:ldap:checkstyleTest UP-TO-DATE
> Task :src:protocol:mail:checkstyleTest UP-TO-DATE
> Task :src:protocol:tcp:autostyleConfigsCheck NO-SOURCE
> Task :src:protocol:native:checkstyleMain UP-TO-DATE
> Task :src:protocol:native:checkstyleTest UP-TO-DATE
> Task :src:protocol:jms:autostyleJavaCheck
> Task :src:protocol:jms:autostyleKotlinGradleCheck NO-SOURCE
> Task :src:protocol:jms:autostyleMarkdownCheck NO-SOURCE
> Task :src:protocol:jms:autostyleCheck
> Task :src:protocol:jms:checkstyleMain UP-TO-DATE
> Task :src:protocol:jms:checkstyleTest UP-TO-DATE
> Task :src:protocol:tcp:autostyleJavaCheck
> Task :src:protocol:tcp:autostyleKotlinGradleCheck NO-SOURCE
> Task :src:protocol:tcp:autostyleMarkdownCheck NO-SOURCE
> Task :src:protocol:tcp:autostyleCheck
> Task :src:protocol:tcp:checkstyleMain UP-TO-DATE
> Task :src:protocol:tcp:checkstyleTest UP-TO-DATE
> Task :src:functions:autostyleJavaCheck
> Task :src:jorphan:autostyleJavaCheck
> Task :src:protocol:http:autostyleJavaCheck FAILED
> Task :src:testkit:autostyleKotlinGradleCheck
> Task :src:examples:autostyleKotlinGradleCheck
> Task :src:generator:autostyleKotlinGradleCheck
> Task :src:jorphan:autostyleKotlinGradleCheck
> Task :src:testkit-wiremock:autostyleKotlinGradleCheck
> Task :src:bshclient:autostyleKotlinGradleCheck
> Task :src:functions:autostyleKotlinGradleCheck
> Task :src:launcher:autostyleKotlinGradleCheck
> Task :src:config:autostyleKotlinGradleCheck
> Task :src:release:autostyleKotlinGradleCheck
> Task :src:bom:autostyleKotlinGradleCheck
> Task :src:protocol:autostyleKotlinGradleCheck
> Task :src:autostyleKotlinGradleCheck
> Task :src:dist-check:autostyleKotlinGradleCheck
> Task :src:licenses:autostyleKotlinGradleCheck
> Task :src:components:autostyleJavaCheck
> Task :src:dist:autostyleKotlinGradleCheck
> Task :autostyleKotlinGradleCheck
> Task :src:core:compileJava
checksum-dependency elapsed time: 7378ms, configurations processed: 115 (add -PchecksumTimingsPrint
to print detailed timings)

Build jmeter FAILURE reason:                                
    Execution failed for task ':src:protocol:http:autostyleJavaCheck':
        com.github.autostyle.FormatterException: Error while formatting src/protocol/http/src/test/java/org/apache/jmeter/protocol/http/control/TestCacheManagerBase.java:
267:149: error: ';' expected
            at com.github.autostyle.Formatter.compute(Formatter.java:226)
            at com.github.autostyle.Formatter.isClean(Formatter.java:152)
            at com.github.autostyle.gradle.AutostyleCheckTask.check(AutostyleCheckTask.kt:49)
            at com.github.autostyle.gradle.AutostyleCheckTask.performAction(AutostyleCheckTask.kt:40)
            at org.gradle.internal.reflect.JavaMethod.invoke(JavaMethod.java:104)
            at org.gradle.api.internal.project.taskfactory.IncrementalInputsTaskAction.doExecute(IncrementalInputsTaskAction.java:32)
            at org.gradle.api.internal.project.taskfactory.StandardTaskAction.execute(StandardTaskAction.java:51)
            at org.gradle.api.internal.project.taskfactory.AbstractIncrementalTaskAction.execute(AbstractIncrementalTaskAction.java:25)
            at org.gradle.api.internal.project.taskfactory.StandardTaskAction.execute(StandardTaskAction.java:29)
            at org.gradle.api.internal.tasks.execution.ExecuteActionsTaskExecuter$3.run(ExecuteActionsTaskExecuter.java:570)
            at org.gradle.internal.operations.DefaultBuildOperationExecutor$RunnableBuildOperationWorker.execute(DefaultBuildOperationExecutor.java:395)
            at org.gradle.internal.operations.DefaultBuildOperationExecutor$RunnableBuildOperationWorker.execute(DefaultBuildOperationExecutor.java:387)
            at org.gradle.internal.operations.DefaultBuildOperationExecutor$1.execute(DefaultBuildOperationExecutor.java:157)
            at org.gradle.internal.operations.DefaultBuildOperationExecutor.execute(DefaultBuildOperationExecutor.java:242)
            at org.gradle.internal.operations.DefaultBuildOperationExecutor.execute(DefaultBuildOperationExecutor.java:150)
            at org.gradle.internal.operations.DefaultBuildOperationExecutor.run(DefaultBuildOperationExecutor.java:84)
            at org.gradle.internal.operations.DelegatingBuildOperationExecutor.run(DelegatingBuildOperationExecutor.java:31)
            at org.gradle.api.internal.tasks.execution.ExecuteActionsTaskExecuter.executeAction(ExecuteActionsTaskExecuter.java:555)
            at org.gradle.api.internal.tasks.execution.ExecuteActionsTaskExecuter.executeActions(ExecuteActionsTaskExecuter.java:538)
            at org.gradle.api.internal.tasks.execution.ExecuteActionsTaskExecuter.access$300(ExecuteActionsTaskExecuter.java:109)
            at org.gradle.api.internal.tasks.execution.ExecuteActionsTaskExecuter$TaskExecution.executeWithPreviousOutputFiles(ExecuteActionsTaskExecuter.java:279)
            at org.gradle.api.internal.tasks.execution.ExecuteActionsTaskExecuter$TaskExecution.execute(ExecuteActionsTaskExecuter.java:268)
            at org.gradle.internal.execution.steps.ExecuteStep.lambda$execute$0(ExecuteStep.java:32)
            at org.gradle.internal.execution.steps.ExecuteStep.execute(ExecuteStep.java:32)
            at org.gradle.internal.execution.steps.ExecuteStep.execute(ExecuteStep.java:26)
            at org.gradle.internal.execution.steps.CleanupOutputsStep.execute(CleanupOutputsStep.java:67)
            at org.gradle.internal.execution.steps.CleanupOutputsStep.execute(CleanupOutputsStep.java:36)
            at org.gradle.internal.execution.steps.ResolveInputChangesStep.execute(ResolveInputChangesStep.java:49)
            at org.gradle.internal.execution.steps.ResolveInputChangesStep.execute(ResolveInputChangesStep.java:34)
            at org.gradle.internal.execution.steps.CancelExecutionStep.execute(CancelExecutionStep.java:43)
            at org.gradle.internal.execution.steps.TimeoutStep.executeWithoutTimeout(TimeoutStep.java:73)
            at org.gradle.internal.execution.steps.TimeoutStep.execute(TimeoutStep.java:54)
            at org.gradle.internal.execution.steps.CatchExceptionStep.execute(CatchExceptionStep.java:34)
            at org.gradle.internal.execution.steps.CreateOutputsStep.execute(CreateOutputsStep.java:44)
            at org.gradle.internal.execution.steps.SnapshotOutputsStep.execute(SnapshotOutputsStep.java:54)
            at org.gradle.internal.execution.steps.SnapshotOutputsStep.execute(SnapshotOutputsStep.java:38)
            at org.gradle.internal.execution.steps.BroadcastChangingOutputsStep.execute(BroadcastChangingOutputsStep.java:49)
            at org.gradle.internal.execution.steps.CacheStep.executeWithoutCache(CacheStep.java:159)
            at org.gradle.internal.execution.steps.CacheStep.execute(CacheStep.java:72)
            at org.gradle.internal.execution.steps.CacheStep.execute(CacheStep.java:43)
            at org.gradle.internal.execution.steps.StoreExecutionStateStep.execute(StoreExecutionStateStep.java:44)
            at org.gradle.internal.execution.steps.StoreExecutionStateStep.execute(StoreExecutionStateStep.java:33)
            at org.gradle.internal.execution.steps.RecordOutputsStep.execute(RecordOutputsStep.java:38)
            at org.gradle.internal.execution.steps.RecordOutputsStep.execute(RecordOutputsStep.java:24)
            at org.gradle.internal.execution.steps.SkipUpToDateStep.executeBecause(SkipUpToDateStep.java:92)
            at org.gradle.internal.execution.steps.SkipUpToDateStep.lambda$execute$0(SkipUpToDateStep.java:85)
            at org.gradle.internal.execution.steps.SkipUpToDateStep.execute(SkipUpToDateStep.java:55)
            at org.gradle.internal.execution.steps.SkipUpToDateStep.execute(SkipUpToDateStep.java:39)
            at org.gradle.internal.execution.steps.ResolveChangesStep.execute(ResolveChangesStep.java:76)
            at org.gradle.internal.execution.steps.ResolveChangesStep.execute(ResolveChangesStep.java:37)
            at org.gradle.internal.execution.steps.legacy.MarkSnapshottingInputsFinishedStep.execute(MarkSnapshottingInputsFinishedStep.java:36)
            at org.gradle.internal.execution.steps.legacy.MarkSnapshottingInputsFinishedStep.execute(MarkSnapshottingInputsFinishedStep.java:26)
            at org.gradle.internal.execution.steps.ResolveCachingStateStep.execute(ResolveCachingStateStep.java:94)
            at org.gradle.internal.execution.steps.ResolveCachingStateStep.execute(ResolveCachingStateStep.java:49)
            at org.gradle.internal.execution.steps.CaptureStateBeforeExecutionStep.execute(CaptureStateBeforeExecutionStep.java:79)
            at org.gradle.internal.execution.steps.CaptureStateBeforeExecutionStep.execute(CaptureStateBeforeExecutionStep.java:53)
            at org.gradle.internal.execution.steps.ValidateStep.execute(ValidateStep.java:74)
            at org.gradle.internal.execution.steps.SkipEmptyWorkStep.lambda$execute$2(SkipEmptyWorkStep.java:78)
            at org.gradle.internal.execution.steps.SkipEmptyWorkStep.execute(SkipEmptyWorkStep.java:78)
            at org.gradle.internal.execution.steps.SkipEmptyWorkStep.execute(SkipEmptyWorkStep.java:34)
            at org.gradle.internal.execution.steps.legacy.MarkSnapshottingInputsStartedStep.execute(MarkSnapshottingInputsStartedStep.java:39)
            at org.gradle.internal.execution.steps.LoadExecutionStateStep.execute(LoadExecutionStateStep.java:40)
            at org.gradle.internal.execution.steps.LoadExecutionStateStep.execute(LoadExecutionStateStep.java:28)
            Caused by: com.google.googlejavaformat.java.FormatterException: 267:149: error:
';' expected
                at com.google.googlejavaformat.java.FormatterException.fromJavacDiagnostics(FormatterException.java:50)
                at com.google.googlejavaformat.java.RemoveUnusedImports.parse(RemoveUnusedImports.java:253)
                at com.google.googlejavaformat.java.RemoveUnusedImports.removeUnusedImports(RemoveUnusedImports.java:211)
                at com.google.googlejavaformat.java.RemoveUnusedImports.removeUnusedImports(RemoveUnusedImports.java:204)
                at com.github.autostyle.java.GoogleJavaFormatStep$State.lambda$createRemoveUnusedImportsOnly$1(GoogleJavaFormatStep.java:156)
                at com.github.autostyle.FormatterFunc.apply(FormatterFunc.java:31)
                at com.github.autostyle.FormatterStepImpl$Standard.format(FormatterStepImpl.java:77)
                at com.github.autostyle.FormatterStep$Strict.format(FormatterStep.java:76)
                at com.github.autostyle.Formatter.compute(Formatter.java:215)
                ... 62 more


FAILURE: Build failed with an exception.

* What went wrong:
Execution failed for task ':src:protocol:http:autostyleJavaCheck'.
> Error while formatting src/protocol/http/src/test/java/org/apache/jmeter/protocol/http/control/TestCacheManagerBase.java:
267:149: error: ';' expected

* Try:
Run with --stacktrace option to get the stack trace. Run with --info or --debug option to
get more log output. Run with --scan to get full insights.

* Get more help at https://help.gradle.org

Deprecated Gradle features were used in this build, making it incompatible with Gradle 7.0.
Use '--warning-mode all' to show the individual deprecation warnings.
See https://docs.gradle.org/6.6/userguide/command_line_interface.html#sec:command_line_warnings

BUILD FAILED in 20s
137 actionable tasks: 75 executed, 62 up-to-date

See the profiling report at: file://<https://ci-builds.apache.org/job/JMeter/job/JMeter-trunk/ws/build/reports/profile/profile-2020-09-01-16-03-34.html>
A fine-grained performance profile is available: use the --scan option.
Build step 'Invoke Gradle script' changed build result to FAILURE
Build step 'Invoke Gradle script' marked build as failure
Xvfb stopping
Archiving artifacts
Recording test results
ERROR: Step ?Publish JUnit test result report? failed: No test report files were found. Configuration
error?

Mime
View raw message