jmeter-dev mailing list archives

Site index · List index
Message view « Date » · « Thread »
Top « Date » · « Thread »
From Apache Jenkins Server <jenk...@builds.apache.org>
Subject Build failed in Jenkins: JMeter » JMeter Ubuntu #47
Date Wed, 23 Sep 2020 19:12:17 GMT
See <https://ci-builds.apache.org/job/JMeter/job/JMeter%20Ubuntu/47/display/redirect?page=changes>

Changes:

[Philippe Mouawad] Update darklaf from 2.4.7 to 2.4.8

[Philippe Mouawad] fix failure due to jars check

[Philippe Mouawad] Update Darklaf to 2.4.9 from 2.4.8


------------------------------------------
[...truncated 101.07 KB...]
> Task :src:components:checkstyleMain UP-TO-DATE
> Task :src:components:checkstyleTest UP-TO-DATE
> Task :src:components:processResources UP-TO-DATE
> Task :src:components:processTestResources UP-TO-DATE
> Task :src:dist-check:populateLibs
> Task :src:protocol:http:autostyleJavaCheck
> Task :src:protocol:http:autostyleKotlinGradleCheck NO-SOURCE
> Task :src:protocol:http:autostyleMarkdownCheck NO-SOURCE
> Task :src:protocol:http:autostyleCheck
> Task :src:protocol:http:checkstyleMain UP-TO-DATE
> Task :src:protocol:http:checkstyleTest UP-TO-DATE
> Task :src:core:autostyleJavaCheck
> Task :rat
> Task :check

> Task :src:core:compileJava
Note: Some input files use or override a deprecated API.
Note: Recompile with -Xlint:deprecation for details.
Note: <https://ci-builds.apache.org/job/JMeter/job/JMeter%20Ubuntu/ws/src/core/src/main/java/org/apache/jmeter/save/converters/TestElementPropertyConverter.java>
uses unchecked or unsafe operations.
Note: Recompile with -Xlint:unchecked for details.

> Task :src:core:compileGroovy NO-SOURCE
> Task :src:core:classes
> Task :src:protocol:ldap:compileJava UP-TO-DATE
> Task :src:protocol:jms:compileJava UP-TO-DATE
> Task :src:protocol:native:compileJava UP-TO-DATE
> Task :src:protocol:java:compileJava UP-TO-DATE
> Task :src:protocol:ldap:classes UP-TO-DATE
> Task :src:protocol:java:classes UP-TO-DATE
> Task :src:protocol:native:classes UP-TO-DATE
> Task :src:protocol:jms:classes UP-TO-DATE
> Task :src:protocol:junit-sample:compileJava UP-TO-DATE
> Task :src:protocol:junit-sample:classes UP-TO-DATE
> Task :src:protocol:ldap:jar UP-TO-DATE
> Task :src:protocol:java:jar UP-TO-DATE
> Task :src:protocol:java:spotbugsMain SKIPPED
> Task :src:protocol:ldap:spotbugsMain SKIPPED
> Task :src:protocol:tcp:compileJava UP-TO-DATE
> Task :src:protocol:jms:jar UP-TO-DATE
> Task :src:protocol:jms:spotbugsMain SKIPPED
> Task :src:protocol:tcp:classes UP-TO-DATE
> Task :src:protocol:tcp:jar UP-TO-DATE
> Task :src:protocol:tcp:spotbugsMain SKIPPED
> Task :src:protocol:native:jar UP-TO-DATE
> Task :src:protocol:native:spotbugsMain SKIPPED
> Task :src:protocol:junit-sample:jar UP-TO-DATE
> Task :src:protocol:junit-sample:spotbugsMain SKIPPED
> Task :src:protocol:mail:compileJava UP-TO-DATE
> Task :src:protocol:mail:classes UP-TO-DATE
> Task :src:protocol:mail:jar UP-TO-DATE
> Task :src:protocol:mail:spotbugsMain SKIPPED
> Task :src:protocol:junit:compileJava UP-TO-DATE
> Task :src:protocol:junit:classes UP-TO-DATE
> Task :src:protocol:mongodb:compileJava UP-TO-DATE
> Task :src:protocol:mongodb:classes UP-TO-DATE
> Task :src:protocol:junit:jar UP-TO-DATE
> Task :src:protocol:junit:spotbugsMain SKIPPED
> Task :src:protocol:mongodb:jar UP-TO-DATE
> Task :src:protocol:mongodb:spotbugsMain SKIPPED
> Task :src:protocol:ftp:compileJava UP-TO-DATE
> Task :src:protocol:ftp:classes UP-TO-DATE
> Task :src:protocol:ftp:jar UP-TO-DATE
> Task :src:protocol:ftp:spotbugsMain SKIPPED
> Task :src:core:jar
> Task :src:protocol:jdbc:compileJava UP-TO-DATE
> Task :src:protocol:jdbc:compileGroovy NO-SOURCE
> Task :src:protocol:jdbc:classes UP-TO-DATE
> Task :src:protocol:jdbc:jar UP-TO-DATE
> Task :src:protocol:jdbc:spotbugsMain SKIPPED
> Task :src:protocol:bolt:compileJava UP-TO-DATE
> Task :src:protocol:bolt:compileGroovy NO-SOURCE
> Task :src:protocol:bolt:classes UP-TO-DATE
> Task :src:protocol:bolt:jar UP-TO-DATE
> Task :src:protocol:bolt:spotbugsMain SKIPPED
> Task :src:components:compileJava UP-TO-DATE
> Task :src:components:compileGroovy NO-SOURCE
> Task :src:components:classes UP-TO-DATE
> Task :src:components:spotbugsMain SKIPPED
> Task :src:components:jar UP-TO-DATE
> Task :src:examples:compileJava UP-TO-DATE
> Task :src:generator:compileJava UP-TO-DATE
> Task :src:examples:classes UP-TO-DATE
> Task :src:generator:classes UP-TO-DATE
> Task :src:examples:spotbugsMain SKIPPED
> Task :src:examples:compileTestJava NO-SOURCE
> Task :src:examples:testClasses UP-TO-DATE
> Task :src:examples:spotbugsTest SKIPPED
> Task :src:examples:test NO-SOURCE
> Task :src:examples:check
> Task :src:generator:jar UP-TO-DATE
> Task :src:generator:spotbugsMain SKIPPED
> Task :src:generator:compileTestJava NO-SOURCE
> Task :src:generator:testClasses UP-TO-DATE
> Task :src:generator:spotbugsTest SKIPPED
> Task :src:generator:test NO-SOURCE
> Task :src:generator:check
> Task :src:functions:compileJava UP-TO-DATE
> Task :src:functions:compileGroovy NO-SOURCE
> Task :src:functions:classes UP-TO-DATE
> Task :src:functions:jar UP-TO-DATE
> Task :src:functions:spotbugsMain SKIPPED

> Task :src:core:compileTestJava
Note: <https://ci-builds.apache.org/job/JMeter/job/JMeter%20Ubuntu/ws/src/core/src/test/java/org/apache/jmeter/listeners/TestResultAction.java>
uses or overrides a deprecated API.
Note: Recompile with -Xlint:deprecation for details.

> Task :src:protocol:http:compileJava UP-TO-DATE
> Task :src:protocol:http:compileGroovy NO-SOURCE
> Task :src:protocol:http:classes UP-TO-DATE
> Task :src:dist:compileJava NO-SOURCE
> Task :src:dist:classes UP-TO-DATE
> Task :src:dist:spotbugsMain SKIPPED
> Task :src:dist:compileTestJava NO-SOURCE
> Task :src:dist:testClasses UP-TO-DATE
> Task :src:dist:spotbugsTest SKIPPED
> Task :src:dist:jar UP-TO-DATE
> Task :src:protocol:http:jar UP-TO-DATE
> Task :src:protocol:http:spotbugsMain SKIPPED
> Task :src:dist:test NO-SOURCE
> Task :src:dist-check:compileJava NO-SOURCE
> Task :src:dist-check:compileGroovy NO-SOURCE
> Task :src:dist-check:classes UP-TO-DATE
> Task :src:dist-check:spotbugsMain SKIPPED
> Task :src:dist:verifyReleaseDependencies FAILED
> Task :src:core:compileTestGroovy
checksum-dependency elapsed time: 44294ms, configurations processed: 183
    SHA-512 computation time: 2651ms (goes in parallel, it might exceed wall-clock time),
files processed: 27, processed: 8MiB, skipped: 1785MiB
    PGP signature resolution time: 5578ms (wall-clock), resolution requests: 108, signatures
resolved: 247
    PGP key resolution time: 29445ms (wall-clock), resolution requests: 108, download time:
0ms (goes in parallel, it might exceed wall-clock time), keys downloaded: 0
        PGP signature verification time: 55328ms (goes in parallel, it might exceed wall-clock
time), files processed: 493, processed: 508MiB, skipped: 1268MiB

Build jmeter FAILURE reason:                                
    Execution failed for task ':src:dist:verifyReleaseDependencies':
        External dependencies differ (you could update src/dist/src/dist/expected_release_jars.csv
if you add -PupdateExpectedJars):
          55489873 => 55490895 bytes (+1022 bytes)
        
        - 1440723 darklaf-core-2.4.8.jar
        + 1441749 darklaf-core-2.4.9.jar
        -   32010 darklaf-macos-2.4.8.jar
        +   32009 darklaf-macos-2.4.9.jar
        -    6277 darklaf-native-utils-2.4.8.jar
        +    6277 darklaf-native-utils-2.4.9.jar
        -    3246 darklaf-platform-base-2.4.8.jar
        +    3245 darklaf-platform-base-2.4.9.jar
        -   62676 darklaf-property-loader-2.4.8.jar
        +   62676 darklaf-property-loader-2.4.9.jar
        -   83382 darklaf-theme-2.4.8.jar
        +   83382 darklaf-theme-2.4.9.jar
        -   43966 darklaf-utils-2.4.8.jar
        +   43965 darklaf-utils-2.4.9.jar
        -  335946 darklaf-windows-2.4.8.jar
        +  335945 darklaf-windows-2.4.9.jar
            at Build_gradle$verifyReleaseDependencies$2$1.execute(build.gradle.kts:228)
            at Build_gradle$verifyReleaseDependencies$2$1.execute(build.gradle.kts:24)
            at org.gradle.api.internal.AbstractTask$TaskActionWrapper.execute(AbstractTask.java:731)
            at org.gradle.api.internal.AbstractTask$TaskActionWrapper.execute(AbstractTask.java:704)
            at org.gradle.api.internal.tasks.execution.ExecuteActionsTaskExecuter$3.run(ExecuteActionsTaskExecuter.java:570)
            at org.gradle.internal.operations.DefaultBuildOperationExecutor$RunnableBuildOperationWorker.execute(DefaultBuildOperationExecutor.java:395)
            at org.gradle.internal.operations.DefaultBuildOperationExecutor$RunnableBuildOperationWorker.execute(DefaultBuildOperationExecutor.java:387)
            at org.gradle.internal.operations.DefaultBuildOperationExecutor$1.execute(DefaultBuildOperationExecutor.java:157)
            at org.gradle.internal.operations.DefaultBuildOperationExecutor.execute(DefaultBuildOperationExecutor.java:242)
            at org.gradle.internal.operations.DefaultBuildOperationExecutor.execute(DefaultBuildOperationExecutor.java:150)
            at org.gradle.internal.operations.DefaultBuildOperationExecutor.run(DefaultBuildOperationExecutor.java:84)
            at org.gradle.internal.operations.DelegatingBuildOperationExecutor.run(DelegatingBuildOperationExecutor.java:31)
            at org.gradle.api.internal.tasks.execution.ExecuteActionsTaskExecuter.executeAction(ExecuteActionsTaskExecuter.java:555)
            at org.gradle.api.internal.tasks.execution.ExecuteActionsTaskExecuter.executeActions(ExecuteActionsTaskExecuter.java:538)
            at org.gradle.api.internal.tasks.execution.ExecuteActionsTaskExecuter.access$300(ExecuteActionsTaskExecuter.java:109)
            at org.gradle.api.internal.tasks.execution.ExecuteActionsTaskExecuter$TaskExecution.executeWithPreviousOutputFiles(ExecuteActionsTaskExecuter.java:279)
            at org.gradle.api.internal.tasks.execution.ExecuteActionsTaskExecuter$TaskExecution.execute(ExecuteActionsTaskExecuter.java:268)
            at org.gradle.internal.execution.steps.ExecuteStep.lambda$execute$1(ExecuteStep.java:33)
            at org.gradle.internal.execution.steps.ExecuteStep.execute(ExecuteStep.java:33)
            at org.gradle.internal.execution.steps.ExecuteStep.execute(ExecuteStep.java:26)
            at org.gradle.internal.execution.steps.CleanupOutputsStep.execute(CleanupOutputsStep.java:67)
            at org.gradle.internal.execution.steps.CleanupOutputsStep.execute(CleanupOutputsStep.java:36)
            at org.gradle.internal.execution.steps.ResolveInputChangesStep.execute(ResolveInputChangesStep.java:49)
            at org.gradle.internal.execution.steps.ResolveInputChangesStep.execute(ResolveInputChangesStep.java:34)
            at org.gradle.internal.execution.steps.CancelExecutionStep.execute(CancelExecutionStep.java:43)
            at org.gradle.internal.execution.steps.TimeoutStep.executeWithoutTimeout(TimeoutStep.java:73)
            at org.gradle.internal.execution.steps.TimeoutStep.execute(TimeoutStep.java:54)
            at org.gradle.internal.execution.steps.CatchExceptionStep.execute(CatchExceptionStep.java:34)
            at org.gradle.internal.execution.steps.CreateOutputsStep.execute(CreateOutputsStep.java:44)
            at org.gradle.internal.execution.steps.SnapshotOutputsStep.execute(SnapshotOutputsStep.java:54)
            at org.gradle.internal.execution.steps.SnapshotOutputsStep.execute(SnapshotOutputsStep.java:38)
            at org.gradle.internal.execution.steps.BroadcastChangingOutputsStep.execute(BroadcastChangingOutputsStep.java:49)
            at org.gradle.internal.execution.steps.CacheStep.executeWithoutCache(CacheStep.java:159)
            at org.gradle.internal.execution.steps.CacheStep.execute(CacheStep.java:72)
            at org.gradle.internal.execution.steps.CacheStep.execute(CacheStep.java:43)
            at org.gradle.internal.execution.steps.StoreExecutionStateStep.execute(StoreExecutionStateStep.java:44)
            at org.gradle.internal.execution.steps.StoreExecutionStateStep.execute(StoreExecutionStateStep.java:33)
            at org.gradle.internal.execution.steps.RecordOutputsStep.execute(RecordOutputsStep.java:38)
            at org.gradle.internal.execution.steps.RecordOutputsStep.execute(RecordOutputsStep.java:24)
            at org.gradle.internal.execution.steps.SkipUpToDateStep.executeBecause(SkipUpToDateStep.java:92)
            at org.gradle.internal.execution.steps.SkipUpToDateStep.lambda$execute$0(SkipUpToDateStep.java:85)
            at org.gradle.internal.execution.steps.SkipUpToDateStep.execute(SkipUpToDateStep.java:55)
            at org.gradle.internal.execution.steps.SkipUpToDateStep.execute(SkipUpToDateStep.java:39)
            at org.gradle.internal.execution.steps.ResolveChangesStep.execute(ResolveChangesStep.java:76)
            at org.gradle.internal.execution.steps.ResolveChangesStep.execute(ResolveChangesStep.java:37)
            at org.gradle.internal.execution.steps.legacy.MarkSnapshottingInputsFinishedStep.execute(MarkSnapshottingInputsFinishedStep.java:36)
            at org.gradle.internal.execution.steps.legacy.MarkSnapshottingInputsFinishedStep.execute(MarkSnapshottingInputsFinishedStep.java:26)
            at org.gradle.internal.execution.steps.ResolveCachingStateStep.execute(ResolveCachingStateStep.java:94)
            at org.gradle.internal.execution.steps.ResolveCachingStateStep.execute(ResolveCachingStateStep.java:49)
            at org.gradle.internal.execution.steps.CaptureStateBeforeExecutionStep.execute(CaptureStateBeforeExecutionStep.java:79)
            at org.gradle.internal.execution.steps.CaptureStateBeforeExecutionStep.execute(CaptureStateBeforeExecutionStep.java:53)
            at org.gradle.internal.execution.steps.ValidateStep.execute(ValidateStep.java:74)
            at org.gradle.internal.execution.steps.SkipEmptyWorkStep.lambda$execute$2(SkipEmptyWorkStep.java:78)
            at org.gradle.internal.execution.steps.SkipEmptyWorkStep.execute(SkipEmptyWorkStep.java:78)
            at org.gradle.internal.execution.steps.SkipEmptyWorkStep.execute(SkipEmptyWorkStep.java:34)
            at org.gradle.internal.execution.steps.legacy.MarkSnapshottingInputsStartedStep.execute(MarkSnapshottingInputsStartedStep.java:39)
            at org.gradle.internal.execution.steps.LoadExecutionStateStep.execute(LoadExecutionStateStep.java:40)
            at org.gradle.internal.execution.steps.LoadExecutionStateStep.execute(LoadExecutionStateStep.java:28)


FAILURE: Build failed with an exception.

* What went wrong:
Execution failed for task ':src:dist:verifyReleaseDependencies'.
> External dependencies differ (you could update src/dist/src/dist/expected_release_jars.csv
if you add -PupdateExpectedJars):
    55489873 => 55490895 bytes (+1022 bytes)
  
  - 1440723 darklaf-core-2.4.8.jar
  + 1441749 darklaf-core-2.4.9.jar
  -   32010 darklaf-macos-2.4.8.jar
  +   32009 darklaf-macos-2.4.9.jar
  -    6277 darklaf-native-utils-2.4.8.jar
  +    6277 darklaf-native-utils-2.4.9.jar
  -    3246 darklaf-platform-base-2.4.8.jar
  +    3245 darklaf-platform-base-2.4.9.jar
  -   62676 darklaf-property-loader-2.4.8.jar
  +   62676 darklaf-property-loader-2.4.9.jar
  -   83382 darklaf-theme-2.4.8.jar
  +   83382 darklaf-theme-2.4.9.jar
  -   43966 darklaf-utils-2.4.8.jar
  +   43965 darklaf-utils-2.4.9.jar
  -  335946 darklaf-windows-2.4.8.jar
  +  335945 darklaf-windows-2.4.9.jar

* Try:
Run with --stacktrace option to get the stack trace. Run with --info or --debug option to
get more log output. Run with --scan to get full insights.

* Get more help at https://help.gradle.org

Deprecated Gradle features were used in this build, making it incompatible with Gradle 7.0.
Use '--warning-mode all' to show the individual deprecation warnings.
See https://docs.gradle.org/6.6/userguide/command_line_interface.html#sec:command_line_warnings

BUILD FAILED in 1m 51s
176 actionable tasks: 71 executed, 105 up-to-date
Build step 'Invoke Gradle script' changed build result to FAILURE
Build step 'Invoke Gradle script' marked build as failure

Mime
View raw message