jmeter-dev mailing list archives

Site index · List index
Message view « Date » · « Thread »
Top « Date » · « Thread »
From Apache Jenkins Server <jenk...@builds.apache.org>
Subject Build failed in Jenkins: JMeter » JMeter-trunk #70
Date Tue, 01 Sep 2020 17:28:12 GMT
See <https://ci-builds.apache.org/job/JMeter/job/JMeter-trunk/70/display/redirect?page=changes>

Changes:

[Felix Schumacher] Allow even more delta and extract it into a constant


------------------------------------------
[...truncated 295.85 KB...]
	at org.gradle.internal.remote.internal.hub.MessageHub$Handler.run(MessageHub.java:414)
	at org.gradle.internal.concurrent.ExecutorPolicy$CatchAndRecordFailures.onExecute(ExecutorPolicy.java:64)
	at org.gradle.internal.concurrent.ManagedExecutorImpl$1.run(ManagedExecutorImpl.java:48)
	at java.util.concurrent.ThreadPoolExecutor.runWorker(ThreadPoolExecutor.java:1149)
	at java.util.concurrent.ThreadPoolExecutor$Worker.run(ThreadPoolExecutor.java:624)
	at org.gradle.internal.concurrent.ThreadFactoryImpl$ManagedThreadRunnable.run(ThreadFactoryImpl.java:56)
	at java.lang.Thread.run(Thread.java:748)

> Task :src:protocol:http:test
          3.3sec,   16 completed,   0 failed,   0 skipped, org.apache.jmeter.protocol.http.sampler.ParallelResourcesAndIpSource
          0.7sec,    8 completed,   0 failed,   0 skipped, org.apache.jmeter.protocol.http.sampler.TestDecompression
          0.0sec,    8 completed,   0 failed,   0 skipped, org.apache.jmeter.protocol.http.sampler.PostWriterTest
          0.0sec,   18 completed,   0 failed,   0 skipped, org.apache.jmeter.protocol.http.sampler.TestHTTPSamplers

> Task :src:protocol:http:spotbugsTest
20 SpotBugs violations were found. See the report at: file://<https://ci-builds.apache.org/job/JMeter/job/JMeter-trunk/ws/src/protocol/http/build/reports/spotbugs/test.xml>

org.gradle.api.GradleException: 20 SpotBugs violations were found. See the report at: file://<https://ci-builds.apache.org/job/JMeter/job/JMeter-trunk/ws/src/protocol/http/build/reports/spotbugs/test.xml>
	at com.github.spotbugs.snom.internal.SpotBugsRunnerForWorker$SpotBugsExecutor.execute(SpotBugsRunnerForWorker.java:115)
	at org.gradle.workers.internal.DefaultWorkerServer.execute(DefaultWorkerServer.java:63)
	at org.gradle.workers.internal.AbstractClassLoaderWorker$1.create(AbstractClassLoaderWorker.java:49)
	at org.gradle.workers.internal.AbstractClassLoaderWorker$1.create(AbstractClassLoaderWorker.java:43)
	at org.gradle.internal.classloader.ClassLoaderUtils.executeInClassloader(ClassLoaderUtils.java:97)
	at org.gradle.workers.internal.AbstractClassLoaderWorker.executeInClassLoader(AbstractClassLoaderWorker.java:43)
	at org.gradle.workers.internal.IsolatedClassloaderWorker.run(IsolatedClassloaderWorker.java:49)
	at org.gradle.workers.internal.IsolatedClassloaderWorker.run(IsolatedClassloaderWorker.java:30)
	at org.gradle.workers.internal.WorkerDaemonServer.run(WorkerDaemonServer.java:85)
	at org.gradle.workers.internal.WorkerDaemonServer.run(WorkerDaemonServer.java:55)
	at org.gradle.process.internal.worker.request.WorkerAction$1.call(WorkerAction.java:138)
	at org.gradle.process.internal.worker.child.WorkerLogEventListener.withWorkerLoggingProtocol(WorkerLogEventListener.java:41)
	at org.gradle.process.internal.worker.request.WorkerAction.run(WorkerAction.java:135)
	at sun.reflect.NativeMethodAccessorImpl.invoke0(Native Method)
	at sun.reflect.NativeMethodAccessorImpl.invoke(NativeMethodAccessorImpl.java:62)
	at sun.reflect.DelegatingMethodAccessorImpl.invoke(DelegatingMethodAccessorImpl.java:43)
	at java.lang.reflect.Method.invoke(Method.java:498)
	at org.gradle.internal.dispatch.ReflectionDispatch.dispatch(ReflectionDispatch.java:36)
	at org.gradle.internal.dispatch.ReflectionDispatch.dispatch(ReflectionDispatch.java:24)
	at org.gradle.internal.remote.internal.hub.MessageHubBackedObjectConnection$DispatchWrapper.dispatch(MessageHubBackedObjectConnection.java:182)
	at org.gradle.internal.remote.internal.hub.MessageHubBackedObjectConnection$DispatchWrapper.dispatch(MessageHubBackedObjectConnection.java:164)
	at org.gradle.internal.remote.internal.hub.MessageHub$Handler.run(MessageHub.java:414)
	at org.gradle.internal.concurrent.ExecutorPolicy$CatchAndRecordFailures.onExecute(ExecutorPolicy.java:64)
	at org.gradle.internal.concurrent.ManagedExecutorImpl$1.run(ManagedExecutorImpl.java:48)
	at java.util.concurrent.ThreadPoolExecutor.runWorker(ThreadPoolExecutor.java:1149)
	at java.util.concurrent.ThreadPoolExecutor$Worker.run(ThreadPoolExecutor.java:624)
	at org.gradle.internal.concurrent.ThreadFactoryImpl$ManagedThreadRunnable.run(ThreadFactoryImpl.java:56)
	at java.lang.Thread.run(Thread.java:748)

> Task :src:dist-check:batchBug62239
Creating summariser <summary>
Created the tree successfully using <https://ci-builds.apache.org/job/JMeter/job/JMeter-trunk/ws/bin/testfiles/Bug62239.jmx>
Starting standalone test @ Tue Sep 01 17:27:24 UTC 2020 (1598981244346)
Waiting for possible Shutdown/StopTestNow/HeapDump/ThreadDump message on port 4445
summary =    108 in 00:00:01 =  213.9/s Avg:     0 Min:     0 Max:     2 Err:     0 (0.00%)
Tidying up ...    @ Tue Sep 01 17:27:25 UTC 2020 (1598981245054)
... end of run
No errors present in the logfile <https://ci-builds.apache.org/job/JMeter/job/JMeter-trunk/ws/bin/Bug62239.log>
(the file is empty)

> Task :src:protocol:http:test
          0.5sec,    1 completed,   0 failed,   0 skipped, org.apache.jmeter.protocol.http.sampler.TestSerializedHTTPSampler
          0.0sec,    1 completed,   0 failed,   0 skipped, org.apache.jmeter.protocol.http.control.TestAuthorization
          0.1sec,    1 completed,   0 failed,   0 skipped, org.apache.jmeter.protocol.http.control.gui.TestHttpTestSampleGui
          0.1sec,    4 completed,   0 failed,   0 skipped, org.apache.jmeter.protocol.http.control.TestCookieManagerThreadIteration
          0.0sec,    2 completed,   0 failed,   0 skipped, org.apache.jmeter.protocol.http.control.TestAuthManagerThreadIteration
          0.1sec,    5 completed,   0 failed,   0 skipped, org.apache.jmeter.protocol.http.control.TestCacheManagerThreadIteration
          0.0sec,    6 completed,   0 failed,   0 skipped, org.apache.jmeter.protocol.http.control.TestAuthManager
          0.1sec,   33 completed,   0 failed,   0 skipped, org.apache.jmeter.protocol.http.control.TestHC4CookieManager
          6.1sec, org.apache.jmeter.protocol.http.control.DnsManagerTest
> badDnsInCustomResolverShouldFailHttpSampler(String, WireMockServer)[1], [1]
HttpClient4
WARNING   6.1sec,    2 completed,   0 failed,   1 skipped, org.apache.jmeter.protocol.http.control.DnsManagerTest
          0.0sec,    6 completed,   0 failed,   0 skipped, org.apache.jmeter.protocol.http.parser.TestHtmlParsingUtils
          0.2sec,    4 completed,   0 failed,   0 skipped, org.apache.jmeter.protocol.http.parser.TestCssParser
          0.0sec,    2 completed,   0 failed,   0 skipped, org.apache.jmeter.protocol.http.parser.TestBaseParser
          0.0sec,    2 completed,   0 failed,   0 skipped, org.apache.jmeter.protocol.http.config.UrlConfigTest
          0.0sec,    3 completed,   0 failed,   0 skipped, org.apache.jmeter.protocol.http.config.MultipartUrlConfigTest
          0.0sec,    6 completed,   0 failed,   0 skipped, org.apache.jmeter.protocol.http.util.accesslog.TestLogFilter
          0.0sec,    4 completed,   0 failed,   0 skipped, org.apache.jmeter.protocol.http.util.accesslog.TestTCLogParser
          0.0sec,    3 completed,   0 failed,   0 skipped, org.apache.jmeter.protocol.http.util.accesslog.TestSessionFilter
          0.0sec,    5 completed,   0 failed,   0 skipped, org.apache.jmeter.protocol.http.util.TestHTTPFileArgs
          0.0sec,    3 completed,   0 failed,   0 skipped, org.apache.jmeter.protocol.http.util.TestHTTPArgument
          0.0sec,    3 completed,   0 failed,   0 skipped, org.apache.jmeter.protocol.http.util.TestHTTPFileArg

> Task :src:dist-check:batchFTP_TESTS
Creating summariser <summary>
Created the tree successfully using <https://ci-builds.apache.org/job/JMeter/job/JMeter-trunk/ws/bin/testfiles/FTP_TESTS.jmx>
Starting standalone test @ Tue Sep 01 17:27:27 UTC 2020 (1598981247163)
Waiting for possible Shutdown/StopTestNow/HeapDump/ThreadDump message on port 4445
summary +      2 in 00:00:03 =    0.8/s Avg:   711 Min:    73 Max:  1350 Err:     0 (0.00%)
Active: 1 Started: 1 Finished: 0
summary +      4 in 00:00:00 =   22.9/s Avg:    40 Min:    11 Max:    83 Err:     0 (0.00%)
Active: 0 Started: 1 Finished: 1
summary =      6 in 00:00:03 =    2.2/s Avg:   263 Min:    11 Max:  1350 Err:     0 (0.00%)
Tidying up ...    @ Tue Sep 01 17:27:31 UTC 2020 (1598981251091)
... end of run
No errors present in the logfile <https://ci-builds.apache.org/job/JMeter/job/JMeter-trunk/ws/bin/FTP_TESTS.log>
(the file is empty)

> Task :src:protocol:http:test
          0.1sec,    1 completed,   0 failed,   0 skipped, org.apache.jmeter.resources.ResourceKeyUsageTestHttp
          0.0sec,    2 completed,   0 failed,   0 skipped, org.apache.jmeter.testelement.TestHeaderManager
          0.1sec,   57 completed,   0 failed,   0 skipped, org.apache.jmeter.curl.BasicCurlParserTest
          0.0sec,    7 completed,   0 failed,   0 skipped, org.apache.jmeter.protocol.http.visualizers.RequestViewHTTPTest
          0.3sec,   53 completed,   0 failed,   0 skipped, org.apache.jmeter.protocol.http.sampler.TestHTTPSamplersAgainstHttpMirrorServer
WARNING   0.0sec,    2 completed,   0 failed,   2 skipped, org.apache.jmeter.protocol.http.sampler.SamplingNamingTest
          0.9sec,    9 completed,   0 failed,   0 skipped, org.apache.jmeter.protocol.http.control.TestHTTPMirrorThread
          0.5sec,  103 completed,   0 failed,   0 skipped, org.apache.jmeter.protocol.http.parser.TestHTMLParser
          0.0sec,   46 completed,   0 failed,   0 skipped, org.apache.jmeter.protocol.http.parser.TestBug60842HtmlParser
          0.3sec,   58 completed,   0 failed,   0 skipped, org.apache.jmeter.protocol.http.util.HTTPUtilsSpec
WARNING  24.2sec,  620 completed,   0 failed,   3 skipped, Gradle
Test Run :src:protocol:http:test

> Task :src:protocol:http:check

> Task :src:dist-check:batchHTMLParserTestFile_2
Creating summariser <summary>
Created the tree successfully using <https://ci-builds.apache.org/job/JMeter/job/JMeter-trunk/ws/bin/testfiles/HTMLParserTestFile_2.jmx>
Starting standalone test @ Tue Sep 01 17:27:33 UTC 2020 (1598981253496)
Waiting for possible Shutdown/StopTestNow/HeapDump/ThreadDump message on port 4445
summary +      1 in 00:00:00 =    4.1/s Avg:   122 Min:   122 Max:   122 Err:     0 (0.00%)
Active: 1 Started: 1 Finished: 0
summary =      1 in 00:00:00 =    4.1/s Avg:   122 Min:   122 Max:   122 Err:     0 (0.00%)
Tidying up ...    @ Tue Sep 01 17:27:34 UTC 2020 (1598981254329)
... end of run
No errors present in the logfile <https://ci-builds.apache.org/job/JMeter/job/JMeter-trunk/ws/bin/HTMLParserTestFile_2.log>
(the file is empty)

> Task :src:dist-check:batchHttp4ImplDigestAuth SKIPPED

> Task :src:dist-check:batchHttp4ImplPreemptiveBasicAuth
Creating summariser <summary>
Created the tree successfully using <https://ci-builds.apache.org/job/JMeter/job/JMeter-trunk/ws/bin/testfiles/Http4ImplPreemptiveBasicAuth.jmx>
Starting standalone test @ Tue Sep 01 17:27:36 UTC 2020 (1598981256535)
Waiting for possible Shutdown/StopTestNow/HeapDump/ThreadDump message on port 4445
summary =     12 in 00:00:14 =    0.8/s Avg:   870 Min:   170 Max:  5008 Err:     1 (8.33%)
Tidying up ...    @ Tue Sep 01 17:27:51 UTC 2020 (1598981271657)
... end of run
ERROR: unexpected output for Http4ImplPreemptiveBasicAuth.csv:
  - expected 853 bytes, <https://ci-builds.apache.org/job/JMeter/job/JMeter-trunk/ws/bin/testfiles/Http4ImplPreemptiveBasicAuth.csv>
  + actual 945 bytes, <https://ci-builds.apache.org/job/JMeter/job/JMeter-trunk/ws/bin/Http4ImplPreemptiveBasicAuth.csv>
@@ -1,6 +1,6 @@
 label,responseCode,responseMessage,threadName,dataType,success
 HTTP-Request-WithNoMatchingAuth,200,OK,Thread Group 1-1,text,true
-HTTP-Request-WithNoMatchingAuth,200,OK,Thread Group 1-1,text,true
+HTTP-Request-WithNoMatchingAuth,Non HTTP response code: java.net.SocketTimeoutException,Non
HTTP response message: Read timed out,Thread Group 1-1,text,false
 HTTPS-Request-WithNoMatchingAuth,200,OK,Thread Group 2-1,text,true
 HTTPS-Request-WithNoMatchingAuth,200,OK,Thread Group 2-1,text,true
 HTTP-Request-NoAuthManager,200,OK,Thread Group 3-1,text,true
ERROR: unexpected output for Http4ImplPreemptiveBasicAuth.xml:
  - expected 3165 bytes, <https://ci-builds.apache.org/job/JMeter/job/JMeter-trunk/ws/bin/testfiles/Http4ImplPreemptiveBasicAuth.xml>
  + actual 3257 bytes, <https://ci-builds.apache.org/job/JMeter/job/JMeter-trunk/ws/bin/Http4ImplPreemptiveBasicAuth.xml>
@@ -7,7 +7,7 @@
     <error>false</error>
   </assertionResult>
 </httpSample>
-<httpSample s="true" lb="HTTP-Request-WithNoMatchingAuth" rc="200" rm="OK" tn="Thread
Group 1-1" dt="text">
+<httpSample s="false" lb="HTTP-Request-WithNoMatchingAuth" rc="Non HTTP response code:
java.net.SocketTimeoutException" rm="Non HTTP response message: Read timed out" tn="Thread
Group 1-1" dt="text">
   <assertionResult>
     <name>JSA_CheckAuthorization</name>
     <failure>false</failure>
No errors present in the logfile <https://ci-builds.apache.org/job/JMeter/job/JMeter-trunk/ws/bin/Http4ImplPreemptiveBasicAuth.log>
(the file is empty)

> Task :src:dist-check:batchHttp4ImplPreemptiveBasicAuth FAILED

> Task :src:dist:javadocAggregate
9 warnings
checksum-dependency elapsed time: 13061ms, configurations processed: 367 (add -PchecksumTimingsPrint
to print detailed timings)

Build jmeter FAILURE reason:                                
    Execution failed for task ':src:dist-check:batchHttp4ImplPreemptiveBasicAuth':
        Failures detected while testing <https://ci-builds.apache.org/job/JMeter/job/JMeter-trunk/ws/bin/testfiles/Http4ImplPreemptiveBasicAuth.jmx>:
[unexpected output Http4ImplPreemptiveBasicAuth.csv, unexpected output Http4ImplPreemptiveBasicAuth.xml]
            at org.apache.jmeter.buildtools.batchtest.BatchTest.exec(BatchTest.kt:184)
            at org.gradle.internal.reflect.JavaMethod.invoke(JavaMethod.java:104)
            at org.gradle.api.internal.project.taskfactory.StandardTaskAction.doExecute(StandardTaskAction.java:58)
            at org.gradle.api.internal.project.taskfactory.StandardTaskAction.execute(StandardTaskAction.java:51)
            at org.gradle.api.internal.project.taskfactory.StandardTaskAction.execute(StandardTaskAction.java:29)
            at org.gradle.api.internal.tasks.execution.ExecuteActionsTaskExecuter$3.run(ExecuteActionsTaskExecuter.java:570)
            at org.gradle.internal.operations.DefaultBuildOperationExecutor$RunnableBuildOperationWorker.execute(DefaultBuildOperationExecutor.java:395)
            at org.gradle.internal.operations.DefaultBuildOperationExecutor$RunnableBuildOperationWorker.execute(DefaultBuildOperationExecutor.java:387)
            at org.gradle.internal.operations.DefaultBuildOperationExecutor$1.execute(DefaultBuildOperationExecutor.java:157)
            at org.gradle.internal.operations.DefaultBuildOperationExecutor.execute(DefaultBuildOperationExecutor.java:242)
            at org.gradle.internal.operations.DefaultBuildOperationExecutor.execute(DefaultBuildOperationExecutor.java:150)
            at org.gradle.internal.operations.DefaultBuildOperationExecutor.run(DefaultBuildOperationExecutor.java:84)
            at org.gradle.internal.operations.DelegatingBuildOperationExecutor.run(DelegatingBuildOperationExecutor.java:31)
            at org.gradle.api.internal.tasks.execution.ExecuteActionsTaskExecuter.executeAction(ExecuteActionsTaskExecuter.java:555)
            at org.gradle.api.internal.tasks.execution.ExecuteActionsTaskExecuter.executeActions(ExecuteActionsTaskExecuter.java:538)
            at org.gradle.api.internal.tasks.execution.ExecuteActionsTaskExecuter.access$300(ExecuteActionsTaskExecuter.java:109)
            at org.gradle.api.internal.tasks.execution.ExecuteActionsTaskExecuter$TaskExecution.executeWithPreviousOutputFiles(ExecuteActionsTaskExecuter.java:279)
            at org.gradle.api.internal.tasks.execution.ExecuteActionsTaskExecuter$TaskExecution.execute(ExecuteActionsTaskExecuter.java:268)
            at org.gradle.internal.execution.steps.ExecuteStep.lambda$execute$1(ExecuteStep.java:33)
            at org.gradle.internal.execution.steps.ExecuteStep.execute(ExecuteStep.java:33)
            at org.gradle.internal.execution.steps.ExecuteStep.execute(ExecuteStep.java:26)
            at org.gradle.internal.execution.steps.CleanupOutputsStep.execute(CleanupOutputsStep.java:67)
            at org.gradle.internal.execution.steps.CleanupOutputsStep.execute(CleanupOutputsStep.java:36)
            at org.gradle.internal.execution.steps.ResolveInputChangesStep.execute(ResolveInputChangesStep.java:49)
            at org.gradle.internal.execution.steps.ResolveInputChangesStep.execute(ResolveInputChangesStep.java:34)
            at org.gradle.internal.execution.steps.CancelExecutionStep.execute(CancelExecutionStep.java:43)
            at org.gradle.internal.execution.steps.TimeoutStep.executeWithoutTimeout(TimeoutStep.java:73)
            at org.gradle.internal.execution.steps.TimeoutStep.execute(TimeoutStep.java:54)
            at org.gradle.internal.execution.steps.CatchExceptionStep.execute(CatchExceptionStep.java:34)
            at org.gradle.internal.execution.steps.CreateOutputsStep.execute(CreateOutputsStep.java:44)
            at org.gradle.internal.execution.steps.SnapshotOutputsStep.execute(SnapshotOutputsStep.java:54)
            at org.gradle.internal.execution.steps.SnapshotOutputsStep.execute(SnapshotOutputsStep.java:38)
            at org.gradle.internal.execution.steps.BroadcastChangingOutputsStep.execute(BroadcastChangingOutputsStep.java:49)
            at org.gradle.internal.execution.steps.CacheStep.executeWithoutCache(CacheStep.java:159)
            at org.gradle.internal.execution.steps.CacheStep.execute(CacheStep.java:72)
            at org.gradle.internal.execution.steps.CacheStep.execute(CacheStep.java:43)
            at org.gradle.internal.execution.steps.StoreExecutionStateStep.execute(StoreExecutionStateStep.java:44)
            at org.gradle.internal.execution.steps.StoreExecutionStateStep.execute(StoreExecutionStateStep.java:33)
            at org.gradle.internal.execution.steps.RecordOutputsStep.execute(RecordOutputsStep.java:38)
            at org.gradle.internal.execution.steps.RecordOutputsStep.execute(RecordOutputsStep.java:24)
            at org.gradle.internal.execution.steps.SkipUpToDateStep.executeBecause(SkipUpToDateStep.java:92)
            at org.gradle.internal.execution.steps.SkipUpToDateStep.lambda$execute$0(SkipUpToDateStep.java:85)
            at org.gradle.internal.execution.steps.SkipUpToDateStep.execute(SkipUpToDateStep.java:55)
            at org.gradle.internal.execution.steps.SkipUpToDateStep.execute(SkipUpToDateStep.java:39)
            at org.gradle.internal.execution.steps.ResolveChangesStep.execute(ResolveChangesStep.java:76)
            at org.gradle.internal.execution.steps.ResolveChangesStep.execute(ResolveChangesStep.java:37)
            at org.gradle.internal.execution.steps.legacy.MarkSnapshottingInputsFinishedStep.execute(MarkSnapshottingInputsFinishedStep.java:36)
            at org.gradle.internal.execution.steps.legacy.MarkSnapshottingInputsFinishedStep.execute(MarkSnapshottingInputsFinishedStep.java:26)
            at org.gradle.internal.execution.steps.ResolveCachingStateStep.execute(ResolveCachingStateStep.java:94)
            at org.gradle.internal.execution.steps.ResolveCachingStateStep.execute(ResolveCachingStateStep.java:49)
            at org.gradle.internal.execution.steps.CaptureStateBeforeExecutionStep.execute(CaptureStateBeforeExecutionStep.java:79)
            at org.gradle.internal.execution.steps.CaptureStateBeforeExecutionStep.execute(CaptureStateBeforeExecutionStep.java:53)
            at org.gradle.internal.execution.steps.ValidateStep.execute(ValidateStep.java:74)
            at org.gradle.internal.execution.steps.SkipEmptyWorkStep.lambda$execute$2(SkipEmptyWorkStep.java:78)
            at org.gradle.internal.execution.steps.SkipEmptyWorkStep.execute(SkipEmptyWorkStep.java:78)
            at org.gradle.internal.execution.steps.SkipEmptyWorkStep.execute(SkipEmptyWorkStep.java:34)
            at org.gradle.internal.execution.steps.legacy.MarkSnapshottingInputsStartedStep.execute(MarkSnapshottingInputsStartedStep.java:39)
            at org.gradle.internal.execution.steps.LoadExecutionStateStep.execute(LoadExecutionStateStep.java:40)
            at org.gradle.internal.execution.steps.LoadExecutionStateStep.execute(LoadExecutionStateStep.java:28)


FAILURE: Build failed with an exception.

* What went wrong:
Execution failed for task ':src:dist-check:batchHttp4ImplPreemptiveBasicAuth'.
> Failures detected while testing <https://ci-builds.apache.org/job/JMeter/job/JMeter-trunk/ws/bin/testfiles/Http4ImplPreemptiveBasicAuth.jmx>:
[unexpected output Http4ImplPreemptiveBasicAuth.csv, unexpected output Http4ImplPreemptiveBasicAuth.xml]

* Try:
Run with --stacktrace option to get the stack trace. Run with --info or --debug option to
get more log output. Run with --scan to get full insights.

* Get more help at https://help.gradle.org

Deprecated Gradle features were used in this build, making it incompatible with Gradle 7.0.
Use '--warning-mode all' to show the individual deprecation warnings.
See https://docs.gradle.org/6.6/userguide/command_line_interface.html#sec:command_line_warnings

BUILD FAILED in 3m 58s
335 actionable tasks: 167 executed, 168 up-to-date

See the profiling report at: file://<https://ci-builds.apache.org/job/JMeter/job/JMeter-trunk/ws/build/reports/profile/profile-2020-09-01-17-24-06.html>
A fine-grained performance profile is available: use the --scan option.
Build step 'Invoke Gradle script' changed build result to FAILURE
Build step 'Invoke Gradle script' marked build as failure
Xvfb stopping
Archiving artifacts
[Fast Archiver] Compressed 15.49 MB of artifacts by 12.9% relative to #66
Recording test results

Mime
View raw message