jmeter-dev mailing list archives

Site index · List index
Message view « Date » · « Thread »
Top « Date » · « Thread »
From Apache Jenkins Server <jenk...@builds.apache.org>
Subject Build failed in Jenkins: JMeter » JMeter Ubuntu #176
Date Sat, 24 Apr 2021 10:57:05 GMT
See <https://ci-builds.apache.org/job/JMeter/job/JMeter%20Ubuntu/176/display/redirect?page=changes>

Changes:

[Felix Schumacher] JMESPathExtractor writes error log entries if JMESPath filter returns

[Felix Schumacher] JMESPathExtractor Attribute Match No. Required

[Felix Schumacher] JMESPathExtractor writes error log entries if JMESPath filter returns

[Felix Schumacher] JMESPathExtractor writes error log entries if JMESPath filter returns


------------------------------------------
[...truncated 219.96 KB...]
Creating summariser <summary>
Created the tree successfully using <https://ci-builds.apache.org/job/JMeter/job/JMeter%20Ubuntu/ws/bin/testfiles/BatchTestLocal.jmx>
Configuring remote engine: asf944.gq1.ygridcore.net:46397
Starting distributed test with remote engines: [asf944.gq1.ygridcore.net:46397] @ Sat Apr
24 10:56:00 UTC 2021 (1619261760650)

[server] Starting the test on host asf944.gq1.ygridcore.net:46397 @ Sat Apr 24 10:56:03 UTC
2021 (1619261763969)

> Task :src:dist-check:batchServerBatchTestLocal
Remote engines have been started:[asf944.gq1.ygridcore.net:46397]
Waiting for possible Shutdown/StopTestNow/HeapDump/ThreadDump message on port 4445
summary +      1 in 00:00:00 =    5.0/s Avg:     4 Min:     4 Max:     4 Err:     0 (0.00%)
Active: 1 Started: 1 Finished: 0
summary +    131 in 00:00:07 =   20.1/s Avg:     4 Min:     1 Max:    70 Err:    16 (12.21%)
Active: 0 Started: 11 Finished: 11
summary =    132 in 00:00:07 =   19.7/s Avg:     4 Min:     1 Max:    70 Err:    16 (12.12%)
Tidying up remote @ Sat Apr 24 10:56:11 UTC 2021 (1619261771219)

[server] Finished the test on host asf944.gq1.ygridcore.net:46397 @ Sat Apr 24 10:56:11 UTC
2021 (1619261771219) - exit requested.

> Task :src:dist-check:batchServerBatchTestLocal
... end of run
No errors present in the logfile <https://ci-builds.apache.org/job/JMeter/job/JMeter%20Ubuntu/ws/bin/BatchTestLocal.log>
(the file is empty)
No errors present in the logfile <https://ci-builds.apache.org/job/JMeter/job/JMeter%20Ubuntu/ws/bin/BatchTestLocalServer.log>
(the file is empty)

> Task :src:dist-check:batchSlowCharsFeatureHttpClient4 SKIPPED
> Task :src:dist-check:batchSlowCharsFeatureJava SKIPPED
> Task :src:dist-check:batchTCP_TESTS SKIPPED

> Task :src:dist-check:batchTEST_HTTPHttpClient4
Creating summariser <summary>
Created the tree successfully using <https://ci-builds.apache.org/job/JMeter/job/JMeter%20Ubuntu/ws/bin/testfiles/TEST_HTTP.jmx>
Starting standalone test @ Sat Apr 24 10:56:18 UTC 2021 (1619261778964)
Waiting for possible Shutdown/StopTestNow/HeapDump/ThreadDump message on port 4445
summary =     22 in 00:00:02 =   12.8/s Avg:    52 Min:     1 Max:   942 Err:     0 (0.00%)
Tidying up ...    @ Sat Apr 24 10:56:21 UTC 2021 (1619261781039)
... end of run
No errors present in the logfile <https://ci-builds.apache.org/job/JMeter/job/JMeter%20Ubuntu/ws/bin/TEST_HTTP.log>
(the file is empty)

> Task :src:dist-check:batchTEST_HTTPJava
Creating summariser <summary>
Created the tree successfully using <https://ci-builds.apache.org/job/JMeter/job/JMeter%20Ubuntu/ws/bin/testfiles/TEST_HTTP.jmx>
Starting standalone test @ Sat Apr 24 10:56:24 UTC 2021 (1619261784587)
Waiting for possible Shutdown/StopTestNow/HeapDump/ThreadDump message on port 4445
summary =     20 in 00:00:02 =   12.6/s Avg:    55 Min:     1 Max:   936 Err:     0 (0.00%)
Tidying up ...    @ Sat Apr 24 10:56:26 UTC 2021 (1619261786537)
... end of run
WARNING: the task was configured to ignore errors in the output log
Logfile contents (errors during the test, see <https://ci-builds.apache.org/job/JMeter/job/JMeter%20Ubuntu/ws/bin/TEST_HTTP.log)>:
2021-04-24 10:56:26,308 ERROR o.a.j.p.h.s.HTTPJavaImpl: readResponse: java.net.ProtocolException:
Server redirected too many  times (20)
2021-04-24 10:56:26,311 ERROR o.a.j.p.h.s.HTTPJavaImpl: Cause: java.net.ProtocolException:
Server redirected too many  times (20)
2021-04-24 10:56:26,312 ERROR o.a.j.p.h.c.HttpMirrorThread: Invalid request received:''

> Task :src:dist-check:batchTEST_HTTPS
Creating summariser <summary>
Created the tree successfully using <https://ci-builds.apache.org/job/JMeter/job/JMeter%20Ubuntu/ws/bin/testfiles/TEST_HTTPS.jmx>
Starting standalone test @ Sat Apr 24 10:56:29 UTC 2021 (1619261789624)
Waiting for possible Shutdown/StopTestNow/HeapDump/ThreadDump message on port 4445
summary +      1 in 00:00:01 =    1.1/s Avg:   641 Min:   641 Max:   641 Err:     0 (0.00%)
Active: 1 Started: 1 Finished: 0
summary +      1 in 00:00:01 =    0.9/s Avg:  1095 Min:  1095 Max:  1095 Err:     0 (0.00%)
Active: 0 Started: 1 Finished: 1
summary =      2 in 00:00:02 =    1.0/s Avg:   868 Min:   641 Max:  1095 Err:     0 (0.00%)
Tidying up ...    @ Sat Apr 24 10:56:32 UTC 2021 (1619261792120)
... end of run
No errors present in the logfile <https://ci-builds.apache.org/job/JMeter/job/JMeter%20Ubuntu/ws/bin/TEST_HTTPS.log>
(the file is empty)

> Task :src:dist-check:batchTestCookieManager
Creating summariser <summary>
Created the tree successfully using <https://ci-builds.apache.org/job/JMeter/job/JMeter%20Ubuntu/ws/bin/testfiles/TestCookieManager.jmx>
Starting standalone test @ Sat Apr 24 10:56:34 UTC 2021 (1619261794305)
Waiting for possible Shutdown/StopTestNow/HeapDump/ThreadDump message on port 4445
summary =     10 in 00:00:02 =    5.0/s Avg:   157 Min:     1 Max:  1000 Err:     0 (0.00%)
Tidying up ...    @ Sat Apr 24 10:56:37 UTC 2021 (1619261797100)
... end of run
No errors present in the logfile <https://ci-builds.apache.org/job/JMeter/job/JMeter%20Ubuntu/ws/bin/TestCookieManager.log>
(the file is empty)

> Task :src:dist-check:batchTestHeaderManagerHttpClient4
Creating summariser <summary>
Created the tree successfully using <https://ci-builds.apache.org/job/JMeter/job/JMeter%20Ubuntu/ws/bin/testfiles/TestHeaderManager.jmx>
Starting standalone test @ Sat Apr 24 10:56:40 UTC 2021 (1619261800350)
Waiting for possible Shutdown/StopTestNow/HeapDump/ThreadDump message on port 4445
summary =      3 in 00:00:00 =    9.3/s Avg:    11 Min:     0 Max:    32 Err:     0 (0.00%)
Tidying up ...    @ Sat Apr 24 10:56:41 UTC 2021 (1619261801170)
... end of run
No errors present in the logfile <https://ci-builds.apache.org/job/JMeter/job/JMeter%20Ubuntu/ws/bin/TestHeaderManager.log>
(the file is empty)

> Task :src:dist-check:batchTestHeaderManagerJava
Creating summariser <summary>
Created the tree successfully using <https://ci-builds.apache.org/job/JMeter/job/JMeter%20Ubuntu/ws/bin/testfiles/TestHeaderManager.jmx>
Starting standalone test @ Sat Apr 24 10:56:44 UTC 2021 (1619261804409)
Waiting for possible Shutdown/StopTestNow/HeapDump/ThreadDump message on port 4445
summary =      3 in 00:00:00 =   14.9/s Avg:     3 Min:     0 Max:    10 Err:     0 (0.00%)
Tidying up ...    @ Sat Apr 24 10:56:45 UTC 2021 (1619261805177)
... end of run
No errors present in the logfile <https://ci-builds.apache.org/job/JMeter/job/JMeter%20Ubuntu/ws/bin/TestHeaderManager.log>
(the file is empty)

> Task :src:dist-check:batchTestKeepAlive SKIPPED
> Task :src:dist-check:batchTestRedirectionPolicies SKIPPED

> Task :src:dist-check:batchTestResultStatusAction
Creating summariser <summary>
Created the tree successfully using <https://ci-builds.apache.org/job/JMeter/job/JMeter%20Ubuntu/ws/bin/testfiles/TestResultStatusAction.jmx>
Starting standalone test @ Sat Apr 24 10:56:47 UTC 2021 (1619261807639)
Waiting for possible Shutdown/StopTestNow/HeapDump/ThreadDump message on port 4445
summary =    135 in 00:00:02 =   74.7/s Avg:     2 Min:     0 Max:   311 Err:    18 (13.33%)
Tidying up ...    @ Sat Apr 24 10:56:50 UTC 2021 (1619261810554)
... end of run
No errors present in the logfile <https://ci-builds.apache.org/job/JMeter/job/JMeter%20Ubuntu/ws/bin/TestResultStatusAction.log>
(the file is empty)

> Task :src:dist-check:batchTestSchedulerWithTimer
Creating summariser <summary>
Created the tree successfully using <https://ci-builds.apache.org/job/JMeter/job/JMeter%20Ubuntu/ws/bin/testfiles/TestSchedulerWithTimer.jmx>
Starting standalone test @ Sat Apr 24 10:56:52 UTC 2021 (1619261812566)
Waiting for possible Shutdown/StopTestNow/HeapDump/ThreadDump message on port 4445
summary +      5 in 00:00:08 =    0.7/s Avg:   460 Min:     3 Max:  1423 Err:     1 (20.00%)
Active: 1 Started: 1 Finished: 0
summary =      5 in 00:00:08 =    0.7/s Avg:   460 Min:     3 Max:  1423 Err:     1 (20.00%)
Tidying up ...    @ Sat Apr 24 10:57:01 UTC 2021 (1619261821021)
... end of run
ERROR: unexpected output for TestSchedulerWithTimer.csv:
  - expected 57 bytes, <https://ci-builds.apache.org/job/JMeter/job/JMeter%20Ubuntu/ws/bin/testfiles/TestSchedulerWithTimer.csv>
  + actual 58 bytes, <https://ci-builds.apache.org/job/JMeter/job/JMeter%20Ubuntu/ws/bin/TestSchedulerWithTimer.csv>
@@ -1 +1 @@
-JSRCheckDuration,200,tearDown Thread Group 1-1,text,true
+JSRCheckDuration,200,tearDown Thread Group 1-1,text,false
ERROR: unexpected output for TestSchedulerWithTimer.xml:
  - expected 143 bytes, <https://ci-builds.apache.org/job/JMeter/job/JMeter%20Ubuntu/ws/bin/testfiles/TestSchedulerWithTimer.xml>
  + actual 144 bytes, <https://ci-builds.apache.org/job/JMeter/job/JMeter%20Ubuntu/ws/bin/TestSchedulerWithTimer.xml>
@@ -1,5 +1,5 @@
 <?xml version="1.0" encoding="UTF-8"?>
 <testResults version="1.2">
-<sample s="true" lb="JSRCheckDuration" rc="200" dt="text"/>
+<sample s="false" lb="JSRCheckDuration" rc="200" dt="text"/>
 
 </testResults>
Logfile contents (errors during the test, see <https://ci-builds.apache.org/job/JMeter/job/JMeter%20Ubuntu/ws/bin/TestSchedulerWithTimer.log)>:
2021-04-24 10:57:00,974 WARN o.a.j.p.j.s.J.JSRCheckDuration: Duration 6153 exceeded expected
duration of 6000

> Task :src:dist-check:batchTestSchedulerWithTimer FAILED
checksum-dependency elapsed time: 78429ms, configurations processed: 275
    SHA-512 computation time: 5821ms (goes in parallel, it might exceed wall-clock time),
files processed: 33, processed: 19MiB, skipped: 3100MiB
    PGP signature resolution time: 3826ms (wall-clock), resolution requests: 164, signatures
resolved: 249
    PGP key resolution time: 56422ms (wall-clock), resolution requests: 164, download time:
0ms (goes in parallel, it might exceed wall-clock time), keys downloaded: 0
        PGP signature verification time: 111800ms (goes in parallel, it might exceed wall-clock
time), files processed: 560, processed: 520MiB, skipped: 2556MiB

Build jmeter FAILURE reason:                                
    Execution failed for task ':src:dist-check:batchTestSchedulerWithTimer':
        Failures detected while testing <https://ci-builds.apache.org/job/JMeter/job/JMeter%20Ubuntu/ws/bin/testfiles/TestSchedulerWithTimer.jmx>:
[unexpected output TestSchedulerWithTimer.csv, unexpected output TestSchedulerWithTimer.xml,
errors in TestSchedulerWithTimer.log]
            at org.apache.jmeter.buildtools.batchtest.BatchTest.exec(BatchTest.kt:184)
            at org.gradle.internal.reflect.JavaMethod.invoke(JavaMethod.java:104)
            at org.gradle.api.internal.project.taskfactory.StandardTaskAction.doExecute(StandardTaskAction.java:58)
            at org.gradle.api.internal.project.taskfactory.StandardTaskAction.execute(StandardTaskAction.java:51)
            at org.gradle.api.internal.project.taskfactory.StandardTaskAction.execute(StandardTaskAction.java:29)
            at org.gradle.api.internal.tasks.execution.ExecuteActionsTaskExecuter$2.run(ExecuteActionsTaskExecuter.java:494)
            at org.gradle.internal.operations.DefaultBuildOperationRunner$1.execute(DefaultBuildOperationRunner.java:29)
            at org.gradle.internal.operations.DefaultBuildOperationRunner$1.execute(DefaultBuildOperationRunner.java:26)
            at org.gradle.internal.operations.DefaultBuildOperationRunner$3.execute(DefaultBuildOperationRunner.java:75)
            at org.gradle.internal.operations.DefaultBuildOperationRunner$3.execute(DefaultBuildOperationRunner.java:68)
            at org.gradle.internal.operations.DefaultBuildOperationRunner.execute(DefaultBuildOperationRunner.java:153)
            at org.gradle.internal.operations.DefaultBuildOperationRunner.execute(DefaultBuildOperationRunner.java:68)
            at org.gradle.internal.operations.DefaultBuildOperationRunner.run(DefaultBuildOperationRunner.java:56)
            at org.gradle.internal.operations.DefaultBuildOperationExecutor.lambda$run$1(DefaultBuildOperationExecutor.java:71)
            at org.gradle.internal.operations.UnmanagedBuildOperationWrapper.runWithUnmanagedSupport(UnmanagedBuildOperationWrapper.java:45)
            at org.gradle.internal.operations.DefaultBuildOperationExecutor.run(DefaultBuildOperationExecutor.java:71)
            at org.gradle.api.internal.tasks.execution.ExecuteActionsTaskExecuter.executeAction(ExecuteActionsTaskExecuter.java:479)
            at org.gradle.api.internal.tasks.execution.ExecuteActionsTaskExecuter.executeActions(ExecuteActionsTaskExecuter.java:462)
            at org.gradle.api.internal.tasks.execution.ExecuteActionsTaskExecuter.access$400(ExecuteActionsTaskExecuter.java:105)
            at org.gradle.api.internal.tasks.execution.ExecuteActionsTaskExecuter$TaskExecution.executeWithPreviousOutputFiles(ExecuteActionsTaskExecuter.java:273)
            at org.gradle.api.internal.tasks.execution.ExecuteActionsTaskExecuter$TaskExecution.execute(ExecuteActionsTaskExecuter.java:251)
            at org.gradle.internal.execution.steps.ExecuteStep.lambda$executeOperation$1(ExecuteStep.java:66)
            at org.gradle.internal.execution.steps.ExecuteStep.executeOperation(ExecuteStep.java:66)
            at org.gradle.internal.execution.steps.ExecuteStep.access$000(ExecuteStep.java:34)
            at org.gradle.internal.execution.steps.ExecuteStep$1.call(ExecuteStep.java:47)
            at org.gradle.internal.execution.steps.ExecuteStep$1.call(ExecuteStep.java:44)
            at org.gradle.internal.operations.DefaultBuildOperationRunner$CallableBuildOperationWorker.execute(DefaultBuildOperationRunner.java:200)
            at org.gradle.internal.operations.DefaultBuildOperationRunner$CallableBuildOperationWorker.execute(DefaultBuildOperationRunner.java:195)
            at org.gradle.internal.operations.DefaultBuildOperationRunner$3.execute(DefaultBuildOperationRunner.java:75)
            at org.gradle.internal.operations.DefaultBuildOperationRunner$3.execute(DefaultBuildOperationRunner.java:68)
            at org.gradle.internal.operations.DefaultBuildOperationRunner.execute(DefaultBuildOperationRunner.java:153)
            at org.gradle.internal.operations.DefaultBuildOperationRunner.execute(DefaultBuildOperationRunner.java:68)
            at org.gradle.internal.operations.DefaultBuildOperationRunner.call(DefaultBuildOperationRunner.java:62)
            at org.gradle.internal.operations.DefaultBuildOperationExecutor.lambda$call$2(DefaultBuildOperationExecutor.java:76)
            at org.gradle.internal.operations.UnmanagedBuildOperationWrapper.callWithUnmanagedSupport(UnmanagedBuildOperationWrapper.java:54)
            at org.gradle.internal.operations.DefaultBuildOperationExecutor.call(DefaultBuildOperationExecutor.java:76)
            at org.gradle.internal.execution.steps.ExecuteStep.execute(ExecuteStep.java:44)
            at org.gradle.internal.execution.steps.ExecuteStep.execute(ExecuteStep.java:34)
            at org.gradle.internal.execution.steps.RemovePreviousOutputsStep.execute(RemovePreviousOutputsStep.java:72)
            at org.gradle.internal.execution.steps.RemovePreviousOutputsStep.execute(RemovePreviousOutputsStep.java:42)
            at org.gradle.internal.execution.steps.ResolveInputChangesStep.execute(ResolveInputChangesStep.java:53)
            at org.gradle.internal.execution.steps.ResolveInputChangesStep.execute(ResolveInputChangesStep.java:39)
            at org.gradle.internal.execution.steps.CancelExecutionStep.execute(CancelExecutionStep.java:44)
            at org.gradle.internal.execution.steps.TimeoutStep.executeWithoutTimeout(TimeoutStep.java:77)
            at org.gradle.internal.execution.steps.TimeoutStep.execute(TimeoutStep.java:58)
            at org.gradle.internal.execution.steps.CreateOutputsStep.execute(CreateOutputsStep.java:54)
            at org.gradle.internal.execution.steps.CreateOutputsStep.execute(CreateOutputsStep.java:32)
            at org.gradle.internal.execution.steps.CaptureStateAfterExecutionStep.execute(CaptureStateAfterExecutionStep.java:57)
            at org.gradle.internal.execution.steps.CaptureStateAfterExecutionStep.execute(CaptureStateAfterExecutionStep.java:38)
            at org.gradle.internal.execution.steps.BroadcastChangingOutputsStep.execute(BroadcastChangingOutputsStep.java:63)
            at org.gradle.internal.execution.steps.BroadcastChangingOutputsStep.execute(BroadcastChangingOutputsStep.java:30)
            at org.gradle.internal.execution.steps.BuildCacheStep.executeWithoutCache(BuildCacheStep.java:176)
            at org.gradle.internal.execution.steps.BuildCacheStep.execute(BuildCacheStep.java:76)
            at org.gradle.internal.execution.steps.BuildCacheStep.execute(BuildCacheStep.java:47)
            at org.gradle.internal.execution.steps.StoreExecutionStateStep.execute(StoreExecutionStateStep.java:43)
            at org.gradle.internal.execution.steps.StoreExecutionStateStep.execute(StoreExecutionStateStep.java:32)
            at org.gradle.internal.execution.steps.RecordOutputsStep.execute(RecordOutputsStep.java:39)
            at org.gradle.internal.execution.steps.RecordOutputsStep.execute(RecordOutputsStep.java:25)
            at org.gradle.internal.execution.steps.SkipUpToDateStep.executeBecause(SkipUpToDateStep.java:102)
            at org.gradle.internal.execution.steps.SkipUpToDateStep.lambda$execute$0(SkipUpToDateStep.java:95)
            at org.gradle.internal.execution.steps.SkipUpToDateStep.execute(SkipUpToDateStep.java:55)
            at org.gradle.internal.execution.steps.SkipUpToDateStep.execute(SkipUpToDateStep.java:39)
            at org.gradle.internal.execution.steps.ResolveChangesStep.execute(ResolveChangesStep.java:83)
            at org.gradle.internal.execution.steps.ResolveChangesStep.execute(ResolveChangesStep.java:44)
            at org.gradle.internal.execution.steps.legacy.MarkSnapshottingInputsFinishedStep.execute(MarkSnapshottingInputsFinishedStep.java:37)
            at org.gradle.internal.execution.steps.legacy.MarkSnapshottingInputsFinishedStep.execute(MarkSnapshottingInputsFinishedStep.java:27)
            at org.gradle.internal.execution.steps.ResolveCachingStateStep.execute(ResolveCachingStateStep.java:96)
            at org.gradle.internal.execution.steps.ResolveCachingStateStep.execute(ResolveCachingStateStep.java:52)
            at org.gradle.internal.execution.steps.CaptureStateBeforeExecutionStep.execute(CaptureStateBeforeExecutionStep.java:83)
            at org.gradle.internal.execution.steps.CaptureStateBeforeExecutionStep.execute(CaptureStateBeforeExecutionStep.java:54)
            at org.gradle.internal.execution.steps.ValidateStep.execute(ValidateStep.java:74)
            at org.gradle.internal.execution.steps.SkipEmptyWorkStep.lambda$execute$2(SkipEmptyWorkStep.java:88)
            at org.gradle.internal.execution.steps.SkipEmptyWorkStep.execute(SkipEmptyWorkStep.java:88)
            at org.gradle.internal.execution.steps.SkipEmptyWorkStep.execute(SkipEmptyWorkStep.java:34)
            at org.gradle.internal.execution.steps.legacy.MarkSnapshottingInputsStartedStep.execute(MarkSnapshottingInputsStartedStep.java:38)
            at org.gradle.internal.execution.steps.LoadExecutionStateStep.execute(LoadExecutionStateStep.java:46)
            at org.gradle.internal.execution.steps.LoadExecutionStateStep.execute(LoadExecutionStateStep.java:34)
            at org.gradle.internal.execution.steps.AssignWorkspaceStep.lambda$execute$0(AssignWorkspaceStep.java:43)
            at org.gradle.api.internal.tasks.execution.ExecuteActionsTaskExecuter$TaskExecution$3.withWorkspace(ExecuteActionsTaskExecuter.java:286)
            at org.gradle.internal.execution.steps.AssignWorkspaceStep.execute(AssignWorkspaceStep.java:43)
            at org.gradle.internal.execution.steps.AssignWorkspaceStep.execute(AssignWorkspaceStep.java:33)
            at org.gradle.internal.execution.steps.IdentityCacheStep.execute(IdentityCacheStep.java:40)
            at org.gradle.internal.execution.steps.IdentityCacheStep.execute(IdentityCacheStep.java:30)
            at org.gradle.internal.execution.steps.IdentifyStep.execute(IdentifyStep.java:54)
            at org.gradle.internal.execution.steps.IdentifyStep.execute(IdentifyStep.java:40)


FAILURE: Build failed with an exception.

* What went wrong:
Execution failed for task ':src:dist-check:batchTestSchedulerWithTimer'.
> Failures detected while testing <https://ci-builds.apache.org/job/JMeter/job/JMeter%20Ubuntu/ws/bin/testfiles/TestSchedulerWithTimer.jmx>:
[unexpected output TestSchedulerWithTimer.csv, unexpected output TestSchedulerWithTimer.xml,
errors in TestSchedulerWithTimer.log]

* Try:
Run with --stacktrace option to get the stack trace. Run with --info or --debug option to
get more log output. Run with --scan to get full insights.

* Get more help at https://help.gradle.org

Deprecated Gradle features were used in this build, making it incompatible with Gradle 7.0.
Use '--warning-mode all' to show the individual deprecation warnings.
See https://docs.gradle.org/6.8.1/userguide/command_line_interface.html#sec:command_line_warnings

BUILD FAILED in 6m 35s
259 actionable tasks: 128 executed, 131 up-to-date
Build step 'Invoke Gradle script' changed build result to FAILURE
Build step 'Invoke Gradle script' marked build as failure

Mime
View raw message