jmeter-dev mailing list archives

Site index · List index
Message view « Date » · « Thread »
Top « Date » · « Thread »
From Apache Jenkins Server <jenk...@builds.apache.org>
Subject Build failed in Jenkins: JMeter » JMeter-trunk #252
Date Sat, 24 Apr 2021 10:27:00 GMT
See <https://ci-builds.apache.org/job/JMeter/job/JMeter-trunk/252/display/redirect?page=changes>

Changes:

[Felix Schumacher] JMESPathExtractor writes error log entries if JMESPath filter returns empty
result


------------------------------------------
[...truncated 134.36 KB...]
> Task :src:protocol:bolt:spotbugsMain

> Task :src:jorphan:test
         12.1sec, org.apache.jorphan.exec.TestKeyToolUtils > testDNSNameBasedCert()

> Task :src:protocol:native:spotbugsMain
1 SpotBugs violations were found. See the report at: file://<https://ci-builds.apache.org/job/JMeter/job/JMeter-trunk/ws/src/protocol/native/build/reports/spotbugs/main.xml>

org.gradle.api.GradleException: 1 SpotBugs violations were found. See the report at: file://<https://ci-builds.apache.org/job/JMeter/job/JMeter-trunk/ws/src/protocol/native/build/reports/spotbugs/main.xml>
	at com.github.spotbugs.snom.internal.SpotBugsRunnerForWorker$SpotBugsExecutor.execute(SpotBugsRunnerForWorker.java:115)
	at org.gradle.workers.internal.DefaultWorkerServer.execute(DefaultWorkerServer.java:63)
	at org.gradle.workers.internal.AbstractClassLoaderWorker$1.create(AbstractClassLoaderWorker.java:49)
	at org.gradle.workers.internal.AbstractClassLoaderWorker$1.create(AbstractClassLoaderWorker.java:43)
	at org.gradle.internal.classloader.ClassLoaderUtils.executeInClassloader(ClassLoaderUtils.java:97)
	at org.gradle.workers.internal.AbstractClassLoaderWorker.executeInClassLoader(AbstractClassLoaderWorker.java:43)
	at org.gradle.workers.internal.IsolatedClassloaderWorker.run(IsolatedClassloaderWorker.java:49)
	at org.gradle.workers.internal.IsolatedClassloaderWorker.run(IsolatedClassloaderWorker.java:30)
	at org.gradle.workers.internal.WorkerDaemonServer.run(WorkerDaemonServer.java:85)
	at org.gradle.workers.internal.WorkerDaemonServer.run(WorkerDaemonServer.java:55)
	at org.gradle.process.internal.worker.request.WorkerAction$1.call(WorkerAction.java:138)
	at org.gradle.process.internal.worker.child.WorkerLogEventListener.withWorkerLoggingProtocol(WorkerLogEventListener.java:41)
	at org.gradle.process.internal.worker.request.WorkerAction.run(WorkerAction.java:135)
	at sun.reflect.NativeMethodAccessorImpl.invoke0(Native Method)
	at sun.reflect.NativeMethodAccessorImpl.invoke(NativeMethodAccessorImpl.java:62)
	at sun.reflect.DelegatingMethodAccessorImpl.invoke(DelegatingMethodAccessorImpl.java:43)
	at java.lang.reflect.Method.invoke(Method.java:498)
	at org.gradle.internal.dispatch.ReflectionDispatch.dispatch(ReflectionDispatch.java:36)
	at org.gradle.internal.dispatch.ReflectionDispatch.dispatch(ReflectionDispatch.java:24)
	at org.gradle.internal.remote.internal.hub.MessageHubBackedObjectConnection$DispatchWrapper.dispatch(MessageHubBackedObjectConnection.java:182)
	at org.gradle.internal.remote.internal.hub.MessageHubBackedObjectConnection$DispatchWrapper.dispatch(MessageHubBackedObjectConnection.java:164)
	at org.gradle.internal.remote.internal.hub.MessageHub$Handler.run(MessageHub.java:414)
	at org.gradle.internal.concurrent.ExecutorPolicy$CatchAndRecordFailures.onExecute(ExecutorPolicy.java:64)
	at org.gradle.internal.concurrent.ManagedExecutorImpl$1.run(ManagedExecutorImpl.java:48)
	at java.util.concurrent.ThreadPoolExecutor.runWorker(ThreadPoolExecutor.java:1149)
	at java.util.concurrent.ThreadPoolExecutor$Worker.run(ThreadPoolExecutor.java:624)
	at org.gradle.internal.concurrent.ThreadFactoryImpl$ManagedThreadRunnable.run(ThreadFactoryImpl.java:56)
	at java.lang.Thread.run(Thread.java:748)

> Task :src:protocol:ftp:spotbugsMain
1 SpotBugs violations were found. See the report at: file://<https://ci-builds.apache.org/job/JMeter/job/JMeter-trunk/ws/src/protocol/ftp/build/reports/spotbugs/main.xml>

org.gradle.api.GradleException: 1 SpotBugs violations were found. See the report at: file://<https://ci-builds.apache.org/job/JMeter/job/JMeter-trunk/ws/src/protocol/ftp/build/reports/spotbugs/main.xml>
	at com.github.spotbugs.snom.internal.SpotBugsRunnerForWorker$SpotBugsExecutor.execute(SpotBugsRunnerForWorker.java:115)
	at org.gradle.workers.internal.DefaultWorkerServer.execute(DefaultWorkerServer.java:63)
	at org.gradle.workers.internal.AbstractClassLoaderWorker$1.create(AbstractClassLoaderWorker.java:49)
	at org.gradle.workers.internal.AbstractClassLoaderWorker$1.create(AbstractClassLoaderWorker.java:43)
	at org.gradle.internal.classloader.ClassLoaderUtils.executeInClassloader(ClassLoaderUtils.java:97)
	at org.gradle.workers.internal.AbstractClassLoaderWorker.executeInClassLoader(AbstractClassLoaderWorker.java:43)
	at org.gradle.workers.internal.IsolatedClassloaderWorker.run(IsolatedClassloaderWorker.java:49)
	at org.gradle.workers.internal.IsolatedClassloaderWorker.run(IsolatedClassloaderWorker.java:30)
	at org.gradle.workers.internal.WorkerDaemonServer.run(WorkerDaemonServer.java:85)
	at org.gradle.workers.internal.WorkerDaemonServer.run(WorkerDaemonServer.java:55)
	at org.gradle.process.internal.worker.request.WorkerAction$1.call(WorkerAction.java:138)
	at org.gradle.process.internal.worker.child.WorkerLogEventListener.withWorkerLoggingProtocol(WorkerLogEventListener.java:41)
	at org.gradle.process.internal.worker.request.WorkerAction.run(WorkerAction.java:135)
	at sun.reflect.NativeMethodAccessorImpl.invoke0(Native Method)
	at sun.reflect.NativeMethodAccessorImpl.invoke(NativeMethodAccessorImpl.java:62)
	at sun.reflect.DelegatingMethodAccessorImpl.invoke(DelegatingMethodAccessorImpl.java:43)
	at java.lang.reflect.Method.invoke(Method.java:498)
	at org.gradle.internal.dispatch.ReflectionDispatch.dispatch(ReflectionDispatch.java:36)
	at org.gradle.internal.dispatch.ReflectionDispatch.dispatch(ReflectionDispatch.java:24)
	at org.gradle.internal.remote.internal.hub.MessageHubBackedObjectConnection$DispatchWrapper.dispatch(MessageHubBackedObjectConnection.java:182)
	at org.gradle.internal.remote.internal.hub.MessageHubBackedObjectConnection$DispatchWrapper.dispatch(MessageHubBackedObjectConnection.java:164)
	at org.gradle.internal.remote.internal.hub.MessageHub$Handler.run(MessageHub.java:414)
	at org.gradle.internal.concurrent.ExecutorPolicy$CatchAndRecordFailures.onExecute(ExecutorPolicy.java:64)
	at org.gradle.internal.concurrent.ManagedExecutorImpl$1.run(ManagedExecutorImpl.java:48)
	at java.util.concurrent.ThreadPoolExecutor.runWorker(ThreadPoolExecutor.java:1149)
	at java.util.concurrent.ThreadPoolExecutor$Worker.run(ThreadPoolExecutor.java:624)
	at org.gradle.internal.concurrent.ThreadFactoryImpl$ManagedThreadRunnable.run(ThreadFactoryImpl.java:56)
	at java.lang.Thread.run(Thread.java:748)

> Task :src:protocol:junit:spotbugsMain
1 SpotBugs violations were found. See the report at: file://<https://ci-builds.apache.org/job/JMeter/job/JMeter-trunk/ws/src/protocol/junit/build/reports/spotbugs/main.xml>

org.gradle.api.GradleException: 1 SpotBugs violations were found. See the report at: file://<https://ci-builds.apache.org/job/JMeter/job/JMeter-trunk/ws/src/protocol/junit/build/reports/spotbugs/main.xml>
	at com.github.spotbugs.snom.internal.SpotBugsRunnerForWorker$SpotBugsExecutor.execute(SpotBugsRunnerForWorker.java:115)
	at org.gradle.workers.internal.DefaultWorkerServer.execute(DefaultWorkerServer.java:63)
	at org.gradle.workers.internal.AbstractClassLoaderWorker$1.create(AbstractClassLoaderWorker.java:49)
	at org.gradle.workers.internal.AbstractClassLoaderWorker$1.create(AbstractClassLoaderWorker.java:43)
	at org.gradle.internal.classloader.ClassLoaderUtils.executeInClassloader(ClassLoaderUtils.java:97)
	at org.gradle.workers.internal.AbstractClassLoaderWorker.executeInClassLoader(AbstractClassLoaderWorker.java:43)
	at org.gradle.workers.internal.IsolatedClassloaderWorker.run(IsolatedClassloaderWorker.java:49)
	at org.gradle.workers.internal.IsolatedClassloaderWorker.run(IsolatedClassloaderWorker.java:30)
	at org.gradle.workers.internal.WorkerDaemonServer.run(WorkerDaemonServer.java:85)
	at org.gradle.workers.internal.WorkerDaemonServer.run(WorkerDaemonServer.java:55)
	at org.gradle.process.internal.worker.request.WorkerAction$1.call(WorkerAction.java:138)
	at org.gradle.process.internal.worker.child.WorkerLogEventListener.withWorkerLoggingProtocol(WorkerLogEventListener.java:41)
	at org.gradle.process.internal.worker.request.WorkerAction.run(WorkerAction.java:135)
	at sun.reflect.NativeMethodAccessorImpl.invoke0(Native Method)
	at sun.reflect.NativeMethodAccessorImpl.invoke(NativeMethodAccessorImpl.java:62)
	at sun.reflect.DelegatingMethodAccessorImpl.invoke(DelegatingMethodAccessorImpl.java:43)
	at java.lang.reflect.Method.invoke(Method.java:498)
	at org.gradle.internal.dispatch.ReflectionDispatch.dispatch(ReflectionDispatch.java:36)
	at org.gradle.internal.dispatch.ReflectionDispatch.dispatch(ReflectionDispatch.java:24)
	at org.gradle.internal.remote.internal.hub.MessageHubBackedObjectConnection$DispatchWrapper.dispatch(MessageHubBackedObjectConnection.java:182)
	at org.gradle.internal.remote.internal.hub.MessageHubBackedObjectConnection$DispatchWrapper.dispatch(MessageHubBackedObjectConnection.java:164)
	at org.gradle.internal.remote.internal.hub.MessageHub$Handler.run(MessageHub.java:414)
	at org.gradle.internal.concurrent.ExecutorPolicy$CatchAndRecordFailures.onExecute(ExecutorPolicy.java:64)
	at org.gradle.internal.concurrent.ManagedExecutorImpl$1.run(ManagedExecutorImpl.java:48)
	at java.util.concurrent.ThreadPoolExecutor.runWorker(ThreadPoolExecutor.java:1149)
	at java.util.concurrent.ThreadPoolExecutor$Worker.run(ThreadPoolExecutor.java:624)
	at org.gradle.internal.concurrent.ThreadFactoryImpl$ManagedThreadRunnable.run(ThreadFactoryImpl.java:56)
	at java.lang.Thread.run(Thread.java:748)

> Task :src:protocol:tcp:spotbugsMain
1 SpotBugs violations were found. See the report at: file://<https://ci-builds.apache.org/job/JMeter/job/JMeter-trunk/ws/src/protocol/tcp/build/reports/spotbugs/main.xml>

org.gradle.api.GradleException: 1 SpotBugs violations were found. See the report at: file://<https://ci-builds.apache.org/job/JMeter/job/JMeter-trunk/ws/src/protocol/tcp/build/reports/spotbugs/main.xml>
	at com.github.spotbugs.snom.internal.SpotBugsRunnerForWorker$SpotBugsExecutor.execute(SpotBugsRunnerForWorker.java:115)
	at org.gradle.workers.internal.DefaultWorkerServer.execute(DefaultWorkerServer.java:63)
	at org.gradle.workers.internal.AbstractClassLoaderWorker$1.create(AbstractClassLoaderWorker.java:49)
	at org.gradle.workers.internal.AbstractClassLoaderWorker$1.create(AbstractClassLoaderWorker.java:43)
	at org.gradle.internal.classloader.ClassLoaderUtils.executeInClassloader(ClassLoaderUtils.java:97)
	at org.gradle.workers.internal.AbstractClassLoaderWorker.executeInClassLoader(AbstractClassLoaderWorker.java:43)
	at org.gradle.workers.internal.IsolatedClassloaderWorker.run(IsolatedClassloaderWorker.java:49)
	at org.gradle.workers.internal.IsolatedClassloaderWorker.run(IsolatedClassloaderWorker.java:30)
	at org.gradle.workers.internal.WorkerDaemonServer.run(WorkerDaemonServer.java:85)
	at org.gradle.workers.internal.WorkerDaemonServer.run(WorkerDaemonServer.java:55)
	at org.gradle.process.internal.worker.request.WorkerAction$1.call(WorkerAction.java:138)
	at org.gradle.process.internal.worker.child.WorkerLogEventListener.withWorkerLoggingProtocol(WorkerLogEventListener.java:41)
	at org.gradle.process.internal.worker.request.WorkerAction.run(WorkerAction.java:135)
	at sun.reflect.NativeMethodAccessorImpl.invoke0(Native Method)
	at sun.reflect.NativeMethodAccessorImpl.invoke(NativeMethodAccessorImpl.java:62)
	at sun.reflect.DelegatingMethodAccessorImpl.invoke(DelegatingMethodAccessorImpl.java:43)
	at java.lang.reflect.Method.invoke(Method.java:498)
	at org.gradle.internal.dispatch.ReflectionDispatch.dispatch(ReflectionDispatch.java:36)
	at org.gradle.internal.dispatch.ReflectionDispatch.dispatch(ReflectionDispatch.java:24)
	at org.gradle.internal.remote.internal.hub.MessageHubBackedObjectConnection$DispatchWrapper.dispatch(MessageHubBackedObjectConnection.java:182)
	at org.gradle.internal.remote.internal.hub.MessageHubBackedObjectConnection$DispatchWrapper.dispatch(MessageHubBackedObjectConnection.java:164)
	at org.gradle.internal.remote.internal.hub.MessageHub$Handler.run(MessageHub.java:414)
	at org.gradle.internal.concurrent.ExecutorPolicy$CatchAndRecordFailures.onExecute(ExecutorPolicy.java:64)
	at org.gradle.internal.concurrent.ManagedExecutorImpl$1.run(ManagedExecutorImpl.java:48)
	at java.util.concurrent.ThreadPoolExecutor.runWorker(ThreadPoolExecutor.java:1149)
	at java.util.concurrent.ThreadPoolExecutor$Worker.run(ThreadPoolExecutor.java:624)
	at org.gradle.internal.concurrent.ThreadFactoryImpl$ManagedThreadRunnable.run(ThreadFactoryImpl.java:56)
	at java.lang.Thread.run(Thread.java:748)

> Task :src:jorphan:test
          9.3sec, org.apache.jorphan.exec.TestKeyToolUtils > testIPBasedCert()
         38.8sec,    3 completed,   0 failed,   0 skipped, org.apache.jorphan.exec.TestKeyToolUtils
          0.0sec,    5 completed,   0 failed,   0 skipped, org.apache.jorphan.collections.PackageTest
          0.1sec,    4 completed,   0 failed,   0 skipped, org.apache.jorphan.reflect.TestClassTools
WARNING   0.0sec,   10 completed,   0 failed,   2 skipped, org.apache.jorphan.math.TestStatCalculator
          0.1sec,    8 completed,   0 failed,   0 skipped, org.apache.jorphan.util.TestConverter
          0.1sec,   50 completed,   0 failed,   0 skipped, org.apache.jorphan.util.TestJorphanUtils
          0.4sec,   28 completed,   0 failed,   0 skipped, org.apache.jorphan.util.TestAlphaNumericKeyComparator
          0.2sec,   37 completed,   0 failed,   0 skipped, org.apache.commons.cli.avalon.ClutilTestCase
          0.6sec,    5 completed,   0 failed,   0 skipped, org.apache.jorphan.gui.MinMaxLongRendererTest
          0.5sec,   16 completed,   0 failed,   0 skipped, org.apache.jorphan.io.TextFileSpec
          0.3sec,   58 completed,   0 failed,   0 skipped, org.apache.jorphan.util.ConverterSpec
WARNING  45.6sec,  256 completed,   0 failed,   2 skipped, Gradle
Test Run :src:jorphan:test

> Task :src:protocol:mail:spotbugsMain
1 SpotBugs violations were found. See the report at: file://<https://ci-builds.apache.org/job/JMeter/job/JMeter-trunk/ws/src/protocol/mail/build/reports/spotbugs/main.xml>

org.gradle.api.GradleException: 1 SpotBugs violations were found. See the report at: file://<https://ci-builds.apache.org/job/JMeter/job/JMeter-trunk/ws/src/protocol/mail/build/reports/spotbugs/main.xml>
	at com.github.spotbugs.snom.internal.SpotBugsRunnerForWorker$SpotBugsExecutor.execute(SpotBugsRunnerForWorker.java:115)
	at org.gradle.workers.internal.DefaultWorkerServer.execute(DefaultWorkerServer.java:63)
	at org.gradle.workers.internal.AbstractClassLoaderWorker$1.create(AbstractClassLoaderWorker.java:49)
	at org.gradle.workers.internal.AbstractClassLoaderWorker$1.create(AbstractClassLoaderWorker.java:43)
	at org.gradle.internal.classloader.ClassLoaderUtils.executeInClassloader(ClassLoaderUtils.java:97)
	at org.gradle.workers.internal.AbstractClassLoaderWorker.executeInClassLoader(AbstractClassLoaderWorker.java:43)
	at org.gradle.workers.internal.IsolatedClassloaderWorker.run(IsolatedClassloaderWorker.java:49)
	at org.gradle.workers.internal.IsolatedClassloaderWorker.run(IsolatedClassloaderWorker.java:30)
	at org.gradle.workers.internal.WorkerDaemonServer.run(WorkerDaemonServer.java:85)
	at org.gradle.workers.internal.WorkerDaemonServer.run(WorkerDaemonServer.java:55)
	at org.gradle.process.internal.worker.request.WorkerAction$1.call(WorkerAction.java:138)
	at org.gradle.process.internal.worker.child.WorkerLogEventListener.withWorkerLoggingProtocol(WorkerLogEventListener.java:41)
	at org.gradle.process.internal.worker.request.WorkerAction.run(WorkerAction.java:135)
	at sun.reflect.NativeMethodAccessorImpl.invoke0(Native Method)
	at sun.reflect.NativeMethodAccessorImpl.invoke(NativeMethodAccessorImpl.java:62)
	at sun.reflect.DelegatingMethodAccessorImpl.invoke(DelegatingMethodAccessorImpl.java:43)
	at java.lang.reflect.Method.invoke(Method.java:498)
	at org.gradle.internal.dispatch.ReflectionDispatch.dispatch(ReflectionDispatch.java:36)
	at org.gradle.internal.dispatch.ReflectionDispatch.dispatch(ReflectionDispatch.java:24)
	at org.gradle.internal.remote.internal.hub.MessageHubBackedObjectConnection$DispatchWrapper.dispatch(MessageHubBackedObjectConnection.java:182)
	at org.gradle.internal.remote.internal.hub.MessageHubBackedObjectConnection$DispatchWrapper.dispatch(MessageHubBackedObjectConnection.java:164)
	at org.gradle.internal.remote.internal.hub.MessageHub$Handler.run(MessageHub.java:414)
	at org.gradle.internal.concurrent.ExecutorPolicy$CatchAndRecordFailures.onExecute(ExecutorPolicy.java:64)
	at org.gradle.internal.concurrent.ManagedExecutorImpl$1.run(ManagedExecutorImpl.java:48)
	at java.util.concurrent.ThreadPoolExecutor.runWorker(ThreadPoolExecutor.java:1149)
	at java.util.concurrent.ThreadPoolExecutor$Worker.run(ThreadPoolExecutor.java:624)
	at org.gradle.internal.concurrent.ThreadFactoryImpl$ManagedThreadRunnable.run(ThreadFactoryImpl.java:56)
	at java.lang.Thread.run(Thread.java:748)

> Task :src:protocol:jms:spotbugsMain
2 SpotBugs violations were found. See the report at: file://<https://ci-builds.apache.org/job/JMeter/job/JMeter-trunk/ws/src/protocol/jms/build/reports/spotbugs/main.xml>

org.gradle.api.GradleException: 2 SpotBugs violations were found. See the report at: file://<https://ci-builds.apache.org/job/JMeter/job/JMeter-trunk/ws/src/protocol/jms/build/reports/spotbugs/main.xml>
	at com.github.spotbugs.snom.internal.SpotBugsRunnerForWorker$SpotBugsExecutor.execute(SpotBugsRunnerForWorker.java:115)
	at org.gradle.workers.internal.DefaultWorkerServer.execute(DefaultWorkerServer.java:63)
	at org.gradle.workers.internal.AbstractClassLoaderWorker$1.create(AbstractClassLoaderWorker.java:49)
	at org.gradle.workers.internal.AbstractClassLoaderWorker$1.create(AbstractClassLoaderWorker.java:43)
	at org.gradle.internal.classloader.ClassLoaderUtils.executeInClassloader(ClassLoaderUtils.java:97)
	at org.gradle.workers.internal.AbstractClassLoaderWorker.executeInClassLoader(AbstractClassLoaderWorker.java:43)
	at org.gradle.workers.internal.IsolatedClassloaderWorker.run(IsolatedClassloaderWorker.java:49)
	at org.gradle.workers.internal.IsolatedClassloaderWorker.run(IsolatedClassloaderWorker.java:30)
	at org.gradle.workers.internal.WorkerDaemonServer.run(WorkerDaemonServer.java:85)
	at org.gradle.workers.internal.WorkerDaemonServer.run(WorkerDaemonServer.java:55)
	at org.gradle.process.internal.worker.request.WorkerAction$1.call(WorkerAction.java:138)
	at org.gradle.process.internal.worker.child.WorkerLogEventListener.withWorkerLoggingProtocol(WorkerLogEventListener.java:41)
	at org.gradle.process.internal.worker.request.WorkerAction.run(WorkerAction.java:135)
	at sun.reflect.NativeMethodAccessorImpl.invoke0(Native Method)
	at sun.reflect.NativeMethodAccessorImpl.invoke(NativeMethodAccessorImpl.java:62)
	at sun.reflect.DelegatingMethodAccessorImpl.invoke(DelegatingMethodAccessorImpl.java:43)
	at java.lang.reflect.Method.invoke(Method.java:498)
	at org.gradle.internal.dispatch.ReflectionDispatch.dispatch(ReflectionDispatch.java:36)
	at org.gradle.internal.dispatch.ReflectionDispatch.dispatch(ReflectionDispatch.java:24)
	at org.gradle.internal.remote.internal.hub.MessageHubBackedObjectConnection$DispatchWrapper.dispatch(MessageHubBackedObjectConnection.java:182)
	at org.gradle.internal.remote.internal.hub.MessageHubBackedObjectConnection$DispatchWrapper.dispatch(MessageHubBackedObjectConnection.java:164)
	at org.gradle.internal.remote.internal.hub.MessageHub$Handler.run(MessageHub.java:414)
	at org.gradle.internal.concurrent.ExecutorPolicy$CatchAndRecordFailures.onExecute(ExecutorPolicy.java:64)
	at org.gradle.internal.concurrent.ManagedExecutorImpl$1.run(ManagedExecutorImpl.java:48)
	at java.util.concurrent.ThreadPoolExecutor.runWorker(ThreadPoolExecutor.java:1149)
	at java.util.concurrent.ThreadPoolExecutor$Worker.run(ThreadPoolExecutor.java:624)
	at org.gradle.internal.concurrent.ThreadFactoryImpl$ManagedThreadRunnable.run(ThreadFactoryImpl.java:56)
	at java.lang.Thread.run(Thread.java:748)
checksum-dependency elapsed time: 10515ms, configurations processed: 218 (add -PchecksumTimingsPrint
to print detailed timings)

FAILURE: Build failed with an exception.

* What went wrong:
Execution failed for task ':src:components:checkstyleMain'.
> Checkstyle rule violations were found. See the report at: file://<https://ci-builds.apache.org/job/JMeter/job/JMeter-trunk/ws/src/components/build/reports/checkstyle/main.html>
  Checkstyle files with violations: 1
  Checkstyle violations by severity: [error:1]


* Try:
Run with --stacktrace option to get the stack trace. Run with --info or --debug option to
get more log output. Run with --scan to get full insights.

* Get more help at https://help.gradle.org

Deprecated Gradle features were used in this build, making it incompatible with Gradle 7.0.
Use '--warning-mode all' to show the individual deprecation warnings.
See https://docs.gradle.org/6.8.1/userguide/command_line_interface.html#sec:command_line_warnings

BUILD FAILED in 1m 12s
221 actionable tasks: 97 executed, 124 up-to-date

See the profiling report at: file://<https://ci-builds.apache.org/job/JMeter/job/JMeter-trunk/ws/build/reports/profile/profile-2021-04-24-10-25-42.html>
A fine-grained performance profile is available: use the --scan option.
Build step 'Invoke Gradle script' changed build result to FAILURE
Build step 'Invoke Gradle script' marked build as failure
Xvfb stopping
Archiving artifacts
[Fast Archiver] Compressed 15.67 MB of artifacts by 11.4% relative to #249
Recording test results
[Checks API] No suitable checks publisher found.

Mime
View raw message