jmeter-dev mailing list archives

Site index · List index
Message view « Date » · « Thread »
Top « Date » · « Thread »
From Apache Jenkins Server <jenk...@builds.apache.org>
Subject Build failed in Jenkins: JMeter » JMeter-trunk #294
Date Sun, 29 Aug 2021 15:29:14 GMT
See <https://ci-builds.apache.org/job/JMeter/job/JMeter-trunk/294/display/redirect?page=changes>

Changes:

[Felix Schumacher] Restart does not work when parameters contain spaces


------------------------------------------
[...truncated 366.40 KB...]
 at [Source: (String)"{'one': '1'}"; line: 1, column: 3])]
          0.0sec,    1 completed,   0 failed,   0 skipped, [index:19 => data({"one": ""},
jmespath=one, invert=USE_NO_INVERT, validation:USE_VALIDATION, regex:USE_NO_REXEG, nullability:EXPECT_NOT_NULL,
expected value:1, expected result type:FAILURE, expected failure message:Value expected to
be equal to 1)]
          0.0sec,    1 completed,   0 failed,   0 skipped, [index:20 => data({"":""}, jmespath=foo,
invert=USE_NO_INVERT, validation:USE_VALIDATION, regex:USE_NO_REXEG, nullability:EXPECT_NULL,
expected value:null, expected result type:SUCCESS, expected failure message:)]
          0.0sec,    1 completed,   0 failed,   0 skipped, [index:21 => data({"one": ""},
jmespath=one, invert=USE_NO_INVERT, validation:USE_NO_VALIDATION, regex:USE_NO_REXEG, nullability:EXPECT_NOT_NULL,
expected value:, expected result type:SUCCESS, expected failure message:)]
          0.0sec,    1 completed,   0 failed,   0 skipped, [index:22 => data({"one": ""},
jmespath=two, invert=USE_NO_INVERT, validation:USE_NO_VALIDATION, regex:USE_NO_REXEG, nullability:EXPECT_NOT_NULL,
expected value:, expected result type:FAILURE, expected failure message:JMESPATH two expected
to exist)]
          0.0sec,    1 completed,   0 failed,   0 skipped, [index:23 => data({"one": ""},
jmespath=one, invert=USE_INVERT, validation:USE_NO_VALIDATION, regex:USE_NO_REXEG, nullability:EXPECT_NOT_NULL,
expected value:, expected result type:FAILURE, expected failure message:JMESPATH one expected
not to exist)]
          0.0sec,    1 completed,   0 failed,   0 skipped, [index:24 => data({"one": ""},
jmespath=two, invert=USE_INVERT, validation:USE_NO_VALIDATION, regex:USE_NO_REXEG, nullability:EXPECT_NOT_NULL,
expected value:, expected result type:SUCCESS, expected failure message:)]
          0.0sec,    1 completed,   0 failed,   0 skipped, [index:25 => data(, jmespath=two,
invert=USE_NO_INVERT, validation:USE_NO_VALIDATION, regex:USE_NO_REXEG, nullability:EXPECT_NOT_NULL,
expected value:, expected result type:FAILURE, expected failure message:Response was null)]
          0.0sec,    1 completed,   0 failed,   0 skipped, [index:26 => data({
  "reservations": [
    {
      "instances": [
        {"state": "running"},
        {"state": "stopped"}
      ]
    },
    {
      "instances": [
        {"state": "terminated"},
        {"state": "running"}
      ]
    }
  ]
}, jmespath=reservations[*].instances[*].state, invert=USE_NO_INVERT, validation:USE_VALIDATION,
regex:USE_NO_REXEG, nullability:EXPECT_NOT_NULL, expected value:[["running","stopped"],["terminated","running"]],
expected result type:SUCCESS, expected failure message:)]
          0.0sec,    1 completed,   0 failed,   0 skipped, [index:27 => data({"x": {"a":
23, "b": 42, "c": "something"}}, jmespath=x, invert=USE_NO_INVERT, validation:USE_VALIDATION,
regex:USE_NO_REXEG, nullability:EXPECT_NOT_NULL, expected value:{
	"a": 23,
	"b": 42,
	"c": "something"
}, expected result type:SUCCESS, expected failure message:)]
          0.4sec,   28 completed,   0 failed,   0 skipped, org.apache.jmeter.assertions.jmespath.TestJMESPathAssertion$TestAssertion
          0.4sec,   28 completed,   0 failed,   0 skipped, org.apache.jmeter.assertions.jmespath.TestJMESPathAssertion
          0.0sec,    6 completed,   0 failed,   0 skipped, [0]
          0.0sec,    6 completed,   0 failed,   0 skipped, [1]
          0.1sec,   12 completed,   0 failed,   0 skipped, org.apache.jmeter.extractor.json.jmespath.TestJMESPathExtractor$SourceVarOrResponse
          0.0sec,    1 completed,   0 failed,   0 skipped, [0: Mode: ALL Path: a MatchNr:
1 Result: 23 Count: 2]
          0.0sec,    1 completed,   0 failed,   0 skipped, [1: Mode: ALL Path: a MatchNr:
2 Result: 42 Count: 2]
          0.0sec,    1 completed,   0 failed,   0 skipped, [2: Mode: ALL Path: b MatchNr:
0 Result: parent_only Count: 1]
          0.0sec,    1 completed,   0 failed,   0 skipped, [3: Mode: ALL Path: c MatchNr:
0 Result: child_only Count: 1]
          0.0sec,    1 completed,   0 failed,   0 skipped, [4: Mode: PARENT Path: a MatchNr:
1 Result: 23 Count: 1]
          0.0sec,    1 completed,   0 failed,   0 skipped, [5: Mode: PARENT Path: b MatchNr:
0 Result: parent_only Count: 1]
          0.0sec,    1 completed,   0 failed,   0 skipped, [6: Mode: PARENT Path: c MatchNr:
0 Result: NONE Count: 0]
          0.0sec,    1 completed,   0 failed,   0 skipped, [7: Mode: CHILDREN Path: a MatchNr:
1 Result: 42 Count: 1]
          0.0sec,    1 completed,   0 failed,   0 skipped, [8: Mode: CHILDREN Path: b MatchNr:
0 Result: NONE Count: 0]
          0.0sec,    1 completed,   0 failed,   0 skipped, [9: Mode: CHILDREN Path: c MatchNr:
0 Result: child_only Count: 1]
          0.1sec,   10 completed,   0 failed,   0 skipped, org.apache.jmeter.extractor.json.jmespath.TestJMESPathExtractor$ScopedSamples
          0.0sec,    2 completed,   0 failed,   0 skipped, [0]
          0.0sec,    2 completed,   0 failed,   0 skipped, [1]
          0.0sec,    2 completed,   0 failed,   0 skipped, [2]
          0.0sec,    2 completed,   0 failed,   0 skipped, [3]
          0.0sec,    2 completed,   0 failed,   0 skipped, [4]
          0.0sec,   10 completed,   0 failed,   0 skipped, org.apache.jmeter.extractor.json.jmespath.TestJMESPathExtractor$MatchNumberMoreThanZeroOn1ExtractedValue
          0.0sec,    2 completed,   0 failed,   0 skipped, [0]
          0.0sec,    2 completed,   0 failed,   0 skipped, [1]
          0.0sec,    2 completed,   0 failed,   0 skipped, [2]
          0.0sec,    6 completed,   0 failed,   0 skipped, org.apache.jmeter.extractor.json.jmespath.TestJMESPathExtractor$MultipleMatchesOnAllExtractedValues
          0.0sec,    2 completed,   0 failed,   0 skipped, [Extract from ["one"] with path
[*] should result in one for match 1]
          0.0sec,    2 completed,   0 failed,   0 skipped, [Extract from {"a": {"b": {"c":
{"d": "value"}}}} with path a.b.c.d should result in value for match 1]
          0.0sec,    2 completed,   0 failed,   0 skipped, [Extract from {
  "people": [
    {"first": "James", "last": "d"},
    {"first": "Jacob", "last": "e"},
    {"first": "Jayden", "last": "f"},
    {"missing": "different"}
  ],
  "foo": {"bar": "baz"}
} with path people[2] should result in {"first":"Jayden","last":"f"} for match 1]
          0.0sec,    6 completed,   0 failed,   0 skipped, org.apache.jmeter.extractor.json.jmespath.TestJMESPathExtractor$OneMatchOnAllExtractedValues
          0.0sec,    1 completed,   0 failed,   0 skipped, org.apache.jmeter.extractor.json.jmespath.TestJMESPathExtractor$NonParemeterizedTests
          0.2sec,   45 completed,   0 failed,   0 skipped, org.apache.jmeter.extractor.json.jmespath.TestJMESPathExtractor
          0.9sec,    7 completed,   0 failed,   0 skipped, org.apache.jmeter.visualizers.backend.graphite.PickleGraphiteMetricsSenderSpec
          0.1sec,    5 completed,   0 failed,   0 skipped, org.apache.jmeter.visualizers.backend.graphite.TextGraphiteMetricsSenderSpec
          0.2sec,    3 completed,   0 failed,   0 skipped, org.apache.jmeter.visualizers.backend.influxdb.InfluxdbBackendListenerClientSpec
          0.3sec,    6 completed,   0 failed,   0 skipped, org.apache.jmeter.visualizers.backend.influxdb.InfluxDBRawBackendListenerClientSpec
          0.7sec,    5 completed,   0 failed,   0 skipped, org.apache.jmeter.assertions.gui.AssertionGuiSpec
          0.2sec,    6 completed,   0 failed,   0 skipped, content '#content' with compareContent==#compareContent,
skip=#skip, elapsed=#elapsed and compareTime==#compareTime
          0.2sec,    7 completed,   0 failed,   0 skipped, org.apache.jmeter.assertions.CompareAssertionSpec
          0.0sec,    3 completed,   0 failed,   0 skipped, incorrect hash #allowedHex causes
result failure
          0.0sec,    2 completed,   0 failed,   0 skipped, example MD5s - '#sampleData' ==
'#hash'
          0.0sec,    7 completed,   0 failed,   0 skipped, org.apache.jmeter.assertions.MD5HexAssertionSpec
          0.1sec,    8 completed,   0 failed,   0 skipped, Extract, where pattern exists,
with matchNumber=#matchNumber from #occurrences returns #expected
          0.0sec,    5 completed,   0 failed,   0 skipped, Extract, where pattern does not
exist, with matchNumber=#matchNumber returns an empty list
          0.1sec,    9 completed,   0 failed,   0 skipped, Extract, where pattern exists in
the stream, with matchNumber=#matchNumber from #occurrences returns #expected
          0.0sec,    5 completed,   0 failed,   0 skipped, Extract, where pattern does not
exist in the stream, with matchNumber=#matchNumber returns an empty list
          0.0sec,    1 completed,   0 failed,   0 skipped, IllegalArgumentException when name
(#name) is null
          0.5sec,   43 completed,   0 failed,   0 skipped, org.apache.jmeter.extractor.BoundaryExtractorSpec
          0.0sec,    4 completed,   0 failed,   0 skipped, extract #expression and #attribute
          0.0sec,    4 completed,   0 failed,   0 skipped, org.apache.jmeter.extractor.JoddExtractorSpec
          0.1sec,    2 completed,   0 failed,   0 skipped, render '#input' as JSON Response
to '#output'
          0.1sec,    3 completed,   0 failed,   0 skipped, execute '#expression' on '#input'
results into '#output'
          0.8sec,   11 completed,   0 failed,   0 skipped, org.apache.jmeter.extractor.json.render.RenderAsJmesPathRendererSpec
          0.0sec,    2 completed,   0 failed,   0 skipped, render '#input' as JSON Response
to '#output'
          0.0sec,    3 completed,   0 failed,   0 skipped, execute '#expression' on '#input'
results into '#output'
          0.2sec,   11 completed,   0 failed,   0 skipped, org.apache.jmeter.extractor.json.render.RenderAsJsonRendererSpec
          0.0sec,    3 completed,   0 failed,   0 skipped, #delay <= computedDelay <=
trunc(#delay + abs(#range))
          0.0sec,    6 completed,   0 failed,   0 skipped, org.apache.jmeter.timers.UniformRandomTimerSpec
          0.2sec,    8 completed,   0 failed,   0 skipped, org.apache.jmeter.control.ThroughputControllerSpec
WARNING   0.1sec,    5 completed,   0 failed,   1 skipped, org.apache.jmeter.control.RunTimeSpec
          0.1sec,    4 completed,   0 failed,   0 skipped, org.apache.jmeter.control.RandomOrderControllerSpec
FAILURE  66.3sec,  535 completed,   1 failed,   2 skipped,
Gradle Test Run :src:components:test

535 tests completed, 1 failed, 2 skipped

> Task :src:components:test FAILED

> Task :src:dist-check:batchBug54685
Creating summariser <summary>
Created the tree successfully using <https://ci-builds.apache.org/job/JMeter/job/JMeter-trunk/ws/bin/testfiles/Bug54685.jmx>
Starting standalone test @ Sun Aug 29 15:27:21 UTC 2021 (1630250841926)
Waiting for possible Shutdown/StopTestNow/HeapDump/ThreadDump message on port 4445
summary =      1 in 00:00:00 =    4.6/s Avg:     6 Min:     6 Max:     6 Err:     0 (0.00%)
Tidying up ...    @ Sun Aug 29 15:27:23 UTC 2021 (1630250843556)
... end of run
No errors present in the logfile <https://ci-builds.apache.org/job/JMeter/job/JMeter-trunk/ws/bin/Bug54685.log>
(the file is empty)

> Task :src:components:spotbugsMain
31 SpotBugs violations were found. See the report at: file://<https://ci-builds.apache.org/job/JMeter/job/JMeter-trunk/ws/src/components/build/reports/spotbugs/main.xml>

org.gradle.api.GradleException: 31 SpotBugs violations were found. See the report at: file://<https://ci-builds.apache.org/job/JMeter/job/JMeter-trunk/ws/src/components/build/reports/spotbugs/main.xml>
	at com.github.spotbugs.snom.internal.SpotBugsRunnerForWorker$SpotBugsExecutor.execute(SpotBugsRunnerForWorker.java:115)
	at org.gradle.workers.internal.DefaultWorkerServer.execute(DefaultWorkerServer.java:63)
	at org.gradle.workers.internal.AbstractClassLoaderWorker$1.create(AbstractClassLoaderWorker.java:49)
	at org.gradle.workers.internal.AbstractClassLoaderWorker$1.create(AbstractClassLoaderWorker.java:43)
	at org.gradle.internal.classloader.ClassLoaderUtils.executeInClassloader(ClassLoaderUtils.java:97)
	at org.gradle.workers.internal.AbstractClassLoaderWorker.executeInClassLoader(AbstractClassLoaderWorker.java:43)
	at org.gradle.workers.internal.IsolatedClassloaderWorker.run(IsolatedClassloaderWorker.java:49)
	at org.gradle.workers.internal.IsolatedClassloaderWorker.run(IsolatedClassloaderWorker.java:30)
	at org.gradle.workers.internal.WorkerDaemonServer.run(WorkerDaemonServer.java:85)
	at org.gradle.workers.internal.WorkerDaemonServer.run(WorkerDaemonServer.java:55)
	at org.gradle.process.internal.worker.request.WorkerAction$1.call(WorkerAction.java:138)
	at org.gradle.process.internal.worker.child.WorkerLogEventListener.withWorkerLoggingProtocol(WorkerLogEventListener.java:41)
	at org.gradle.process.internal.worker.request.WorkerAction.run(WorkerAction.java:135)
	at sun.reflect.NativeMethodAccessorImpl.invoke0(Native Method)
	at sun.reflect.NativeMethodAccessorImpl.invoke(NativeMethodAccessorImpl.java:62)
	at sun.reflect.DelegatingMethodAccessorImpl.invoke(DelegatingMethodAccessorImpl.java:43)
	at java.lang.reflect.Method.invoke(Method.java:498)
	at org.gradle.internal.dispatch.ReflectionDispatch.dispatch(ReflectionDispatch.java:36)
	at org.gradle.internal.dispatch.ReflectionDispatch.dispatch(ReflectionDispatch.java:24)
	at org.gradle.internal.remote.internal.hub.MessageHubBackedObjectConnection$DispatchWrapper.dispatch(MessageHubBackedObjectConnection.java:182)
	at org.gradle.internal.remote.internal.hub.MessageHubBackedObjectConnection$DispatchWrapper.dispatch(MessageHubBackedObjectConnection.java:164)
	at org.gradle.internal.remote.internal.hub.MessageHub$Handler.run(MessageHub.java:414)
	at org.gradle.internal.concurrent.ExecutorPolicy$CatchAndRecordFailures.onExecute(ExecutorPolicy.java:64)
	at org.gradle.internal.concurrent.ManagedExecutorImpl$1.run(ManagedExecutorImpl.java:48)
	at java.util.concurrent.ThreadPoolExecutor.runWorker(ThreadPoolExecutor.java:1149)
	at java.util.concurrent.ThreadPoolExecutor$Worker.run(ThreadPoolExecutor.java:624)
	at org.gradle.internal.concurrent.ThreadFactoryImpl$ManagedThreadRunnable.run(ThreadFactoryImpl.java:56)
	at java.lang.Thread.run(Thread.java:748)

> Task :src:protocol:http:spotbugsMain
25 SpotBugs violations were found. See the report at: file://<https://ci-builds.apache.org/job/JMeter/job/JMeter-trunk/ws/src/protocol/http/build/reports/spotbugs/main.xml>

org.gradle.api.GradleException: 25 SpotBugs violations were found. See the report at: file://<https://ci-builds.apache.org/job/JMeter/job/JMeter-trunk/ws/src/protocol/http/build/reports/spotbugs/main.xml>
	at com.github.spotbugs.snom.internal.SpotBugsRunnerForWorker$SpotBugsExecutor.execute(SpotBugsRunnerForWorker.java:115)
	at org.gradle.workers.internal.DefaultWorkerServer.execute(DefaultWorkerServer.java:63)
	at org.gradle.workers.internal.AbstractClassLoaderWorker$1.create(AbstractClassLoaderWorker.java:49)
	at org.gradle.workers.internal.AbstractClassLoaderWorker$1.create(AbstractClassLoaderWorker.java:43)
	at org.gradle.internal.classloader.ClassLoaderUtils.executeInClassloader(ClassLoaderUtils.java:97)
	at org.gradle.workers.internal.AbstractClassLoaderWorker.executeInClassLoader(AbstractClassLoaderWorker.java:43)
	at org.gradle.workers.internal.IsolatedClassloaderWorker.run(IsolatedClassloaderWorker.java:49)
	at org.gradle.workers.internal.IsolatedClassloaderWorker.run(IsolatedClassloaderWorker.java:30)
	at org.gradle.workers.internal.WorkerDaemonServer.run(WorkerDaemonServer.java:85)
	at org.gradle.workers.internal.WorkerDaemonServer.run(WorkerDaemonServer.java:55)
	at org.gradle.process.internal.worker.request.WorkerAction$1.call(WorkerAction.java:138)
	at org.gradle.process.internal.worker.child.WorkerLogEventListener.withWorkerLoggingProtocol(WorkerLogEventListener.java:41)
	at org.gradle.process.internal.worker.request.WorkerAction.run(WorkerAction.java:135)
	at sun.reflect.NativeMethodAccessorImpl.invoke0(Native Method)
	at sun.reflect.NativeMethodAccessorImpl.invoke(NativeMethodAccessorImpl.java:62)
	at sun.reflect.DelegatingMethodAccessorImpl.invoke(DelegatingMethodAccessorImpl.java:43)
	at java.lang.reflect.Method.invoke(Method.java:498)
	at org.gradle.internal.dispatch.ReflectionDispatch.dispatch(ReflectionDispatch.java:36)
	at org.gradle.internal.dispatch.ReflectionDispatch.dispatch(ReflectionDispatch.java:24)
	at org.gradle.internal.remote.internal.hub.MessageHubBackedObjectConnection$DispatchWrapper.dispatch(MessageHubBackedObjectConnection.java:182)
	at org.gradle.internal.remote.internal.hub.MessageHubBackedObjectConnection$DispatchWrapper.dispatch(MessageHubBackedObjectConnection.java:164)
	at org.gradle.internal.remote.internal.hub.MessageHub$Handler.run(MessageHub.java:414)
	at org.gradle.internal.concurrent.ExecutorPolicy$CatchAndRecordFailures.onExecute(ExecutorPolicy.java:64)
	at org.gradle.internal.concurrent.ManagedExecutorImpl$1.run(ManagedExecutorImpl.java:48)
	at java.util.concurrent.ThreadPoolExecutor.runWorker(ThreadPoolExecutor.java:1149)
	at java.util.concurrent.ThreadPoolExecutor$Worker.run(ThreadPoolExecutor.java:624)
	at org.gradle.internal.concurrent.ThreadFactoryImpl$ManagedThreadRunnable.run(ThreadFactoryImpl.java:56)
	at java.lang.Thread.run(Thread.java:748)

> Task :src:core:spotbugsMain
The following classes needed for analysis were missing:
  com.github.weisj.swingdsl.visualpadding.VisualPaddingProvider
37 SpotBugs violations were found. See the report at: file://<https://ci-builds.apache.org/job/JMeter/job/JMeter-trunk/ws/src/core/build/reports/spotbugs/main.xml>

org.gradle.api.GradleException: 37 SpotBugs violations were found. See the report at: file://<https://ci-builds.apache.org/job/JMeter/job/JMeter-trunk/ws/src/core/build/reports/spotbugs/main.xml>
	at com.github.spotbugs.snom.internal.SpotBugsRunnerForWorker$SpotBugsExecutor.execute(SpotBugsRunnerForWorker.java:115)
	at org.gradle.workers.internal.DefaultWorkerServer.execute(DefaultWorkerServer.java:63)
	at org.gradle.workers.internal.AbstractClassLoaderWorker$1.create(AbstractClassLoaderWorker.java:49)
	at org.gradle.workers.internal.AbstractClassLoaderWorker$1.create(AbstractClassLoaderWorker.java:43)
	at org.gradle.internal.classloader.ClassLoaderUtils.executeInClassloader(ClassLoaderUtils.java:97)
	at org.gradle.workers.internal.AbstractClassLoaderWorker.executeInClassLoader(AbstractClassLoaderWorker.java:43)
	at org.gradle.workers.internal.IsolatedClassloaderWorker.run(IsolatedClassloaderWorker.java:49)
	at org.gradle.workers.internal.IsolatedClassloaderWorker.run(IsolatedClassloaderWorker.java:30)
	at org.gradle.workers.internal.WorkerDaemonServer.run(WorkerDaemonServer.java:85)
	at org.gradle.workers.internal.WorkerDaemonServer.run(WorkerDaemonServer.java:55)
	at org.gradle.process.internal.worker.request.WorkerAction$1.call(WorkerAction.java:138)
	at org.gradle.process.internal.worker.child.WorkerLogEventListener.withWorkerLoggingProtocol(WorkerLogEventListener.java:41)
	at org.gradle.process.internal.worker.request.WorkerAction.run(WorkerAction.java:135)
	at sun.reflect.NativeMethodAccessorImpl.invoke0(Native Method)
	at sun.reflect.NativeMethodAccessorImpl.invoke(NativeMethodAccessorImpl.java:62)
	at sun.reflect.DelegatingMethodAccessorImpl.invoke(DelegatingMethodAccessorImpl.java:43)
	at java.lang.reflect.Method.invoke(Method.java:498)
	at org.gradle.internal.dispatch.ReflectionDispatch.dispatch(ReflectionDispatch.java:36)
	at org.gradle.internal.dispatch.ReflectionDispatch.dispatch(ReflectionDispatch.java:24)
	at org.gradle.internal.remote.internal.hub.MessageHubBackedObjectConnection$DispatchWrapper.dispatch(MessageHubBackedObjectConnection.java:182)
	at org.gradle.internal.remote.internal.hub.MessageHubBackedObjectConnection$DispatchWrapper.dispatch(MessageHubBackedObjectConnection.java:164)
	at org.gradle.internal.remote.internal.hub.MessageHub$Handler.run(MessageHub.java:414)
	at org.gradle.internal.concurrent.ExecutorPolicy$CatchAndRecordFailures.onExecute(ExecutorPolicy.java:64)
	at org.gradle.internal.concurrent.ManagedExecutorImpl$1.run(ManagedExecutorImpl.java:48)
	at java.util.concurrent.ThreadPoolExecutor.runWorker(ThreadPoolExecutor.java:1149)
	at java.util.concurrent.ThreadPoolExecutor$Worker.run(ThreadPoolExecutor.java:624)
	at org.gradle.internal.concurrent.ThreadFactoryImpl$ManagedThreadRunnable.run(ThreadFactoryImpl.java:56)
	at java.lang.Thread.run(Thread.java:748)

> Task :src:dist:javadocAggregate
9 warnings
checksum-dependency elapsed time: 14241ms, configurations processed: 352 (add -PchecksumTimingsPrint
to print detailed timings)

FAILURE: Build failed with an exception.

* What went wrong:
Execution failed for task ':src:components:test'.
> There were failing tests. See the report at: file://<https://ci-builds.apache.org/job/JMeter/job/JMeter-trunk/ws/src/components/build/reports/tests/test/index.html>

* Try:
Run with --stacktrace option to get the stack trace. Run with --info or --debug option to
get more log output. Run with --scan to get full insights.

* Get more help at https://help.gradle.org

Deprecated Gradle features were used in this build, making it incompatible with Gradle 8.0.
Use '--warning-mode all' to show the individual deprecation warnings.
See https://docs.gradle.org/7.0.2/userguide/command_line_interface.html#sec:command_line_warnings

Execution optimizations have been disabled for 6 invalid unit(s) of work during this build
to ensure correctness.
Please consult deprecation warnings for more details.

BUILD FAILED in 4m 20s
323 actionable tasks: 162 executed, 161 up-to-date

See the profiling report at: file://<https://ci-builds.apache.org/job/JMeter/job/JMeter-trunk/ws/build/reports/profile/profile-2021-08-29-15-24-45.html>
A fine-grained performance profile is available: use the --scan option.
Build step 'Invoke Gradle script' changed build result to FAILURE
Build step 'Invoke Gradle script' marked build as failure
Xvfb stopping
Archiving artifacts
[Fast Archiver] Compressed 33.61 MB of artifacts by 58.4% relative to #293
Recording test results
[Checks API] No suitable checks publisher found.

Mime
View raw message