johnzon-dev mailing list archives

Site index · List index
Message view « Date » · « Thread »
Top « Date » · « Thread »
From "Markus Karg (Jira)" <j...@apache.org>
Subject [jira] [Commented] (JOHNZON-272) Fails to build Johnzon :: Maven Plugin
Date Mon, 23 Sep 2019 14:44:00 GMT

    [ https://issues.apache.org/jira/browse/JOHNZON-272?page=com.atlassian.jira.plugin.system.issuetabpanels:comment-tabpanel&focusedCommentId=16935917#comment-16935917
] 

Markus Karg commented on JOHNZON-272:
-------------------------------------

[~romain.manni-bucau] sorry for the long delay. This is on my stack for weeks. No, the EOL
is not the cause, so the "replace" didn't fix it. Actually the difference is the last closing
bracking:

*Expected String (the last closing bracket is missing _in the expectation_):*
{{...}}
{{  public static class SecondaryMetrics {}}
{{  }}}
{{]}}
*Actual String (the last closing brack is _actually existing_):*

{{...}}
{{  public static class SecondaryMetrics {}}
{{  }}}
{{{color:#00875a}}{color}]}}

> Fails to build Johnzon :: Maven Plugin
> --------------------------------------
>
>                 Key: JOHNZON-272
>                 URL: https://issues.apache.org/jira/browse/JOHNZON-272
>             Project: Johnzon
>          Issue Type: Bug
>    Affects Versions: 1.2.0
>         Environment: {{$ mvn -version}}
> {{Apache Maven 3.6.1 }}(d66c9c0b3152b2e69ee9bac180bb8fcc8e6af555; 2019-04-04T21:00:29+02:00)
> {{Maven home: C:\Program Files\apache-maven-3.6.1}}
> {{Java version: 1.8.0_181, vendor: Azul Systems, Inc., runtime: C:\Program Files\zulu8.31.0.1-jdk8.0.181-win_x64\jre}}
> {{Default locale: de_DE, platform encoding: Cp1252}}
> {{OS name: "windows 7", version: "6.1", arch: "amd64", family: "windows"}}
>            Reporter: Markus Karg
>            Priority: Blocker
>
> {{$ git clone https://github.com/apache/johnzon.git}}
> {{$ cd johnzon}}
>  
> {{$mvn clean install}}
> {{...}}
> {{[INFO] Running org.apache.johnzon.maven.plugin.ExampleToModelMojoTest}}
> {{[ERROR] Tests run: 1, Failures: 1, Errors: 0, Skipped: 0, Time elapsed: 0.172 s <<<
FAILURE! - in org.apache.johnzon.maven.plugin.ExampleToModelMojoTest}}
> {{[ERROR] generate(org.apache.johnzon.maven.plugin.ExampleToModelMojoTest) Time elapsed:
0.125 s <<< FAILURE!}}
> {{org.junit.ComparisonFailure:}}
> {{expected:</*[}}
> {{ * Licensed to the Apache Software Foundation (ASF) under one}}
> {{...}}
>  
>  



--
This message was sent by Atlassian Jira
(v8.3.4#803005)

Mime
View raw message