juddi-dev mailing list archives

Site index · List index
Message view « Date » · « Thread »
Top « Date » · « Thread »
From "Alex O'Ree (JIRA)" <juddi-...@ws.apache.org>
Subject [jira] [Commented] (JUDDI-640) Build fails randomly in juddi-openjpa/SubscriptionNotifierTest
Date Sun, 25 Aug 2013 13:04:52 GMT

    [ https://issues.apache.org/jira/browse/JUDDI-640?page=com.atlassian.jira.plugin.system.issuetabpanels:comment-tabpanel&focusedCommentId=13749625#comment-13749625
] 

Alex O'Ree commented on JUDDI-640:
----------------------------------

Correction, sometimes fails on core and on openjpa core. same test.

Running org.apache.juddi.subscription.notify.NotifierTest
Aug 25, 2013 8:58:47 AM org.apache.juddi.subscription.notify.SMTPNotifier getEMailProperties
INFO: Path=C:\juddi\trunkcur\juddi-core/uddi-tck/target/juddi-tomcat-3.2.0-SNAPSHOT/temp/
Tests run: 4, Failures: 0, Errors: 0, Skipped: 0, Time elapsed: 1.444 sec
Running org.apache.juddi.subscription.SubscriptionNotifierTest
Aug 25, 2013 8:58:48 AM org.apache.juddi.subscription.SubscriptionNotifierTest DumpAllBusinesses
WARNING: UDDI Custody and Ownership Transfer Service uddi:juddi.apache.org:services-custodytransfer
uddi:juddi.apache.or
g:businesses-asf
Aug 25, 2013 8:58:48 AM org.apache.juddi.subscription.SubscriptionNotifierTest DumpAllBusinesses
WARNING: UDDI Inquiry Service uddi:juddi.apache.org:services-inquiry uddi:juddi.apache.org:businesses-asf
Aug 25, 2013 8:58:48 AM org.apache.juddi.subscription.SubscriptionNotifierTest DumpAllBusinesses
WARNING: UDDI Publish Service uddi:juddi.apache.org:services-publish uddi:juddi.apache.org:businesses-asf
Aug 25, 2013 8:58:48 AM org.apache.juddi.subscription.SubscriptionNotifierTest DumpAllBusinesses
WARNING: UDDI Security Service uddi:juddi.apache.org:services-security uddi:juddi.apache.org:businesses-asf
Aug 25, 2013 8:58:48 AM org.apache.juddi.subscription.SubscriptionNotifierTest DumpAllBusinesses
WARNING: UDDI Subscription Listener Service uddi:juddi.apache.org:services-subscriptionlistener
uddi:juddi.apache.org:bu
sinesses-asf
Aug 25, 2013 8:58:48 AM org.apache.juddi.subscription.SubscriptionNotifierTest DumpAllBusinesses
WARNING: UDDI Subscription Service uddi:juddi.apache.org:services-subscription uddi:juddi.apache.org:businesses-asf
Aug 25, 2013 8:58:48 AM org.apache.juddi.subscription.SubscriptionNotifierTest DumpAllBusinesses
WARNING: jUDDI Publisher Service uddi:juddi.apache.org:services-publisher uddi:juddi.apache.org:businesses-asf
Aug 25, 2013 8:58:51 AM org.apache.juddi.subscription.SubscriptionNotifier notify
INFO: There is no valid binding template defined for this subscription: uddi:uddi.joepublisher.com:bindingone
Aug 25, 2013 8:58:51 AM org.apache.juddi.subscription.SubscriptionNotifierTest DumpAllBusinesses
WARNING: UDDI Custody and Ownership Transfer Service uddi:juddi.apache.org:services-custodytransfer
uddi:juddi.apache.or
g:businesses-asf
Aug 25, 2013 8:58:51 AM org.apache.juddi.subscription.SubscriptionNotifierTest DumpAllBusinesses
WARNING: UDDI Inquiry Service uddi:juddi.apache.org:services-inquiry uddi:juddi.apache.org:businesses-asf
Aug 25, 2013 8:58:51 AM org.apache.juddi.subscription.SubscriptionNotifierTest DumpAllBusinesses
WARNING: UDDI Publish Service uddi:juddi.apache.org:services-publish uddi:juddi.apache.org:businesses-asf
Aug 25, 2013 8:58:51 AM org.apache.juddi.subscription.SubscriptionNotifierTest DumpAllBusinesses
WARNING: UDDI Security Service uddi:juddi.apache.org:services-security uddi:juddi.apache.org:businesses-asf
Aug 25, 2013 8:58:51 AM org.apache.juddi.subscription.SubscriptionNotifierTest DumpAllBusinesses
WARNING: UDDI Subscription Listener Service uddi:juddi.apache.org:services-subscriptionlistener
uddi:juddi.apache.org:bu
sinesses-asf
Aug 25, 2013 8:58:51 AM org.apache.juddi.subscription.SubscriptionNotifierTest DumpAllBusinesses
WARNING: UDDI Subscription Service uddi:juddi.apache.org:services-subscription uddi:juddi.apache.org:businesses-asf
Aug 25, 2013 8:58:51 AM org.apache.juddi.subscription.SubscriptionNotifierTest DumpAllBusinesses
WARNING: jUDDI Publisher Service uddi:juddi.apache.org:services-publisher uddi:juddi.apache.org:businesses-asf
Aug 25, 2013 8:58:51 AM org.apache.juddi.subscription.SubscriptionNotifierTest testGetSubscriptionResults
SEVERE: testGetSubscriptionResults, getSubscriptionResults unexpectedly null
Aug 25, 2013 8:58:51 AM org.apache.juddi.subscription.SubscriptionNotifierTest teardown
INFO: Calling teardown
Aug 25, 2013 8:58:51 AM org.apache.juddi.subscription.SubscriptionNotifierTest DumpAllBusinesses
WARNING: UDDI Custody and Ownership Transfer Service uddi:juddi.apache.org:services-custodytransfer
uddi:juddi.apache.or
g:businesses-asf
Aug 25, 2013 8:58:51 AM org.apache.juddi.subscription.SubscriptionNotifierTest DumpAllBusinesses
WARNING: UDDI Inquiry Service uddi:juddi.apache.org:services-inquiry uddi:juddi.apache.org:businesses-asf
Aug 25, 2013 8:58:51 AM org.apache.juddi.subscription.SubscriptionNotifierTest DumpAllBusinesses
WARNING: UDDI Publish Service uddi:juddi.apache.org:services-publish uddi:juddi.apache.org:businesses-asf
Aug 25, 2013 8:58:51 AM org.apache.juddi.subscription.SubscriptionNotifierTest DumpAllBusinesses
WARNING: UDDI Security Service uddi:juddi.apache.org:services-security uddi:juddi.apache.org:businesses-asf
Aug 25, 2013 8:58:51 AM org.apache.juddi.subscription.SubscriptionNotifierTest DumpAllBusinesses
WARNING: UDDI Subscription Listener Service uddi:juddi.apache.org:services-subscriptionlistener
uddi:juddi.apache.org:bu
sinesses-asf
Aug 25, 2013 8:58:51 AM org.apache.juddi.subscription.SubscriptionNotifierTest DumpAllBusinesses
WARNING: UDDI Subscription Service uddi:juddi.apache.org:services-subscription uddi:juddi.apache.org:businesses-asf
Aug 25, 2013 8:58:51 AM org.apache.juddi.subscription.SubscriptionNotifierTest DumpAllBusinesses
WARNING: jUDDI Publisher Service uddi:juddi.apache.org:services-publisher uddi:juddi.apache.org:businesses-asf
Aug 25, 2013 8:58:51 AM org.apache.juddi.v3.tck.TckBusinessService deleteService
SEVERE: The business service was not found for the given key:  uddi:uddi.joepublisher.com:serviceone
org.apache.juddi.v3.error.InvalidKeyPassedException: The business service was not found for
the given key:  uddi:uddi.jo
epublisher.com:serviceone
        at org.apache.juddi.validation.ValidatePublish.validateDeleteService(ValidatePublish.java:174)
        at org.apache.juddi.api.impl.UDDIPublicationImpl.deleteService(UDDIPublicationImpl.java:291)
        at org.apache.juddi.v3.tck.TckBusinessService.deleteService(TckBusinessService.java:228)
        at org.apache.juddi.v3.tck.TckBusinessService.deleteJoePublisherService(TckBusinessService.java:85)
        at org.apache.juddi.subscription.SubscriptionNotifierTest.teardown(SubscriptionNotifierTest.java:182)
        at sun.reflect.NativeMethodAccessorImpl.invoke0(Native Method)
        at sun.reflect.NativeMethodAccessorImpl.invoke(NativeMethodAccessorImpl.java:57)
        at sun.reflect.DelegatingMethodAccessorImpl.invoke(DelegatingMethodAccessorImpl.java:43)
        at java.lang.reflect.Method.invoke(Method.java:606)
        at org.junit.runners.model.FrameworkMethod$1.runReflectiveCall(FrameworkMethod.java:44)
        at org.junit.internal.runners.model.ReflectiveCallable.run(ReflectiveCallable.java:15)
        at org.junit.runners.model.FrameworkMethod.invokeExplosively(FrameworkMethod.java:41)
        at org.junit.internal.runners.statements.RunAfters.evaluate(RunAfters.java:37)
        at org.junit.runners.ParentRunner.run(ParentRunner.java:220)
        at org.apache.maven.surefire.junit4.JUnit4Provider.execute(JUnit4Provider.java:252)
        at org.apache.maven.surefire.junit4.JUnit4Provider.executeTestSet(JUnit4Provider.java:141)
        at org.apache.maven.surefire.junit4.JUnit4Provider.invoke(JUnit4Provider.java:112)
        at sun.reflect.NativeMethodAccessorImpl.invoke0(Native Method)
        at sun.reflect.NativeMethodAccessorImpl.invoke(NativeMethodAccessorImpl.java:57)
        at sun.reflect.DelegatingMethodAccessorImpl.invoke(DelegatingMethodAccessorImpl.java:43)
        at java.lang.reflect.Method.invoke(Method.java:606)
        at org.apache.maven.surefire.util.ReflectionUtils.invokeMethodWithArray(ReflectionUtils.java:189)
        at org.apache.maven.surefire.booter.ProviderFactory$ProviderProxy.invoke(ProviderFactory.java:165)
        at org.apache.maven.surefire.booter.ProviderFactory.invokeProvider(ProviderFactory.java:85)
        at org.apache.maven.surefire.booter.ForkedBooter.runSuitesInProcess(ForkedBooter.java:115)
        at org.apache.maven.surefire.booter.ForkedBooter.main(ForkedBooter.java:75)

Tests run: 2, Failures: 1, Errors: 0, Skipped: 0, Time elapsed: 2.917 sec <<< FAILURE!
org.apache.juddi.subscription.SubscriptionNotifierTest  Time elapsed: 0.052 sec  <<<
FAILURE!
java.lang.AssertionError: No exception should be thrown.
        at org.junit.Assert.fail(Assert.java:91)
        at org.apache.juddi.v3.tck.TckBusinessService.deleteService(TckBusinessService.java:232)
        at org.apache.juddi.v3.tck.TckBusinessService.deleteJoePublisherService(TckBusinessService.java:85)
        at org.apache.juddi.subscription.SubscriptionNotifierTest.teardown(SubscriptionNotifierTest.java:182)
        at sun.reflect.NativeMethodAccessorImpl.invoke0(Native Method)
        at sun.reflect.NativeMethodAccessorImpl.invoke(NativeMethodAccessorImpl.java:57)
        at sun.reflect.DelegatingMethodAccessorImpl.invoke(DelegatingMethodAccessorImpl.java:43)
        at java.lang.reflect.Method.invoke(Method.java:606)
        at org.junit.runners.model.FrameworkMethod$1.runReflectiveCall(FrameworkMethod.java:44)
        at org.junit.internal.runners.model.ReflectiveCallable.run(ReflectiveCallable.java:15)
        at org.junit.runners.model.FrameworkMethod.invokeExplosively(FrameworkMethod.java:41)
        at org.junit.internal.runners.statements.RunAfters.evaluate(RunAfters.java:37)
        at org.junit.runners.ParentRunner.run(ParentRunner.java:220)
        at org.apache.maven.surefire.junit4.JUnit4Provider.execute(JUnit4Provider.java:252)
        at org.apache.maven.surefire.junit4.JUnit4Provider.executeTestSet(JUnit4Provider.java:141)
        at org.apache.maven.surefire.junit4.JUnit4Provider.invoke(JUnit4Provider.java:112)
        at sun.reflect.NativeMethodAccessorImpl.invoke0(Native Method)
        at sun.reflect.NativeMethodAccessorImpl.invoke(NativeMethodAccessorImpl.java:57)
        at sun.reflect.DelegatingMethodAccessorImpl.invoke(DelegatingMethodAccessorImpl.java:43)
        at java.lang.reflect.Method.invoke(Method.java:606)
        at org.apache.maven.surefire.util.ReflectionUtils.invokeMethodWithArray(ReflectionUtils.java:189)
        at org.apache.maven.surefire.booter.ProviderFactory$ProviderProxy.invoke(ProviderFactory.java:165)
        at org.apache.maven.surefire.booter.ProviderFactory.invokeProvider(ProviderFactory.java:85)
        at org.apache.maven.surefire.booter.ForkedBooter.runSuitesInProcess(ForkedBooter.java:115)
        at org.apache.maven.surefire.booter.ForkedBooter.main(ForkedBooter.java:75)


Results :

Failed tests:   org.apache.juddi.subscription.SubscriptionNotifierTest: No exception should
be thrown.

Tests run: 141, Failures: 1, Errors: 0, Skipped: 0
                
> Build fails randomly in juddi-openjpa/SubscriptionNotifierTest
> --------------------------------------------------------------
>
>                 Key: JUDDI-640
>                 URL: https://issues.apache.org/jira/browse/JUDDI-640
>             Project: jUDDI
>          Issue Type: Bug
>          Components: core
>    Affects Versions: 3.1.5
>         Environment: windows 7
>            Reporter: Alex O'Ree
>            Assignee: Kurt T Stam
>
> INFO: There is no valid binding template defined for this subscription: uddi:uddi.joepublisher.com:bindingone
> SEVERE: The business service was not found for the given key:  uddi:uddi.joepublisher.com:serviceone
> org.apache.juddi.v3.error.InvalidKeyPassedException: The business service was not found
for the given key:  uddi:uddi.jo
> epublisher.com:serviceone
>         at org.apache.juddi.validation.ValidatePublish.validateDeleteService(ValidatePublish.java:174)
>         at org.apache.juddi.api.impl.UDDIPublicationImpl.deleteService(UDDIPublicationImpl.java:291)
>         at org.apache.juddi.v3.tck.TckBusinessService.deleteService(TckBusinessService.java:228)
>         at org.apache.juddi.v3.tck.TckBusinessService.deleteJoePublisherService(TckBusinessService.java:85)
>         at org.apache.juddi.subscription.SubscriptionNotifierTest.teardown(SubscriptionNotifierTest.java:173)
>         at sun.reflect.NativeMethodAccessorImpl.invoke0(Native Method)
>         at sun.reflect.NativeMethodAccessorImpl.invoke(NativeMethodAccessorImpl.java:57)
>         at sun.reflect.DelegatingMethodAccessorImpl.invoke(DelegatingMethodAccessorImpl.java:43)
>         at java.lang.reflect.Method.invoke(Method.java:606)
>         at org.junit.runners.model.FrameworkMethod$1.runReflectiveCall(FrameworkMethod.java:44)
>         at org.junit.internal.runners.model.ReflectiveCallable.run(ReflectiveCallable.java:15)
>         at org.junit.runners.model.FrameworkMethod.invokeExplosively(FrameworkMethod.java:41)
>         at org.junit.internal.runners.statements.RunAfters.evaluate(RunAfters.java:37)
>         at org.junit.runners.ParentRunner.run(ParentRunner.java:220)
>         at org.apache.maven.surefire.junit4.JUnit4Provider.execute(JUnit4Provider.java:252)
>         at org.apache.maven.surefire.junit4.JUnit4Provider.executeTestSet(JUnit4Provider.java:141)
>         at org.apache.maven.surefire.junit4.JUnit4Provider.invoke(JUnit4Provider.java:112)
>         at sun.reflect.NativeMethodAccessorImpl.invoke0(Native Method)
>         at sun.reflect.NativeMethodAccessorImpl.invoke(NativeMethodAccessorImpl.java:57)
>         at sun.reflect.DelegatingMethodAccessorImpl.invoke(DelegatingMethodAccessorImpl.java:43)
>         at java.lang.reflect.Method.invoke(Method.java:606)
>         at org.apache.maven.surefire.util.ReflectionUtils.invokeMethodWithArray(ReflectionUtils.java:189)
>         at org.apache.maven.surefire.booter.ProviderFactory$ProviderProxy.invoke(ProviderFactory.java:165)
>         at org.apache.maven.surefire.booter.ProviderFactory.invokeProvider(ProviderFactory.java:85)
>         at org.apache.maven.surefire.booter.ForkedBooter.runSuitesInProcess(ForkedBooter.java:115)
>         at org.apache.maven.surefire.booter.ForkedBooter.main(ForkedBooter.java:75)

--
This message is automatically generated by JIRA.
If you think it was sent incorrectly, please contact your JIRA administrators
For more information on JIRA, see: http://www.atlassian.com/software/jira

Mime
View raw message